animation{
  name = "walking",
  src_image = "enemies/cannonball.png",
  directions = {
    { x = 32, y = 0, frame_width = 16, frame_height = 16, origin_x = 8, origin_y = 13 },
    { x = 32, y = 0, frame_width = 16, frame_height = 16, origin_x = 8, origin_y = 13 },
    { x = 32, y = 0, frame_width = 16, frame_height = 16, origin_x = 8, origin_y = 13 },
    { x = 32, y = 0, frame_width = 16, frame_height = 16, origin_x = 8, origin_y = 13 },
  },
}

