properties{
  x = 0,
  y = 0,
  width = 320,
  height = 240,
  world = "inside_world",
  floor = -3,
  min_layer = 0,
  max_layer = 2,
  tileset = "7",
  music = "same",
}

tile{
  layer = 0,
  x = 64,
  y = 64,
  width = 192,
  height = 112,
  pattern = 319,
}

tile{
  layer = 0,
  x = 16,
  y = 200,
  width = 24,
  height = 24,
  pattern = 47,
}

tile{
  layer = 0,
  x = 16,
  y = 16,
  width = 24,
  height = 24,
  pattern = 45,
}

tile{
  layer = 0,
  x = 280,
  y = 16,
  width = 24,
  height = 24,
  pattern = 46,
}

tile{
  layer = 0,
  x = 280,
  y = 200,
  width = 24,
  height = 24,
  pattern = 48,
}

tile{
  layer = 0,
  x = 40,
  y = 16,
  width = 240,
  height = 24,
  pattern = 49,
}

tile{
  layer = 0,
  x = 16,
  y = 40,
  width = 24,
  height = 160,
  pattern = 51,
}

tile{
  layer = 0,
  x = 280,
  y = 40,
  width = 24,
  height = 160,
  pattern = 50,
}

tile{
  layer = 0,
  x = 40,
  y = 200,
  width = 240,
  height = 24,
  pattern = 52,
}

tile{
  layer = 0,
  x = 40,
  y = 40,
  width = 24,
  height = 24,
  pattern = 57,
}

tile{
  layer = 0,
  x = 256,
  y = 40,
  width = 24,
  height = 24,
  pattern = 58,
}

tile{
  layer = 0,
  x = 64,
  y = 40,
  width = 192,
  height = 24,
  pattern = 232,
}

tile{
  layer = 0,
  x = 256,
  y = 176,
  width = 24,
  height = 24,
  pattern = 60,
}

tile{
  layer = 0,
  x = 40,
  y = 176,
  width = 24,
  height = 24,
  pattern = 59,
}

tile{
  layer = 0,
  x = 40,
  y = 64,
  width = 24,
  height = 112,
  pattern = 235,
}

tile{
  layer = 0,
  x = 64,
  y = 176,
  width = 192,
  height = 24,
  pattern = 234,
}

tile{
  layer = 0,
  x = 256,
  y = 64,
  width = 24,
  height = 112,
  pattern = 233,
}

tile{
  layer = 0,
  x = 64,
  y = 64,
  width = 16,
  height = 16,
  pattern = 255,
}

tile{
  layer = 0,
  x = 240,
  y = 64,
  width = 16,
  height = 16,
  pattern = 256,
}

tile{
  layer = 0,
  x = 64,
  y = 160,
  width = 16,
  height = 16,
  pattern = 258,
}

tile{
  layer = 0,
  x = 240,
  y = 160,
  width = 16,
  height = 16,
  pattern = 257,
}

tile{
  layer = 0,
  x = 64,
  y = 80,
  width = 16,
  height = 80,
  pattern = 260,
}

tile{
  layer = 0,
  x = 80,
  y = 160,
  width = 160,
  height = 16,
  pattern = 262,
}

tile{
  layer = 0,
  x = 80,
  y = 64,
  width = 160,
  height = 16,
  pattern = 259,
}

tile{
  layer = 0,
  x = 240,
  y = 80,
  width = 16,
  height = 80,
  pattern = 261,
}

tile{
  layer = 0,
  x = 280,
  y = 104,
  width = 16,
  height = 32,
  pattern = 338,
}

tile{
  layer = 0,
  x = 24,
  y = 104,
  width = 16,
  height = 32,
  pattern = 340,
}

tile{
  layer = 0,
  x = 88,
  y = 200,
  width = 32,
  height = 16,
  pattern = 339,
}

tile{
  layer = 0,
  x = 200,
  y = 200,
  width = 32,
  height = 16,
  pattern = 339,
}

teletransporter{
  layer = 0,
  x = 64,
  y = 64,
  width = 192,
  height = 112,
  name = "teletransporter",
  transition = "fade",
  destination_map = "47",
  destination = "_same",
}

tile{
  layer = 1,
  x = 72,
  y = 16,
  width = 32,
  height = 24,
  pattern = 345,
}

tile{
  layer = 1,
  x = 120,
  y = 16,
  width = 32,
  height = 24,
  pattern = 345,
}

tile{
  layer = 1,
  x = 168,
  y = 24,
  width = 32,
  height = 16,
  pattern = 337,
}

tile{
  layer = 1,
  x = 216,
  y = 24,
  width = 32,
  height = 16,
  pattern = 337,
}

tile{
  layer = 2,
  x = 0,
  y = 0,
  width = 16,
  height = 240,
  pattern = 170,
}

tile{
  layer = 2,
  x = 16,
  y = 0,
  width = 304,
  height = 16,
  pattern = 170,
}

tile{
  layer = 2,
  x = 304,
  y = 16,
  width = 16,
  height = 224,
  pattern = 170,
}

tile{
  layer = 2,
  x = 16,
  y = 224,
  width = 288,
  height = 16,
  pattern = 170,
}

