animation{
  name = "stopped",
  src_image = "enemies/bosses/mercuris/mercuris_shadow.png",
  directions = {
    { x = 0, y = 0, frame_width = 82, frame_height = 68, origin_x = 41, origin_y = 53 },
    { x = 0, y = 0, frame_width = 82, frame_height = 68, origin_x = 41, origin_y = 53 },
    { x = 0, y = 0, frame_width = 82, frame_height = 68, origin_x = 41, origin_y = 53 },
    { x = 0, y = 0, frame_width = 82, frame_height = 68, origin_x = 41, origin_y = 53 },
  },
}
animation{
  name = "hurt",
  src_image = "enemies/bosses/mercuris/mercuris_shadow.png",
  directions = {
    { x = 0, y = 0, frame_width = 82, frame_height = 68, origin_x = 41, origin_y = 53 },
    { x = 0, y = 0, frame_width = 82, frame_height = 68, origin_x = 41, origin_y = 53 },
    { x = 0, y = 0, frame_width = 82, frame_height = 68, origin_x = 41, origin_y = 53 },
    { x = 0, y = 0, frame_width = 82, frame_height = 68, origin_x = 41, origin_y = 53 },
  },
}
animation{
  name = "immobilized",
  src_image = "enemies/bosses/mercuris/mercuris_shadow.png",
  directions = {
    { x = 0, y = 0, frame_width = 82, frame_height = 68, origin_x = 41, origin_y = 53 },
    { x = 0, y = 0, frame_width = 82, frame_height = 68, origin_x = 41, origin_y = 53 },
    { x = 0, y = 0, frame_width = 82, frame_height = 68, origin_x = 41, origin_y = 53 },
    { x = 0, y = 0, frame_width = 82, frame_height = 68, origin_x = 41, origin_y = 53 },
  },
}
animation{
  name = "walking",
  src_image = "enemies/bosses/mercuris/mercuris_shadow.png",
  directions = {
    { x = 0, y = 0, frame_width = 82, frame_height = 68, origin_x = 41, origin_y = 53 },
    { x = 0, y = 0, frame_width = 82, frame_height = 68, origin_x = 41, origin_y = 53 },
    { x = 0, y = 0, frame_width = 82, frame_height = 68, origin_x = 41, origin_y = 53 },
    { x = 0, y = 0, frame_width = 82, frame_height = 68, origin_x = 41, origin_y = 53 },
  },
}
