properties{
  x = 0,
  y = 0,
  width = 320,
  height = 240,
  min_layer = 0,
  max_layer = 2,
  tileset = "house",
  music = "eduardo/village",
}

tile{
  layer = 0,
  x = 48,
  y = 192,
  width = 224,
  height = 8,
  pattern = "wall_up_brown_6",
}

tile{
  layer = 0,
  x = 64,
  y = 176,
  width = 192,
  height = 8,
  pattern = "wall_brown_6",
  tileset = "house",
}

tile{
  layer = 0,
  x = 56,
  y = 184,
  width = 208,
  height = 8,
  pattern = "wall_up_brown_6",
  tileset = "house",
}

tile{
  layer = 0,
  x = 152,
  y = 176,
  width = 16,
  height = 32,
  pattern = "ground_wood_mosaic_big_1",
}

tile{
  layer = 0,
  x = 168,
  y = 128,
  width = 80,
  height = 48,
  pattern = "ground_wood_mosaic_big_1",
}

tile{
  layer = 0,
  x = 72,
  y = 72,
  width = 96,
  height = 96,
  pattern = "ground_wood_mosaic_big_1",
}

tile{
  layer = 0,
  x = 64,
  y = 168,
  width = 8,
  height = 8,
  pattern = "baseboard_5",
}

tile{
  layer = 0,
  x = 248,
  y = 168,
  width = 8,
  height = 8,
  pattern = "baseboard_7",
}

tile{
  layer = 0,
  x = 248,
  y = 128,
  width = 8,
  height = 40,
  pattern = "baseboard_0",
}

tile{
  layer = 0,
  x = 160,
  y = 120,
  width = 8,
  height = 8,
  pattern = "baseboard_corner_1",
}

tile{
  layer = 0,
  x = 168,
  y = 120,
  width = 80,
  height = 8,
  pattern = "baseboard_2",
}

tile{
  layer = 0,
  x = 160,
  y = 64,
  width = 8,
  height = 8,
  pattern = "baseboard_1",
}

tile{
  layer = 0,
  x = 72,
  y = 64,
  width = 88,
  height = 8,
  pattern = "baseboard_2",
}

tile{
  layer = 0,
  x = 64,
  y = 64,
  width = 8,
  height = 8,
  pattern = "baseboard_3",
}

tile{
  layer = 0,
  x = 64,
  y = 72,
  width = 8,
  height = 96,
  pattern = "baseboard_4",
}

tile{
  layer = 0,
  x = 72,
  y = 168,
  width = 176,
  height = 8,
  pattern = "baseboard_6",
}

tile{
  layer = 0,
  x = 248,
  y = 120,
  width = 8,
  height = 8,
  pattern = "baseboard_1",
}

tile{
  layer = 0,
  x = 160,
  y = 72,
  width = 8,
  height = 48,
  pattern = "baseboard_0",
}

tile{
  layer = 0,
  x = 64,
  y = 56,
  width = 104,
  height = 8,
  pattern = "wall_brown_2",
  tileset = "house",
}

tile{
  layer = 0,
  x = 72,
  y = 56,
  width = 88,
  height = 16,
  pattern = "ground_shadow_100",
}

tile{
  layer = 0,
  x = 176,
  y = 112,
  width = 80,
  height = 8,
  pattern = "wall_brown_2",
  tileset = "house",
}

tile{
  layer = 0,
  x = 256,
  y = 120,
  width = 8,
  height = 56,
  pattern = "wall_brown_0",
  tileset = "house",
}

tile{
  layer = 0,
  x = 256,
  y = 112,
  width = 8,
  height = 8,
  pattern = "wall_brown_1",
  tileset = "house",
}

tile{
  layer = 0,
  x = 256,
  y = 176,
  width = 8,
  height = 8,
  pattern = "wall_brown_7",
  tileset = "house",
}

tile{
  layer = 0,
  x = 248,
  y = 112,
  width = 16,
  height = 72,
  pattern = "ground_shadow_100",
}

tile{
  layer = 0,
  x = 72,
  y = 168,
  width = 176,
  height = 16,
  pattern = "ground_shadow_100",
}

tile{
  layer = 0,
  x = 56,
  y = 64,
  width = 8,
  height = 112,
  pattern = "wall_brown_4",
  tileset = "house",
}

tile{
  layer = 0,
  x = 56,
  y = 56,
  width = 8,
  height = 8,
  pattern = "wall_brown_3",
  tileset = "house",
}

tile{
  layer = 0,
  x = 56,
  y = 176,
  width = 8,
  height = 8,
  pattern = "wall_brown_5",
  tileset = "house",
}

tile{
  layer = 0,
  x = 56,
  y = 56,
  width = 16,
  height = 128,
  pattern = "ground_shadow_100",
}

tile{
  layer = 0,
  x = 136,
  y = 152,
  width = 48,
  height = 16,
  pattern = "carpet_rough",
}

tile{
  layer = 0,
  x = 136,
  y = 144,
  width = 48,
  height = 8,
  pattern = "carpet_rough_2",
  tileset = "house",
}

tile{
  layer = 0,
  x = 168,
  y = 64,
  width = 8,
  height = 48,
  pattern = "wall_brown_0",
  tileset = "house",
}

tile{
  layer = 0,
  x = 168,
  y = 56,
  width = 8,
  height = 8,
  pattern = "wall_brown_1",
  tileset = "house",
}

tile{
  layer = 0,
  x = 168,
  y = 112,
  width = 8,
  height = 8,
  pattern = "wall_corner_brown_1",
  tileset = "house",
}

tile{
  layer = 0,
  x = 56,
  y = 48,
  width = 120,
  height = 8,
  pattern = "wall_up_brown_2",
  tileset = "house",
}

tile{
  layer = 0,
  x = 48,
  y = 56,
  width = 8,
  height = 128,
  pattern = "wall_up_brown_4",
  tileset = "house",
}

tile{
  layer = 0,
  x = 176,
  y = 56,
  width = 8,
  height = 48,
  pattern = "wall_up_brown_0",
  tileset = "house",
}

tile{
  layer = 0,
  x = 264,
  y = 112,
  width = 8,
  height = 72,
  pattern = "wall_up_brown_0",
  tileset = "house",
}

tile{
  layer = 0,
  x = 48,
  y = 48,
  width = 8,
  height = 8,
  pattern = "wall_brown_3",
  tileset = "house",
}

tile{
  layer = 0,
  x = 176,
  y = 48,
  width = 8,
  height = 8,
  pattern = "wall_brown_1",
  tileset = "house",
}

tile{
  layer = 0,
  x = 176,
  y = 104,
  width = 8,
  height = 8,
  pattern = "wall_corner_up_brown_1",
  tileset = "house",
}

tile{
  layer = 0,
  x = 264,
  y = 104,
  width = 8,
  height = 8,
  pattern = "wall_brown_1",
  tileset = "house",
}

tile{
  layer = 0,
  x = 48,
  y = 184,
  width = 8,
  height = 8,
  pattern = "wall_brown_5",
  tileset = "house",
}

tile{
  layer = 0,
  x = 264,
  y = 184,
  width = 8,
  height = 8,
  pattern = "wall_brown_7",
  tileset = "house",
}

tile{
  layer = 0,
  x = 184,
  y = 104,
  width = 80,
  height = 8,
  pattern = "wall_up_brown_2",
  tileset = "house",
}

tile{
  layer = 0,
  x = 168,
  y = 176,
  width = 8,
  height = 8,
  pattern = "door_wood_right_low_3",
}

tile{
  layer = 0,
  x = 144,
  y = 176,
  width = 8,
  height = 8,
  pattern = "door_wood_left_low_3",
}

tile{
  layer = 0,
  x = 72,
  y = 56,
  width = 8,
  height = 8,
  pattern = "bookshelf_books_middle_b",
}

tile{
  layer = 0,
  x = 80,
  y = 56,
  width = 16,
  height = 8,
  pattern = "bookshelf_books_middle_a",
}

tile{
  layer = 0,
  x = 96,
  y = 48,
  width = 8,
  height = 8,
  pattern = "bookshelf_books_0",
}

tile{
  layer = 0,
  x = 80,
  y = 48,
  width = 8,
  height = 8,
  pattern = "bookshelf_center_books_b",
}

tile{
  layer = 0,
  x = 72,
  y = 48,
  width = 8,
  height = 8,
  pattern = "bookshelf_center_books_a",
}

tile{
  layer = 0,
  x = 64,
  y = 56,
  width = 8,
  height = 8,
  pattern = "bookshelf_books_left",
}

tile{
  layer = 0,
  x = 96,
  y = 64,
  width = 8,
  height = 8,
  pattern = "bookshelf_books_7",
}

tile{
  layer = 0,
  x = 80,
  y = 64,
  width = 16,
  height = 8,
  pattern = "bookshelf_books_6_b",
}

tile{
  layer = 0,
  x = 72,
  y = 64,
  width = 8,
  height = 8,
  pattern = "bookshelf_books_6_a",
}

tile{
  layer = 0,
  x = 96,
  y = 56,
  width = 8,
  height = 8,
  pattern = "bookshelf_books_right",
}

tile{
  layer = 0,
  x = 64,
  y = 64,
  width = 8,
  height = 8,
  pattern = "bookshelf_books_5",
}

tile{
  layer = 0,
  x = 64,
  y = 48,
  width = 8,
  height = 8,
  pattern = "bookshelf_books_4",
}

tile{
  layer = 0,
  x = 88,
  y = 48,
  width = 8,
  height = 8,
  pattern = "bookshelf_center_books_a",
}

tile{
  layer = 0,
  x = 96,
  y = 112,
  width = 32,
  height = 16,
  pattern = "table_yellow",
}

tile{
  layer = 0,
  x = 96,
  y = 104,
  width = 32,
  height = 8,
  pattern = "table_yellow_2",
  tileset = "house",
}

tile{
  layer = 0,
  x = 88,
  y = 112,
  width = 8,
  height = 16,
  pattern = "table_yellow_4",
  tileset = "house",
}

tile{
  layer = 0,
  x = 128,
  y = 112,
  width = 8,
  height = 16,
  pattern = "table_yellow_0",
  tileset = "house",
}

tile{
  layer = 0,
  x = 96,
  y = 128,
  width = 32,
  height = 8,
  pattern = "table_yellow_6",
  tileset = "house",
}

tile{
  layer = 0,
  x = 88,
  y = 104,
  width = 8,
  height = 8,
  pattern = "table_yellow_3",
  tileset = "house",
}

tile{
  layer = 0,
  x = 128,
  y = 104,
  width = 8,
  height = 8,
  pattern = "table_yellow_1",
  tileset = "house",
}

tile{
  layer = 0,
  x = 88,
  y = 128,
  width = 8,
  height = 8,
  pattern = "table_yellow_5",
  tileset = "house",
}

tile{
  layer = 0,
  x = 128,
  y = 128,
  width = 8,
  height = 8,
  pattern = "table_yellow_7",
  tileset = "house",
}

tile{
  layer = 0,
  x = 104,
  y = 144,
  width = 16,
  height = 16,
  pattern = "chair_yellow_1",
}

tile{
  layer = 0,
  x = 104,
  y = 160,
  width = 8,
  height = 8,
  pattern = "table_pink_leg",
}

tile{
  layer = 0,
  x = 112,
  y = 160,
  width = 8,
  height = 8,
  pattern = "table_pink_leg",
}

tile{
  layer = 0,
  x = 64,
  y = 128,
  width = 8,
  height = 8,
  pattern = "table_pink_leg",
}

tile{
  layer = 0,
  x = 72,
  y = 128,
  width = 8,
  height = 8,
  pattern = "table_pink_leg",
}

tile{
  layer = 0,
  x = 88,
  y = 136,
  width = 8,
  height = 8,
  pattern = "table_pink_leg",
}

tile{
  layer = 0,
  x = 128,
  y = 136,
  width = 8,
  height = 8,
  pattern = "table_pink_leg",
}

tile{
  layer = 0,
  x = 48,
  y = 48,
  width = 136,
  height = 8,
  pattern = "ground_shadow_60",
}

tile{
  layer = 0,
  x = 176,
  y = 56,
  width = 8,
  height = 56,
  pattern = "ground_shadow_60",
}

tile{
  layer = 0,
  x = 184,
  y = 104,
  width = 88,
  height = 8,
  pattern = "ground_shadow_60",
  tileset = "house",
}

tile{
  layer = 0,
  x = 184,
  y = 144,
  width = 8,
  height = 8,
  pattern = "carpet_rough_1",
}

tile{
  layer = 0,
  x = 184,
  y = 152,
  width = 8,
  height = 16,
  pattern = "carpet_rough_0",
}

tile{
  layer = 0,
  x = 128,
  y = 168,
  width = 8,
  height = 8,
  pattern = "carpet_rough_5",
}

tile{
  layer = 0,
  x = 128,
  y = 144,
  width = 8,
  height = 8,
  pattern = "carpet_rough_3",
}

tile{
  layer = 0,
  x = 128,
  y = 152,
  width = 8,
  height = 16,
  pattern = "carpet_rough_4",
}

tile{
  layer = 0,
  x = 184,
  y = 168,
  width = 8,
  height = 8,
  pattern = "carpet_rough_7",
}

tile{
  layer = 0,
  x = 136,
  y = 168,
  width = 48,
  height = 8,
  pattern = "carpet_rough_6",
}

tile{
  layer = 0,
  x = 48,
  y = 40,
  width = 136,
  height = 8,
  pattern = "wall_up_brown_2",
}

tile{
  layer = 0,
  x = 40,
  y = 48,
  width = 8,
  height = 144,
  pattern = "wall_up_brown_4",
}

tile{
  layer = 0,
  x = 184,
  y = 48,
  width = 8,
  height = 48,
  pattern = "wall_up_brown_0",
}

tile{
  layer = 0,
  x = 192,
  y = 96,
  width = 80,
  height = 8,
  pattern = "wall_up_brown_2",
}

tile{
  layer = 0,
  x = 272,
  y = 104,
  width = 8,
  height = 88,
  pattern = "wall_up_brown_0",
}

tile{
  layer = 0,
  x = 40,
  y = 40,
  width = 8,
  height = 8,
  pattern = "wall_brown_3",
}

tile{
  layer = 0,
  x = 184,
  y = 40,
  width = 8,
  height = 8,
  pattern = "wall_brown_1",
}

tile{
  layer = 0,
  x = 184,
  y = 96,
  width = 8,
  height = 8,
  pattern = "wall_corner_up_brown_1",
}

tile{
  layer = 0,
  x = 272,
  y = 96,
  width = 8,
  height = 8,
  pattern = "wall_brown_1",
}

tile{
  layer = 0,
  x = 40,
  y = 192,
  width = 8,
  height = 8,
  pattern = "wall_brown_5",
}

tile{
  layer = 0,
  x = 272,
  y = 192,
  width = 8,
  height = 8,
  pattern = "wall_brown_7",
}

tile{
  layer = 0,
  x = 240,
  y = 96,
  width = 8,
  height = 24,
  pattern = "stairs_down_right",
}

tile{
  layer = 0,
  x = 216,
  y = 96,
  width = 8,
  height = 24,
  pattern = "stairs_down_left",
}

tile{
  layer = 0,
  x = 224,
  y = 96,
  width = 16,
  height = 24,
  pattern = "stairs_down_center",
}

tile{
  layer = 0,
  x = 40,
  y = 184,
  width = 224,
  height = 8,
  pattern = "ground_shadow_60",
}

tile{
  layer = 0,
  x = 264,
  y = 112,
  width = 8,
  height = 72,
  pattern = "ground_shadow_60",
}

tile{
  layer = 0,
  x = 48,
  y = 56,
  width = 8,
  height = 128,
  pattern = "ground_shadow_60",
}

tile{
  layer = 0,
  x = 160,
  y = 56,
  width = 16,
  height = 72,
  pattern = "ground_shadow_100",
}

tile{
  layer = 0,
  x = 176,
  y = 112,
  width = 72,
  height = 16,
  pattern = "ground_shadow_100",
}

tile{
  layer = 0,
  x = 64,
  y = 112,
  width = 16,
  height = 16,
  pattern = "chair_yellow_0",
}

tile{
  layer = 0,
  x = 144,
  y = 184,
  width = 8,
  height = 8,
  pattern = "door_wood_left_high_3",
}

tile{
  layer = 0,
  x = 168,
  y = 184,
  width = 8,
  height = 8,
  pattern = "door_wood_right_high_3",
}

destination{
  name = "from_outside",
  layer = 0,
  x = 160,
  y = 189,
  direction = 1,
}

teletransporter{
  layer = 0,
  x = 152,
  y = 192,
  width = 16,
  height = 16,
  destination_map = "out/b3",
  destination = "out_grandma",
}

npc{
  name = "grandma",
  layer = 0,
  x = 128,
  y = 85,
  direction = 3,
  subtype = 1,
  sprite = "npc/newlink8",
}

stairs{
  layer = 0,
  x = 224,
  y = 104,
  direction = 1,
  subtype = 4,
}

wall{
  layer = 0,
  x = 216,
  y = 96,
  width = 8,
  height = 24,
  stops_hero = true,
  stops_npcs = true,
  stops_enemies = true,
  stops_blocks = true,
  stops_projectiles = true,
}

wall{
  layer = 0,
  x = 240,
  y = 96,
  width = 8,
  height = 24,
  stops_hero = true,
  stops_npcs = true,
  stops_enemies = true,
  stops_blocks = true,
  stops_projectiles = true,
}

destructible{
  layer = 0,
  x = 248,
  y = 141,
  treasure_name = "magic_flask",
  treasure_variant = 2,
  sprite = "destructibles/pot_1",
}

destructible{
  layer = 0,
  x = 248,
  y = 157,
  treasure_name = "bomb",
  sprite = "destructibles/pot_1",
}

destructible{
  layer = 0,
  x = 248,
  y = 173,
  treasure_name = "arrow",
  sprite = "destructibles/pot_1",
}

destructible{
  layer = 0,
  x = 72,
  y = 173,
  treasure_name = "random",
  sprite = "destructibles/pot_1",
}

destructible{
  layer = 0,
  x = 72,
  y = 85,
  treasure_name = "gem",
  sprite = "destructibles/pot_1",
}

destructible{
  layer = 0,
  x = 72,
  y = 101,
  treasure_name = "gem",
  sprite = "destructibles/pot_1",
}

tile{
  layer = 1,
  x = 192,
  y = 40,
  width = 88,
  height = 56,
  pattern = "ground_wood_yellow_horizontal",
}

tile{
  layer = 1,
  x = 200,
  y = 40,
  width = 72,
  height = 8,
  pattern = "baseboard_2",
}

tile{
  layer = 1,
  x = 272,
  y = 40,
  width = 8,
  height = 8,
  pattern = "baseboard_1",
}

tile{
  layer = 1,
  x = 272,
  y = 48,
  width = 8,
  height = 40,
  pattern = "baseboard_0",
}

tile{
  layer = 1,
  x = 168,
  y = 192,
  width = 8,
  height = 8,
  pattern = "door_wood_top_right_3",
}

tile{
  layer = 1,
  x = 144,
  y = 192,
  width = 8,
  height = 8,
  pattern = "door_wood_top_left_3",
}

tile{
  layer = 1,
  x = 152,
  y = 192,
  width = 16,
  height = 8,
  pattern = "door_wood_top_middle_3",
}

tile{
  layer = 1,
  x = 136,
  y = 192,
  width = 8,
  height = 8,
  pattern = "door_wood_top_leftborder_3",
}

tile{
  layer = 1,
  x = 176,
  y = 192,
  width = 8,
  height = 8,
  pattern = "door_wood_top_rightborder_3",
}

tile{
  layer = 1,
  x = 192,
  y = 88,
  width = 8,
  height = 8,
  pattern = "lowwall_corner_brown",
}

tile{
  layer = 1,
  x = 200,
  y = 88,
  width = 8,
  height = 8,
  pattern = "lowwall_horizontal_brown",
}

tile{
  layer = 1,
  x = 192,
  y = 48,
  width = 8,
  height = 16,
  pattern = "lowwall_vertical_brown",
}

tile{
  layer = 1,
  x = 192,
  y = 64,
  width = 8,
  height = 8,
  pattern = "lowwall_corner_brown",
}

tile{
  layer = 1,
  x = 192,
  y = 40,
  width = 8,
  height = 8,
  pattern = "lowwall_corner_brown",
}

tile{
  layer = 1,
  x = 208,
  y = 88,
  width = 8,
  height = 8,
  pattern = "lowwall_corner_brown",
}

tile{
  layer = 1,
  x = 248,
  y = 88,
  width = 8,
  height = 8,
  pattern = "lowwall_corner_brown",
}

tile{
  layer = 1,
  x = 256,
  y = 88,
  width = 16,
  height = 8,
  pattern = "lowwall_horizontal_brown",
}

tile{
  layer = 1,
  x = 272,
  y = 88,
  width = 8,
  height = 8,
  pattern = "lowwall_corner_brown",
}

tile{
  layer = 1,
  x = 248,
  y = 48,
  width = 32,
  height = 16,
  pattern = "bed_yellow_center",
}

tile{
  layer = 1,
  x = 248,
  y = 32,
  width = 32,
  height = 16,
  pattern = "bed_yellow_up",
}

tile{
  layer = 1,
  x = 248,
  y = 80,
  width = 32,
  height = 8,
  pattern = "bed_end",
}

tile{
  layer = 1,
  x = 248,
  y = 64,
  width = 32,
  height = 16,
  pattern = "bed_yellow_down",
}

tile{
  layer = 1,
  x = 72,
  y = 40,
  width = 24,
  height = 8,
  pattern = "bookshelf_2",
  tileset = "house",
}

tile{
  layer = 1,
  x = 96,
  y = 40,
  width = 8,
  height = 8,
  pattern = "bookshelf_1",
  tileset = "house",
}

tile{
  layer = 1,
  x = 64,
  y = 40,
  width = 8,
  height = 8,
  pattern = "bookshelf_3",
  tileset = "house",
}

tile{
  layer = 1,
  x = 72,
  y = 208,
  width = 32,
  height = 16,
  pattern = "window_big_6",
}

tile{
  layer = 1,
  x = 208,
  y = 208,
  width = 32,
  height = 16,
  pattern = "window_big_6",
}

tile{
  layer = 1,
  x = 16,
  y = 104,
  width = 16,
  height = 32,
  pattern = "window_big_4",
}

tile{
  layer = 1,
  x = 64,
  y = 104,
  width = 8,
  height = 8,
  pattern = "chair_up_yellow_0",
}

tile{
  layer = 1,
  x = 288,
  y = 104,
  width = 16,
  height = 32,
  pattern = "window_big_0",
}

tile{
  layer = 1,
  x = 192,
  y = 32,
  width = 88,
  height = 8,
  pattern = "wall_brown_ceiling",
}

tile{
  layer = 1,
  x = 280,
  y = 40,
  width = 8,
  height = 56,
  pattern = "wall_brown_ceiling",
}

jumper{
  layer = 1,
  x = 184,
  y = 72,
  width = 8,
  height = 16,
  direction = 4,
  jump_length = 40,
}

chest{
  layer = 1,
  x = 208,
  y = 53,
  treasure_name = "gem",
  treasure_variant = 2,
  sprite = "entities/chest_brown",
}

destructible{
  layer = 1,
  x = 240,
  y = 53,
  treasure_name = "gem",
  sprite = "destructibles/pot_1",
}

tile{
  layer = 2,
  x = 0,
  y = 0,
  width = 320,
  height = 16,
  pattern = "wall_brown_ceiling",
}

tile{
  layer = 2,
  x = 0,
  y = 224,
  width = 320,
  height = 16,
  pattern = "wall_brown_ceiling",
}

tile{
  layer = 2,
  x = 0,
  y = 16,
  width = 16,
  height = 208,
  pattern = "wall_brown_ceiling",
}

tile{
  layer = 2,
  x = 304,
  y = 16,
  width = 16,
  height = 208,
  pattern = "wall_brown_ceiling",
}

