properties{
  x = 0,
  y = 0,
  width = 640,
  height = 480,
  min_layer = 0,
  max_layer = 2,
  tileset = "oceanset_inside",
  music = "eduardo/village",
}

tile{
  layer = 0,
  x = 0,
  y = 0,
  width = 640,
  height = 480,
  pattern = "void_1",
}

tile{
  layer = 0,
  x = 48,
  y = 48,
  width = 224,
  height = 144,
  pattern = "143",
}

tile{
  layer = 0,
  x = 48,
  y = 64,
  width = 224,
  height = 128,
  pattern = "145",
}

tile{
  layer = 0,
  x = 272,
  y = 16,
  width = 32,
  height = 32,
  pattern = "aasf",
}

tile{
  layer = 0,
  x = 272,
  y = 192,
  width = 32,
  height = 32,
  pattern = "38",
}

tile{
  layer = 0,
  x = 48,
  y = 16,
  width = 224,
  height = 32,
  pattern = "35",
}

tile{
  layer = 0,
  x = 48,
  y = 192,
  width = 224,
  height = 32,
  pattern = "39",
}

tile{
  layer = 0,
  x = 16,
  y = 48,
  width = 32,
  height = 144,
  pattern = "41",
}

tile{
  layer = 0,
  x = 16,
  y = 192,
  width = 32,
  height = 32,
  pattern = "40",
}

tile{
  layer = 0,
  x = 16,
  y = 16,
  width = 32,
  height = 32,
  pattern = "34",
}

tile{
  layer = 0,
  x = 272,
  y = 48,
  width = 32,
  height = 144,
  pattern = "37",
}

tile{
  layer = 0,
  x = 80,
  y = 96,
  width = 80,
  height = 8,
  pattern = "137",
}

tile{
  layer = 0,
  x = 64,
  y = 96,
  width = 16,
  height = 8,
  pattern = "134",
}

tile{
  layer = 0,
  x = 80,
  y = 104,
  width = 80,
  height = 16,
  pattern = "128",
}

tile{
  layer = 0,
  x = 64,
  y = 104,
  width = 16,
  height = 16,
  pattern = "36",
}

tile{
  layer = 0,
  x = 160,
  y = 96,
  width = 16,
  height = 24,
  pattern = "140",
}

tile{
  layer = 0,
  x = 160,
  y = 48,
  width = 16,
  height = 48,
  pattern = "142",
}

tile{
  layer = 0,
  x = 160,
  y = 40,
  width = 16,
  height = 8,
  pattern = "141",
}

tile{
  layer = 0,
  x = 264,
  y = 88,
  width = 8,
  height = 24,
  pattern = "78",
}

tile{
  layer = 0,
  x = 224,
  y = 88,
  width = 8,
  height = 24,
  pattern = "76",
}

tile{
  layer = 0,
  x = 232,
  y = 88,
  width = 32,
  height = 24,
  pattern = "77",
}

tile{
  layer = 0,
  x = 264,
  y = 152,
  width = 8,
  height = 24,
  pattern = "78",
}

tile{
  layer = 0,
  x = 224,
  y = 152,
  width = 8,
  height = 24,
  pattern = "76",
}

tile{
  layer = 0,
  x = 232,
  y = 152,
  width = 32,
  height = 24,
  pattern = "77",
}

tile{
  layer = 0,
  x = 240,
  y = 176,
  width = 16,
  height = 16,
  pattern = "75",
}

tile{
  layer = 0,
  x = 240,
  y = 136,
  width = 16,
  height = 16,
  pattern = "75",
}

tile{
  layer = 0,
  x = 240,
  y = 112,
  width = 16,
  height = 16,
  pattern = "75",
}

tile{
  layer = 0,
  x = 240,
  y = 72,
  width = 16,
  height = 16,
  pattern = "75",
}

tile{
  layer = 0,
  x = 248,
  y = 152,
  width = 8,
  height = 16,
  pattern = "87",
}

tile{
  layer = 0,
  x = 240,
  y = 88,
  width = 8,
  height = 16,
  pattern = "87",
}

tile{
  layer = 0,
  x = 64,
  y = 40,
  width = 16,
  height = 16,
  pattern = "66",
}

tile{
  layer = 0,
  x = 80,
  y = 48,
  width = 48,
  height = 16,
  pattern = "68",
}

tile{
  layer = 0,
  x = 112,
  y = 176,
  width = 8,
  height = 8,
  pattern = "32_8",
}

tile{
  layer = 0,
  x = 200,
  y = 128,
  width = 8,
  height = 8,
  pattern = "28_8",
}

tile{
  layer = 0,
  x = 200,
  y = 176,
  width = 8,
  height = 8,
  pattern = "30_8",
}

tile{
  layer = 0,
  x = 120,
  y = 128,
  width = 80,
  height = 8,
  pattern = "27_15",
}

tile{
  layer = 0,
  x = 120,
  y = 176,
  width = 80,
  height = 8,
  pattern = "31_8",
}

tile{
  layer = 0,
  x = 120,
  y = 136,
  width = 80,
  height = 40,
  pattern = "26_8",
}

tile{
  layer = 0,
  x = 112,
  y = 128,
  width = 8,
  height = 8,
  pattern = "27_16",
}

tile{
  layer = 0,
  x = 112,
  y = 136,
  width = 8,
  height = 40,
  pattern = "33_8",
}

tile{
  layer = 0,
  x = 200,
  y = 136,
  width = 8,
  height = 40,
  pattern = "29_8",
}

tile{
  layer = 0,
  x = 80,
  y = 120,
  width = 16,
  height = 16,
  pattern = "75",
}

tile{
  layer = 0,
  x = 112,
  y = 120,
  width = 16,
  height = 16,
  pattern = "75",
}

tile{
  layer = 0,
  x = 144,
  y = 120,
  width = 16,
  height = 16,
  pattern = "75",
}

tile{
  layer = 0,
  x = 152,
  y = 192,
  width = 16,
  height = 16,
  pattern = "143",
}

tile{
  layer = 0,
  x = 208,
  y = 32,
  width = 16,
  height = 16,
  pattern = "143",
}

tile{
  layer = 0,
  x = 200,
  y = 16,
  width = 8,
  height = 32,
  pattern = "50_3",
}

tile{
  layer = 0,
  x = 224,
  y = 16,
  width = 8,
  height = 32,
  pattern = "51_3",
}

tile{
  layer = 0,
  x = 208,
  y = 16,
  width = 16,
  height = 32,
  pattern = "52_4",
}

tile{
  layer = 0,
  x = 208,
  y = 32,
  width = 16,
  height = 16,
  pattern = "48",
}

tile{
  layer = 0,
  x = 144,
  y = 192,
  width = 8,
  height = 32,
  pattern = "50_4",
}

tile{
  layer = 0,
  x = 168,
  y = 192,
  width = 8,
  height = 32,
  pattern = "51_4",
}

tile{
  layer = 0,
  x = 152,
  y = 192,
  width = 16,
  height = 32,
  pattern = "52_3",
}

tile{
  layer = 0,
  x = 24,
  y = 72,
  width = 16,
  height = 16,
  pattern = "82",
}

tile{
  layer = 0,
  x = 24,
  y = 120,
  width = 16,
  height = 16,
  pattern = "82",
}

tile{
  layer = 0,
  x = 24,
  y = 168,
  width = 16,
  height = 16,
  pattern = "82",
}

tile{
  layer = 0,
  x = 280,
  y = 72,
  width = 16,
  height = 16,
  pattern = "84",
}

tile{
  layer = 0,
  x = 280,
  y = 120,
  width = 16,
  height = 16,
  pattern = "84",
}

tile{
  layer = 0,
  x = 280,
  y = 168,
  width = 16,
  height = 16,
  pattern = "84",
}

tile{
  layer = 0,
  x = 88,
  y = 200,
  width = 16,
  height = 16,
  pattern = "85",
}

tile{
  layer = 0,
  x = 216,
  y = 200,
  width = 16,
  height = 16,
  pattern = "85",
}

tile{
  layer = 0,
  x = 232,
  y = 48,
  width = 40,
  height = 16,
  pattern = "225",
  tileset = "oceanset_outside",
}

tile{
  layer = 0,
  x = 136,
  y = 24,
  width = 16,
  height = 16,
  pattern = "147",
}

tile{
  layer = 0,
  x = 48,
  y = 304,
  width = 224,
  height = 128,
  pattern = "145",
}

tile{
  layer = 0,
  x = 48,
  y = 272,
  width = 224,
  height = 32,
  pattern = "35_2",
}

tile{
  layer = 0,
  x = 16,
  y = 432,
  width = 32,
  height = 32,
  pattern = "40_2",
}

tile{
  layer = 0,
  x = 48,
  y = 432,
  width = 224,
  height = 32,
  pattern = "39_2",
}

tile{
  layer = 0,
  x = 272,
  y = 432,
  width = 32,
  height = 32,
  pattern = "38_2",
}

tile{
  layer = 0,
  x = 16,
  y = 304,
  width = 32,
  height = 128,
  pattern = "41_2",
}

tile{
  layer = 0,
  x = 272,
  y = 272,
  width = 32,
  height = 32,
  pattern = "36_2",
}

tile{
  layer = 0,
  x = 16,
  y = 272,
  width = 32,
  height = 32,
  pattern = "34_2",
}

tile{
  layer = 0,
  x = 272,
  y = 304,
  width = 32,
  height = 128,
  pattern = "37_2",
}

tile{
  layer = 0,
  x = 16,
  y = 280,
  width = 8,
  height = 176,
  pattern = "plaster_wall_trim_8",
}

tile{
  layer = 0,
  x = 16,
  y = 272,
  width = 8,
  height = 8,
  pattern = "plaster_wall_trim_1",
}

tile{
  layer = 0,
  x = 296,
  y = 456,
  width = 8,
  height = 8,
  pattern = "plaster_wall_trim_5",
}

tile{
  layer = 0,
  x = 296,
  y = 280,
  width = 8,
  height = 176,
  pattern = "plaster_wall_trim_4",
}

tile{
  layer = 0,
  x = 296,
  y = 272,
  width = 8,
  height = 8,
  pattern = "plaster_wall_trim_3",
}

tile{
  layer = 0,
  x = 16,
  y = 456,
  width = 8,
  height = 8,
  pattern = "plaster_wall_trim_7",
}

tile{
  layer = 0,
  x = 24,
  y = 456,
  width = 272,
  height = 8,
  pattern = "plaster_wall_trim_6",
}

tile{
  layer = 0,
  x = 24,
  y = 272,
  width = 272,
  height = 8,
  pattern = "plaster_wall_trim_2",
}

tile{
  layer = 0,
  x = 200,
  y = 272,
  width = 8,
  height = 32,
  pattern = "50_3",
}

tile{
  layer = 0,
  x = 224,
  y = 272,
  width = 8,
  height = 32,
  pattern = "51_3",
}

tile{
  layer = 0,
  x = 208,
  y = 288,
  width = 16,
  height = 16,
  pattern = "143",
}

tile{
  layer = 0,
  x = 208,
  y = 272,
  width = 16,
  height = 32,
  pattern = "52_4",
}

tile{
  layer = 0,
  x = 208,
  y = 288,
  width = 16,
  height = 16,
  pattern = "49",
}

tile{
  layer = 0,
  x = 368,
  y = 320,
  width = 64,
  height = 96,
  pattern = "145",
}

tile{
  layer = 0,
  x = 368,
  y = 288,
  width = 64,
  height = 32,
  pattern = "35_2",
}

tile{
  layer = 0,
  x = 336,
  y = 416,
  width = 32,
  height = 32,
  pattern = "40_2",
}

tile{
  layer = 0,
  x = 368,
  y = 416,
  width = 64,
  height = 32,
  pattern = "39_2",
}

tile{
  layer = 0,
  x = 432,
  y = 416,
  width = 32,
  height = 32,
  pattern = "38_2",
}

tile{
  layer = 0,
  x = 336,
  y = 320,
  width = 32,
  height = 96,
  pattern = "41_2",
}

tile{
  layer = 0,
  x = 432,
  y = 288,
  width = 32,
  height = 32,
  pattern = "36_2",
}

tile{
  layer = 0,
  x = 336,
  y = 288,
  width = 32,
  height = 32,
  pattern = "34_2",
}

tile{
  layer = 0,
  x = 432,
  y = 320,
  width = 32,
  height = 96,
  pattern = "37_2",
}

tile{
  layer = 0,
  x = 336,
  y = 296,
  width = 8,
  height = 144,
  pattern = "plaster_wall_trim_8",
}

tile{
  layer = 0,
  x = 336,
  y = 288,
  width = 8,
  height = 8,
  pattern = "plaster_wall_trim_1",
}

tile{
  layer = 0,
  x = 456,
  y = 440,
  width = 8,
  height = 8,
  pattern = "plaster_wall_trim_5",
}

tile{
  layer = 0,
  x = 456,
  y = 296,
  width = 8,
  height = 144,
  pattern = "plaster_wall_trim_4",
}

tile{
  layer = 0,
  x = 456,
  y = 288,
  width = 8,
  height = 8,
  pattern = "plaster_wall_trim_3",
}

tile{
  layer = 0,
  x = 336,
  y = 440,
  width = 8,
  height = 8,
  pattern = "plaster_wall_trim_7",
}

tile{
  layer = 0,
  x = 344,
  y = 440,
  width = 112,
  height = 8,
  pattern = "plaster_wall_trim_6",
}

tile{
  layer = 0,
  x = 344,
  y = 288,
  width = 112,
  height = 8,
  pattern = "plaster_wall_trim_2",
}

tile{
  layer = 0,
  x = 272,
  y = 368,
  width = 96,
  height = 16,
  pattern = "143",
}

tile{
  layer = 0,
  x = 56,
  y = 320,
  width = 8,
  height = 88,
  pattern = "33_2",
}

tile{
  layer = 0,
  x = 64,
  y = 408,
  width = 96,
  height = 8,
  pattern = "31_2",
}

tile{
  layer = 0,
  x = 56,
  y = 408,
  width = 8,
  height = 8,
  pattern = "32_2",
}

tile{
  layer = 0,
  x = 56,
  y = 312,
  width = 8,
  height = 8,
  pattern = "27_4",
}

tile{
  layer = 0,
  x = 160,
  y = 320,
  width = 8,
  height = 88,
  pattern = "29_2",
}

tile{
  layer = 0,
  x = 64,
  y = 312,
  width = 96,
  height = 8,
  pattern = "27_3",
}

tile{
  layer = 0,
  x = 160,
  y = 408,
  width = 8,
  height = 8,
  pattern = "30_2",
}

tile{
  layer = 0,
  x = 160,
  y = 312,
  width = 8,
  height = 8,
  pattern = "28_2",
}

tile{
  layer = 0,
  x = 64,
  y = 320,
  width = 96,
  height = 88,
  pattern = "26_2",
}

tile{
  layer = 0,
  x = 64,
  y = 296,
  width = 32,
  height = 48,
  pattern = "112_3",
}

tile{
  layer = 0,
  x = 48,
  y = 296,
  width = 8,
  height = 24,
  pattern = "76",
}

tile{
  layer = 0,
  x = 56,
  y = 296,
  width = 8,
  height = 24,
  pattern = "78",
}

tile{
  layer = 0,
  x = 128,
  y = 296,
  width = 32,
  height = 48,
  pattern = "112_3",
}

tile{
  layer = 0,
  x = 160,
  y = 296,
  width = 8,
  height = 24,
  pattern = "76",
}

tile{
  layer = 0,
  x = 168,
  y = 296,
  width = 8,
  height = 24,
  pattern = "78",
}

tile{
  layer = 0,
  x = 232,
  y = 384,
  width = 8,
  height = 24,
  pattern = "78",
}

tile{
  layer = 0,
  x = 200,
  y = 384,
  width = 32,
  height = 24,
  pattern = "77",
}

tile{
  layer = 0,
  x = 192,
  y = 384,
  width = 8,
  height = 24,
  pattern = "76",
}

tile{
  layer = 0,
  x = 208,
  y = 368,
  width = 16,
  height = 16,
  pattern = "75",
}

tile{
  layer = 0,
  x = 208,
  y = 408,
  width = 16,
  height = 16,
  pattern = "75",
}

tile{
  layer = 0,
  x = 200,
  y = 384,
  width = 16,
  height = 16,
  pattern = "89",
}

tile{
  layer = 0,
  x = 224,
  y = 384,
  width = 8,
  height = 16,
  pattern = "88",
}

tile{
  layer = 0,
  x = 152,
  y = 96,
  width = 8,
  height = 16,
  pattern = "88",
}

tile{
  layer = 0,
  x = 128,
  y = 96,
  width = 8,
  height = 16,
  pattern = "88",
}

tile{
  layer = 0,
  x = 80,
  y = 440,
  width = 16,
  height = 16,
  pattern = "85",
}

tile{
  layer = 0,
  x = 224,
  y = 440,
  width = 16,
  height = 16,
  pattern = "85",
}

tile{
  layer = 0,
  x = 152,
  y = 440,
  width = 16,
  height = 16,
  pattern = "85",
}

tile{
  layer = 0,
  x = 256,
  y = 304,
  width = 16,
  height = 16,
  pattern = "149",
}

tile{
  layer = 0,
  x = 368,
  y = 320,
  width = 24,
  height = 16,
  pattern = "223",
  tileset = "oceanset_outside",
}

tile{
  layer = 0,
  x = 368,
  y = 336,
  width = 24,
  height = 16,
  pattern = "223",
  tileset = "oceanset_outside",
}

tile{
  layer = 0,
  x = 416,
  y = 320,
  width = 16,
  height = 16,
  pattern = "221",
  tileset = "oceanset_outside",
}

tile{
  layer = 0,
  x = 416,
  y = 384,
  width = 16,
  height = 16,
  pattern = "221",
  tileset = "oceanset_outside",
}

tile{
  layer = 0,
  x = 416,
  y = 400,
  width = 16,
  height = 16,
  pattern = "221",
  tileset = "oceanset_outside",
}

tile{
  layer = 0,
  x = 400,
  y = 400,
  width = 16,
  height = 16,
  pattern = "221",
  tileset = "oceanset_outside",
}

tile{
  layer = 0,
  x = 336,
  y = 336,
  width = 32,
  height = 32,
  pattern = "44_2",
}

tile{
  layer = 0,
  x = 336,
  y = 384,
  width = 32,
  height = 32,
  pattern = "43_2",
}

tile{
  layer = 0,
  x = 336,
  y = 408,
  width = 8,
  height = 8,
  pattern = "plaster_wall_trim_10",
}

tile{
  layer = 0,
  x = 336,
  y = 336,
  width = 8,
  height = 8,
  pattern = "plaster_wall_trim_11",
}

tile{
  layer = 0,
  x = 48,
  y = 288,
  width = 8,
  height = 16,
  pattern = "87",
}

tile{
  layer = 0,
  x = 56,
  y = 296,
  width = 8,
  height = 16,
  pattern = "88",
}

chest{
  layer = 0,
  x = 400,
  y = 325,
  treasure_name = "piece_of_heart",
  treasure_savegame_variable = "inn_piece_of_heart",
  sprite = "entities/chest_red",
}

separator{
  layer = 0,
  x = 312,
  y = 0,
  width = 16,
  height = 480,
}

separator{
  layer = 0,
  x = 0,
  y = 232,
  width = 640,
  height = 16,
}

destination{
  name = "from_outside",
  layer = 0,
  x = 160,
  y = 205,
  direction = 1,
}

teletransporter{
  layer = 0,
  x = 152,
  y = 208,
  width = 16,
  height = 16,
  destination_map = "out/a3",
  destination = "from_inn",
}

chest{
  layer = 0,
  x = 56,
  y = 53,
  treasure_name = "gem",
  treasure_variant = 4,
  treasure_savegame_variable = "lyriann_inn_gems_chest",
  sprite = "entities/chest_brown",
}

destructible{
  layer = 0,
  x = 56,
  y = 109,
  sprite = "destructibles/rock_golden",
  destruction_sound = "stone",
  weight = 1,
  damage_on_enemies = 2,
}

destination{
  name = "from_upstairs",
  layer = 0,
  x = 216,
  y = 45,
  direction = 3,
}

destination{
  name = "from_downstairs",
  layer = 0,
  x = 216,
  y = 301,
  direction = 3,
}

teletransporter{
  layer = 0,
  x = 208,
  y = 288,
  width = 16,
  height = 16,
  destination_map = "houses/inn",
  destination = "from_upstairs",
}

teletransporter{
  layer = 0,
  x = 208,
  y = 32,
  width = 16,
  height = 16,
  destination_map = "houses/inn",
  destination = "from_downstairs",
}

stairs{
  layer = 0,
  x = 208,
  y = 32,
  direction = 1,
  subtype = 0,
}

stairs{
  layer = 0,
  x = 208,
  y = 288,
  direction = 1,
  subtype = 1,
}

destructible{
  layer = 0,
  x = 264,
  y = 309,
  sprite = "destructibles/cabbagge_green",
}

destination{
  name = "from_intro",
  layer = 0,
  x = 104,
  y = 333,
  direction = 0,
}

door{
  layer = 0,
  x = 272,
  y = 368,
  direction = 2,
  sprite = "entities/door_weak_wall_plaster_house",
  opening_method = "explosion",
}

npc{
  layer = 0,
  x = 104,
  y = 93,
  direction = 3,
  subtype = 1,
  sprite = "npc/diarandor/woman_1a",
}

npc{
  name = "bartender",
  layer = 0,
  x = 104,
  y = 117,
  direction = 3,
  subtype = 1,
}

chest{
  layer = 0,
  x = 264,
  y = 413,
  treasure_name = "shield",
  treasure_savegame_variable = "lyriann_inn_shield_chest",
  sprite = "entities/chest_brown",
}

destructible{
  layer = 0,
  x = 248,
  y = 413,
  sprite = "destructibles/pot_1",
}

destructible{
  layer = 0,
  x = 264,
  y = 429,
  sprite = "destructibles/pot_1",
}

destructible{
  layer = 0,
  x = 248,
  y = 429,
  sprite = "destructibles/pot_1",
}

tile{
  layer = 1,
  x = 144,
  y = 208,
  width = 32,
  height = 16,
  pattern = "53_4",
}

tile{
  layer = 1,
  x = 200,
  y = 16,
  width = 32,
  height = 16,
  pattern = "53_3",
}

tile{
  layer = 1,
  x = 64,
  y = 24,
  width = 16,
  height = 16,
  pattern = "67",
}

tile{
  layer = 1,
  x = 80,
  y = 40,
  width = 48,
  height = 8,
  pattern = "69",
}

tile{
  layer = 1,
  x = 96,
  y = 40,
  width = 16,
  height = 8,
  pattern = "table_sink",
}

tile{
  layer = 1,
  x = 80,
  y = 32,
  width = 16,
  height = 16,
  pattern = "89",
}

tile{
  layer = 1,
  x = 112,
  y = 32,
  width = 8,
  height = 16,
  pattern = "88",
}

tile{
  layer = 1,
  x = 120,
  y = 32,
  width = 8,
  height = 16,
  pattern = "88",
}

tile{
  layer = 1,
  x = 232,
  y = 32,
  width = 40,
  height = 16,
  pattern = "226",
  tileset = "oceanset_outside",
}

tile{
  layer = 1,
  x = 200,
  y = 272,
  width = 32,
  height = 16,
  pattern = "53_3",
}

tile{
  layer = 1,
  x = 304,
  y = 248,
  width = 32,
  height = 232,
  pattern = "void_1",
}

tile{
  layer = 1,
  x = 368,
  y = 312,
  width = 24,
  height = 8,
  pattern = "224",
  tileset = "oceanset_outside",
}

tile{
  layer = 1,
  x = 368,
  y = 328,
  width = 24,
  height = 8,
  pattern = "224",
  tileset = "oceanset_outside",
}

tile{
  layer = 1,
  x = 416,
  y = 312,
  width = 16,
  height = 8,
  pattern = "222",
  tileset = "oceanset_outside",
}

tile{
  layer = 1,
  x = 416,
  y = 376,
  width = 16,
  height = 8,
  pattern = "222",
  tileset = "oceanset_outside",
}

tile{
  layer = 1,
  x = 416,
  y = 392,
  width = 16,
  height = 8,
  pattern = "222",
  tileset = "oceanset_outside",
}

tile{
  layer = 1,
  x = 400,
  y = 392,
  width = 16,
  height = 8,
  pattern = "222",
  tileset = "oceanset_outside",
}

tile{
  layer = 1,
  x = 296,
  y = 360,
  width = 8,
  height = 32,
  pattern = "plaster_wall_trim_4",
}

