{
    "name": "as.up.data.forward",
    "time": "2022-04-08T14:26:42.445449987Z",
    "identifiers": [
        {
            "device_ids": {
                "device_id": "eui-70b3d57ed0047332",
                "application_ids": {
                    "application_id": "slrtrkr"
                }
            }
      },
        {
            "device_ids": {
                "device_id": "eui-70b3d57ed0047332",
                "application_ids": {
                    "application_id": "slrtrkr"
                },
                "dev_eui": "70B3D57ED0047332",
                "join_eui": "3509F8EAE84EDFD8",
                "dev_addr": "260B2FF5"
            }
      }
    ],
    "data": {
        "@type": "type.googleapis.com/ttn.lorawan.v3.ApplicationUp",
        "end_device_ids": {
            "device_id": "eui-70b3d57ed0047332",
            "application_ids": {
                "application_id": "slrtrkr"
            },
            "dev_eui": "70B3D57ED0047332",
            "join_eui": "3509F8EAE84EDFD8",
            "dev_addr": "260B2FF5"
        },
        "correlation_ids": [
        "as:up:01G04S3XM7XJJW9BSCSBVA6ZRM",
        "gs:conn:01G02HJT10NB4HBMEJBV8VP8S4",
        "gs:up:host:01G02HJT183DB5XRMM3XXW0B9V",
        "gs:uplink:01G04S3XDPR19MFX75E4WVHQZH",
        "ns:uplink:01G04S3XDPP2RM9VQ37PSF99BM",
        "rpc:/ttn.lorawan.v3.GsNs/HandleUplink:01G04S3XDPMVPNP9Y0CFWPW0RF",
        "rpc:/ttn.lorawan.v3.NsAs/HandleUplink:01G04S3XM7NDJ4SQW4G1N2YT8Q"
      ],
        "received_at": "2022-04-08T14:26:42.440109974Z",
        "uplink_message": {
            "session_key_id": "AYAJj+jKrAiQbrIibk5VNw==",
            "f_port": 1,
            "frm_payload": "AJ4R5A==",
            "decoded_payload": {
                "event": "SensorData:",
                "humidity": "45.8%",
                "temperature": "15.8 °C"
            },
            "rx_metadata": [
                {
                    "gateway_ids": {
                        "gateway_id": "miracuru-zrh",
                        "eui": "A0F3C2D1A03357E2"
                    },
                    "timestamp": 1997400796,
                    "rssi": -113,
                    "channel_rssi": -113,
                    "snr": 6,
                    "location": {
                        "latitude": 47.305,
                        "longitude": 8.75855,
                        "altitude": 494,
                        "source": "SOURCE_REGISTRY"
                    },
                    "uplink_token": "ChoKGAoMbWlyYWN1cnUtenJoEgig88LRoDNX4hDc1be4BxoLCKKMwZIGEL7w0G0g4Nb18pCHEQ==",
                    "channel_index": 2
          },
                {
                    "gateway_ids": {
                        "gateway_id": "eui-3235313218006500",
                        "eui": "3235313218006500"
                    },
                    "time": "2022-04-08T14:25:21.357624Z",
                    "timestamp": 245382860,
                    "rssi": -115,
                    "channel_rssi": -115,
                    "snr": -0.25,
                    "location": {
                        "latitude": 47.2774306,
                        "longitude": 8.76122233,
                        "altitude": 520,
                        "source": "SOURCE_REGISTRY"
                    },
                    "uplink_token": "CiIKIAoUZXVpLTMyMzUzMTMyMTgwMDY1MDASCDI1MTIYAGUAEMz9gHUaCwiijMGSBhCn36tuIOCZ1Y+S3t0BKgwI0YvBkgYQwNHDqgE=",
                    "channel_index": 2
          }
        ],
            "settings": {
                "data_rate": {
                    "lora": {
                        "bandwidth": 125000,
                        "spreading_factor": 9
                    }
                },
                "coding_rate": "4/5",
                "frequency": "868500000",
                "timestamp": 1997400796
            },
            "received_at": "2022-04-08T14:26:42.230985703Z",
            "consumed_airtime": "0.164864s",
            "locations": {
                "user": {
                    "latitude": 47.30474736828758,
                    "longitude": 8.76812500892138,
                    "altitude": 466,
                    "source": "SOURCE_REGISTRY"
                }
            },
            "network_ids": {
                "net_id": "000013",
                "tenant_id": "ttn",
                "cluster_id": "ttn-eu1"
            }
        }
    },
    "correlation_ids": [
      "as:up:01G04S3XM7XJJW9BSCSBVA6ZRM",
      "gs:conn:01G02HJT10NB4HBMEJBV8VP8S4",
      "gs:up:host:01G02HJT183DB5XRMM3XXW0B9V",
      "gs:uplink:01G04S3XDPR19MFX75E4WVHQZH",
      "ns:uplink:01G04S3XDPP2RM9VQ37PSF99BM",
      "rpc:/ttn.lorawan.v3.GsNs/HandleUplink:01G04S3XDPMVPNP9Y0CFWPW0RF",
      "rpc:/ttn.lorawan.v3.NsAs/HandleUplink:01G04S3XM7NDJ4SQW4G1N2YT8Q"
    ],
    "origin": "ip-10-100-7-92.eu-west-1.compute.internal",
    "context": {
        "tenant-id": "CgN0dG4="
    },
    "visibility": {
        "rights": [
        "RIGHT_APPLICATION_TRAFFIC_READ",
        "RIGHT_APPLICATION_TRAFFIC_READ"
      ]
    },
    "unique_id": "01G04S3XMDQXQFAVPGKFH9QBKD"
}