[
        {
          "accomplishments": [
            "Design and implement the architecture with customer and project teams : Cloud Iaas/PaaS, ERP (JD Edwards, ERP Cloud, QAD), Integration (REST, SOAP, ESB), Monitoring/Reporting solutions",
            "Design, develop and implement an AP Automation solution built with WebCenter, Oracle BPM, Forms Recognition, WebServices, Oracle JET",
            "Provide product knowledge support to customers and project teams",
            "Participate in Go Live and support period",
            "Provide training internally and externally on latest technology improvements",
            "Design, install and manage internal environments (sandbox, lab, training, demo)",
            "Responsible for staying abreast of current technologies",
            "Write blog articles on latest technologies"
          ],
          "id": "2",
          "position": "Solutions Architect"
        },
        {
          "accomplishments": [
            "Work with sales team to qualify leads, write proposals and contracts",
            "Create estimate workloads and pricing",
            "Build Proof Of Concept (POC) on latest technologies (ICS, Oracle Digital Assistant for example)",
            "Demonstrate product features",
            "Participate in sales meetings with the prospect",
            "Speaker at customer events (UK, France); represent the company at Oracle Partner events (user groups, Openworld 2017/2018)",
            "Craft sales pitches for sales and marketing teams"
          ],
          "id": "1",
          "position": "Presales"
        },
        {
          "accomplishments": [
            "Design training workshops on various products and technologies, including Oracle Cloud Infrastructure",
            "Build training environments",
            "Deliver workshops in France and Europe"
          ],
          "id": "4",
          "position": "Trainer"
        },
        {
          "accomplishments": [
            "Team manager (2 years with a team of 5 technical consultants)",
            "Participate in Strategy meetings with executive team"
          ],
          "id": "3",
          "position": "Manager"
        }
      ]
