[
        {
          "accomplishments": [],
          "company": "ORACLE",
          "competencies": [
            "Oracle Cloud",
            "Cloud Analytics",
            "Lift&Shift",
            "CI/CD"
          ],
          "customers": [],
          "dates": "August 2020 – ",
          "id": "AORACLE",
          "location": "Rennes, France",
          "position": "Technology & Cloud Architect",
          "summary": "Solutions architect with strong technical expertise based on 20+ years’ experience helping customers design, implement and maintain their IT solutions, on Premise or in the Cloud."
        },
        {
          "accomplishments": [
            "Solution Architect on Oracle products (JD Edwards, WebLogic, Database, ...)",
            "Certified Cloud Cloud Architect (AWS & Oracle)",
            "Consultant with Redfaire International"
          ],
          "company": "SOLAR PACE",
          "competencies": [
            "JD Edwards",
            "Oracle Cloud IaaS/PaaS",
            "Oracle Jet",
            "Docker",
            "Oracle WebLogic",
            "Oracle WebCenter",
            "Oracle Database",
            "REST / SOAP"
          ],
          "customers": [],
          "dates": "February 2019 – Current",
          "id": "ASOLARPACE",
          "location": "Rennes, France",
          "position": "Solutions Architect",
          "summary": "Owner"
        },
        {
          "accomplishments": [
            "Develop Cloud Architecture design, pricing and Sales proposals (IaaS, PaaS)",
            "Develop and implement JD Edwards, WebCenter, BPM architecture design, sizing, proposals",
            "Develop and build Integrations between products (JDE-Third parties, Cloud-On Premise, ...)",
            "Responsible for Technical projects delivery",
            "Responsible of delivery of Proof-of-Concept environments during sales processes (JD Edwards, Chatbots, PaaS, BPM, PCS, ICS, Content & Experience, ...)",
            "Team Manager (2 years with a team of 5 technical consultants)",
            "Responsible for staying abreast of current technologies, industry trends and develop advanced expertise with Oracle and Open Source technologies",
            "Develop and build JD Edwards Monitoring solution (with Prometheus, custom exporters and Grafana) and AP Automation Reporting Solution (Elastic, Logstash, Kibana)",
            "Responsible of Redfaire lab, sandbox and demo environments (JD Edwards, Webcenter, SOA, BPM, ...)",
            "Deliver product and technical presentations/trainings",
            "Effectively present to diverse audiences across business, product and technical topics",
            "Contribute to Company “Internet-facing” and internal blogs, publications",
            "Represent Redfaire at Oracle Partners events (EMEA, Open World, User Groups)"
          ],
          "company": "REDFAIRE",
          "competencies": [
            "JD Edwards",
            "Oracle Cloud IaaS/PaaS",
            "Oracle Jet",
            "Docker",
            "Oracle WebLogic",
            "Oracle WebCenter",
            "Oracle Database",
            "REST / SOAP"
          ],
          "customers": [
            "Circle K",
            "Ipsos",
            "Vinci",
            "Monin",
            "Saria",
            "Daucy",
            "Azadea (Lebanon)",
            "Havas",
            "Ageas (UK)",
            "Bibby (UK)",
            "Groupe Cahors",
            "Rians",
            "Chart (USA)"
          ],
          "dates": "August 2012 – January 2019",
          "id": "FREDFAIRE",
          "location": "Paris, France",
          "position": "Solutions Architect",
          "summary": "Responsible for technical project planning, design, build and delivery for our international customers around Oracle products and services : IaaS, JD Edwards, WebLogic, BPM, Mobile, ..."
        },
        {
          "accomplishments": [
            "Developed target ERP architecture designs (QAD, JD Edwards)",
            "Responsible of ERP (QAD, JD Edwards) installations, administration trainings and technical support",
            "Delivered trainings for JD Edwards, QAD, ODI, WebLogic ...",
            "Involvement in the complete lifecycle of the projects (design, implementation, integration, UAT, training, Go Live, maintenance)",
            "Delivered installation, administration, audits for additional Oracle products (Oracle Virtual Server, BI Publisher, WebServices, WebLogic, ODI, WebCenter ...",
            "Provided support services for both customers and consultants as part of the support center. Effectively presented to diverse audiences during sales processes, user group events",
            "Developed and built new Call Center solution (MySQL, PHP)"
          ],
          "company": "SOPRA GROUP",
          "competencies": [
            "JD Edwards",
            "Oracle WebLogic",
            "QAD",
            "OpenEdge / Progress",
            "PHP",
            "REST / SOAP"
          ],
          "customers": [
            "Yoplait",
            "AsteelFlash",
            "DeltaDore",
            "Zodiac",
            "Multiburo",
            "Kohler",
            "Gemalto",
            "Roxel",
            "Saft",
            "Asselin",
            "Wesco",
            "Giannoni",
            "Stryker"
          ],
          "dates": "Sept 1998 – August 2012",
          "id": "ZSOPRAGROUP",
          "location": "Rennes, France",
          "position": "Technical Consultant / Architect",
          "summary": "Responsible for technical project planning, design, build and delivery for our international customers around QAD and JD Edwards"
        }
      ]
