{
    "dev": {
        "django_settings": "telerad_portal_api.settings",
        "aws_region": "ap-southeast-1",
        "profile_name": "default",
        "project_name": "telerad-portal-api",
        "runtime": "python3.6",
        "memory_size": 1024,
        "xray_tracing": true,
        "s3_bucket": "telerad-portal-api-code-dev",
        "exclude": ["local_settings.py", "db.sqlite3", "static", "_sqlite.so"],
        "environment_variables": {
            "ENV_TYPE": "dev",
            "SECRET_KEY": "=)c9a2rqlync$pj5btiw!hc$ek9crw-r4ny3o+m^=7@tdso+@)"
        },
        "certificate_arn": "arn:aws:acm:us-east-1:194130111156:certificate/5378d373-695f-44b8-9ec9-2b7e8e0d2486",
        "domain": "dev-telerad-portal-api.alem.health",
        "cors": {
          "allowed_headers": [
            "X-AH-Audit",
            "Content-Type",
            "X-Amz-Date",
            "Authorization",
            "X-Api-Key",
            "X-Amz-Security-Token"
          ],
          "allowed_methods": [
            "GET",
            "HEAD",
            "POST",
            "OPTIONS",
            "PUT",
            "DELETE"
          ],
          "allowed_origin": "*"
        },
        "timeout_seconds": 60,
        "vpc_config": {
            "SubnetIds": [ "subnet-d581bc9c", "subnet-26363a41" ],
            "SecurityGroupIds": [ "sg-5cf64324" ]
        }
    },
    "staging": {
        "django_settings": "telerad_portal_api.settings",
        "aws_region": "ap-southeast-1",
        "profile_name": "default",
        "project_name": "telerad-portal-api",
        "runtime": "python3.6",
        "memory_size": 1536,
        "xray_tracing": true,
        "s3_bucket": "telerad-portal-api-code-staging",
        "exclude": ["local_settings.py", "db.sqlite3", "static", "_sqlite.so"],
        "environment_variables": {
            "ENV_TYPE": "staging",
            "SECRET_KEY": "l0ytm-uh$f7trqn_xs*%1s#8c-^^5hqqb(1f+ca=8p6h64q@j%"
        },
        "certificate_arn": "arn:aws:acm:us-east-1:194130111156:certificate/b0718aaf-8cdd-4623-82d6-31a7d5c35023",
        "domain": "staging-telerad-portal-api.alem.health",
        "cors": {
          "allowed_headers": [
            "X-AH-Audit",
            "Content-Type",
            "X-Amz-Date",
            "Authorization",
            "X-Api-Key",
            "X-Amz-Security-Token"
          ],
          "allowed_methods": [
            "GET",
            "HEAD",
            "POST",
            "OPTIONS",
            "PUT",
            "DELETE"
          ],
          "allowed_origin": "*"
        },
        "timeout_seconds": 60,
        "vpc_config": {
            "SubnetIds": [ "subnet-25363a42", "subnet-9787bade" ],
            "SecurityGroupIds": [ "sg-5cf64324" ]
        }
    }
}
