
<svg width="26px" height="25px" viewBox="0 0 26 25" version="1.1" xmlns="http://www.w3.org/2000/svg" xmlns:xlink="http://www.w3.org/1999/xlink">
    <!-- Generator: Sketch 43.1 (39012) - http://www.bohemiancoding.com/sketch -->
    <desc>Created with Sketch.</desc>
    <defs>
        <ellipse id="path-1" cx="17.037037" cy="5.92307692" rx="5.96296296" ry="5.92307692"></ellipse>
    </defs>
    <g id="Page-1" stroke="none" stroke-width="1" fill="none" fill-rule="evenodd">
        <g id="Study" transform="translate(-1143.000000, -18.000000)">
            <g id="top-bar">
                <g id="Group-8" transform="translate(1143.000000, 21.000000)">
                    <g id="Group-7">
                        <g id="Group-4">
                            <path d="M20.3096937,18.0920143 C20.3096937,17.5376143 19.8570804,17.0869286 19.2979979,17.0869286 C17.9010825,17.0869286 16.7686794,15.9621 16.7686794,14.5742143 L16.7686794,8.54338571 C16.7686794,5.39958571 14.5208005,2.77482857 11.5260545,2.15097143 C11.6190767,1.9558 11.6728651,1.738 11.6728651,1.50747143 C11.6730233,0.675085714 10.9932333,0 10.1549259,0 C9.31661852,0 8.63714497,0.675085714 8.63714497,1.50825714 C8.63714497,1.73878571 8.69077513,1.95658571 8.78379735,2.15175714 C5.78936772,2.77561429 3.54148889,5.40037143 3.54148889,8.54417143 L3.54148889,14.5748429 C3.54148889,15.9627286 2.40892751,17.0875571 1.01185397,17.0875571 C0.45292963,17.0875571 -1.77635684e-15,17.5376143 -1.77635684e-15,18.0926429 C-1.77635684e-15,18.6475143 0.452771429,19.0977286 1.01185397,19.0977286 L3.54148889,19.0977286 L8.13105979,19.0977286 C8.13105979,20.6245286 9.03739365,21.8620286 10.1549259,21.8620286 C11.2724582,21.8620286 12.1786339,20.6245286 12.1786339,19.0977286 C12.1786339,17.5709286 16.7686794,19.0977286 16.7686794,19.0977286 L19.2979979,19.0977286 C19.8570804,19.0969429 20.3096937,18.6472 20.3096937,18.0920143 L13.1835938,31.65625" id="Shape" fill="#FFFFFF"></path>
                            <g id="Oval-5">
                                <use fill="#F3B13A" fill-rule="evenodd" xlink:href="#path-1"></use>
                                <ellipse stroke="#1E88E5" stroke-width="3" cx="17.037037" cy="5.92307692" rx="7.46296296" ry="7.42307692"></ellipse>
                            </g>
                            <text id="2" font-family=".AppleSystemUIFont" font-size="8.46153846" font-weight="normal" fill="#FFFFFF">
                                <tspan x="14.7654321" y="8">2</tspan>
                            </text>
                        </g>
                    </g>
                </g>
            </g>
        </g>
    </g>
</svg>