[start]
20180109	1100	20300101	1100	50700	999999	0	0	0	1	0	0	0	0	10000	0	0	0	0	0	0	0	0	0	
20170101	0	20300101	0	80200	999999	0	0	2	3	0	30	0	0	0	0	7500	0	2000	0	500	0	0	0		0	30	0	0	0	0	7500	0	2000	0	500	0	0	0		0	30	0	0	0	0	7500	0	2000	0	500	0	0	0	
20170101	0	20300101	0	80200	999999	0	0	3	3	0	75	0	0	0	0	7500	0	2000	0	500	0	0	0		0	75	0	0	0	0	7500	0	2000	0	500	0	0	0		0	75	0	0	0	0	7500	0	2000	0	500	0	0	0	
20201009	1100	20300101	1100	90900	999999	0	0	1	4	-1	0	0	0	0	0	0	0	0	0	0	0	0	0		-1	0	0	0	0	0	0	0	0	0	0	0	0	0		-1	0	0	0	0	0	0	0	0	0	0	0	0	0		525	0	0	0	0	0	0	0	0	0	10000	0	0	0	울트라 슈퍼 레어 캐릭터를 반드시 뽑을 수 있는 ★플래티넘 뽑기★
20201113	1100	20300101	1100	91000	999999	0	0	1	4	-1	0	0	0	0	0	0	0	0	0	0	0	0	0		-1	0	0	0	0	0	0	0	0	0	0	0	0	0		-1	0	0	0	0	0	0	0	0	0	0	0	0	0		543	0	0	0	0	0	0	0	0	0	10000	0	0	0	울트라 슈퍼 레어 캐릭터 100% 획득 가능! ★플래티넘 뽑기★
20210212	000	20300101	1100	100200	999999	0	0	1	4	-1	0	0	0	0	0	0	0	0	0	0	0	0	0		-1	0	0	0	0	0	0	0	0	0	0	0	0	0		-1	0	0	0	0	0	0	0	0	0	0	0	0	0		556	0	0	0	0	0	0	0	0	0	10000	0	0	0	울트라 슈퍼 레어 캐릭터 100% 획득 가능! ★플래티넘 뽑기★
20210301	1100	20210315	1100	100201	999999	0	0	1	1	516	150	0	0	0	0	7000	0	2500	0	500	0	0	0	새로운 울슈레 5개! 사도가 참전한 콜라보 뽑기 2nd 신등장!!★자세한 내용은 배너를 탭!
20210301	1100	20210315	1100	100201	999999	0	0	1	2	-1	0	0	0	0	0	0	0	0	0	0	0	0	0		570	150	0	0	0	0	7000	0	2500	0	500	0	0	0	에반게리온 메인 콜라보 뽑기 복각 개최!★자세한 내용은 배너를 탭!
20210305	1100	20210315	1100	100201	999999	0	0	1	2	-1	0	0	0	0	0	0	0	0	0	0	0	0	0		516	150	0	0	0	0	7000	0	2500	0	500	0	0	0	새로운 울슈레 5개! 사도가 참전한 콜라보 뽑기 2nd 신등장!!★자세한 내용은 배너를 탭!
20210305	1100	20210315	1100	100201	999999	0	0	1	3	-1	0	0	0	0	0	0	0	0	0	0	0	0	0		-1	0	0	0	0	0	0	0	0	0	0	0	0	0		570	150	0	0	0	0	7000	0	2500	0	500	0	0	0	에반게리온 메인 콜라보 뽑기 복각 개최!★자세한 내용은 배너를 탭!
20210308	1100	20210315	1100	100201	999999	0	0	1	1	516	150	0	0	0	0	7000	0	2500	0	500	0	0	0	새로운 울슈레 5개! 사도가 참전한 콜라보 뽑기 2nd 신등장!!★자세한 내용은 배너를 탭!
20210308	1100	20210315	1100	100201	999999	0	0	1	2	-1	0	0	0	0	0	0	0	0	0	0	0	0	0		570	150	0	0	0	0	7000	0	2500	0	500	0	0	0	에반게리온 메인 콜라보 뽑기 복각 개최!★자세한 내용은 배너를 탭!
20210310	1100	20210312	1100	100201	999999	0	0	1	3	-1	0	0	0	0	0	0	0	0	0	0	0	0	0		-1	0	0	0	0	0	0	0	0	0	0	0	0	0		427	150	0	0	0	0	6970	0	2500	0	500	0	30	0	★검은 적에 강한 멋진 환수들! 자세한 내용은 배너를 클릭!★
20210312	1100	20210315	1100	100201	999999	0	0	1	1	516	150	0	0	0	0	7000	0	2500	0	500	1	0	0	새로운 울슈레 5개! 사도가 참전한 콜라보 뽑기 2nd 신등장!!★자세한 내용은 배너를 탭!
20210312	1100	20210315	1100	100201	999999	0	0	1	2	-1	0	0	0	0	0	0	0	0	0	0	0	0	0		570	150	0	0	0	0	7000	0	2500	0	500	1	0	0	에반게리온 메인 콜라보 뽑기 복각 개최!★자세한 내용은 배너를 탭!
20210312	1100	20210315	1100	100201	999999	0	0	1	3	-1	0	0	0	0	0	0	0	0	0	0	0	0	0		-1	0	0	0	0	0	0	0	0	0	0	0	0	0		424	150	0	0	0	0	6970	0	2500	0	500	1	30	0	세계 최강 전력의 냥코 군단!★자세한 내용은 배너를 클릭!
20210316	1100	20210402	0	100300	999999	0	0	0	4	-1	0	0	0	0	0	0	0	0	0	0	0	0	0		-1	0	0	0	0	0	0	0	0	0	0	0	0	0		-1	0	0	0	0	0	0	0	0	0	0	0	0	0		60	0	300	0	0	0	5100	0	3500	0	1400	0	0	0	【기간한정】고양이 드링크와 XP를 GET할 수 있는 특별 뽑기!★ 4월 1일까지!
20210315	1100	20210329	1100	100300	999999	0	0	1	2	-1	0	0	0	0	0	0	0	0	0	0	0	0	0		584	150	0	0	0	0	7000	0	2500	0	500	0	0	0	콜라보 한정 캐릭터 총 12개 참전! '하츠네 미쿠' 올해 마지막 뽑기!★자세한 내용은 배너를 탭!
20210315	1100	20210317	1100	100300	999999	0	0	1	3	-1	0	0	0	0	0	0	0	0	0	0	0	0	0		-1	0	0	0	0	0	0	0	0	0	0	0	0	0		517	150	0	0	0	0	6970	0	2500	0	500	0	30	0	신 캐릭터 ★오이루가★ 참전! 수수께끼 투성이의 생명체들! 자세한 내용은 배너를 클릭!
20210317	1100	20210319	1100	100300	999999	0	0	1	3	-1	0	0	0	0	0	0	0	0	0	0	0	0	0		-1	0	0	0	0	0	0	0	0	0	0	0	0	0		497	150	0	0	0	0	6970	0	2500	0	500	0	30	0	냥코 월드의 위대한 신들이 이곳에 집결!★자세한 내용은 배너를 클릭!
20210319	1100	20210322	1100	100300	999999	0	0	1	1	542	150	0	0	0	0	6500	0	2600	0	900	0	0	0	울트라 슈퍼 레어 캐릭터가 총집합!★확률도 초 UP된 하이퍼 고양이 축제 개최 중!
20210322	1100	20210324	1100	100300	999999	0	0	1	3	-1	0	0	0	0	0	0	0	0	0	0	0	0	0		-1	0	0	0	0	0	0	0	0	0	0	0	0	0		433	150	0	0	0	0	6970	0	2500	0	500	0	30	0	압도적인 존재감을 내뿜는 강력한 드래곤들!★자세한 내용은 배너를 클릭!
20210324	1100	20210326	1100	100300	999999	0	0	1	3	-1	0	0	0	0	0	0	0	0	0	0	0	0	0		-1	0	0	0	0	0	0	0	0	0	0	0	0	0		538	150	0	0	0	0	6970	0	2500	0	500	0	30	0	신 캐릭터 '돌의 정령 롤링스톤' 참전! 개성적이고 유쾌한 정령들!★자세한 내용은 배너를 클릭!
20210326	1100	20210329	1100	100300	999999	0	0	1	2	-1	0	0	0	0	0	0	0	0	0	0	0	0	0		584	150	0	0	0	0	7000	0	2500	0	500	1	0	0	콜라보 한정 캐릭터 총 12개 참전! '하츠네 미쿠' 올해 마지막 뽑기!★자세한 내용은 배너를 탭!
20210326	1100	20210329	1100	100300	999999	0	0	1	3	-1	0	0	0	0	0	0	0	0	0	0	0	0	0		-1	0	0	0	0	0	0	0	0	0	0	0	0	0		487	150	0	0	0	0	6970	0	2500	0	500	1	30	0	정의와 어둠의 힘을 둘 다 갖춘 냥코 군단의 구세주들!★자세한 내용은 배너를 탭!
[end]
