[start]
20160101	0	20300101	0	50700	999999	0	0	1	1	0	150	0	0	0	0	7500	0	2000	0	500	0	0	0	여기에서만 얻을 수 있는 레어 캐릭터가 100% 출현!!
20180109	1100	20300101	1100	50700	999999	0	0	0	1	0	0	0	0	10000	0	0	0	0	0	0	0	0	0	
20170101	0	20300101	0	50700	999999	0	0	2	2	0	30	0	0	0	0	7500	0	2000	0	500	0	0	0		0	30	0	0	0	0	7500	0	2000	0	500	0	0	0	
20170101	0	20300101	0	50700	999999	0	0	3	2	0	75	0	0	0	0	7500	0	2000	0	500	0	0	0		0	75	0	0	0	0	7500	0	2000	0	500	0	0	0	
20181013	1100	20300101	1100	70400	999999	0	0	1	4	-1	150	0	0	0	0	7500	0	2000	0	500	0	0	0		-1	150	0	0	0	0	7500	0	2000	0	500	0	0	0		-1	150	0	0	0	0	7500	0	2000	0	500	0	0	0		320	0	0	0	0	0	0	0	0	0	10000	0	0	0	울트라 슈퍼 레어 캐릭터를 반드시 뽑을 수 있는 「플래티넘 뽑기」
20190213	1100	20190215	1100	80200	999999	0	0	1	1	351	150	0	0	0	0	7000	0	2500	0	500	0	0	0	★우주에서 온 개성 넘치는 깜찍한 정령들! 【대정령 엘레멘탈 픽시즈】 등장!★
20190215	1100	20190218	1100	80200	999999	0	0	1	1	361	150	0	0	0	0	6500	0	2600	0	900	0	0	0	★한정 캐릭터 「호걸 달타냥」 참전!★울슈레 확률 지금만 초 UP★
20190216	1100	20190302	0	80200	999999	0	0	0	2	-1	0	300	0	0	0	5100	0	3500	0	1400	0	0	0		19	0	300	0	0	0	5100	0	3500	0	1400	0	0	0	【기간한정】고양이 드링크와 XP를 GET할 수 있는 특별 뽑기!★ 3월 1일 까지!
20190218	1100	20190220	1100	80200	999999	0	0	1	1	273	150	0	4	0	0	7000	0	2500	0	500	0	0	0	★메탈 적에 강한 【메탈 바스터즈】 등장! 보너스☆UP 뽑기 개최 중!!★
20190220	1100	20190222	1100	80200	999999	0	0	1	1	342	150	0	0	0	0	7000	0	2500	0	500	0	0	0	★진화로 특수능력이 변화! 두가지 능력을 가진 머~찐 영웅들  【다크 히어로즈】  등장!★
20190222	1100	20190225	1100	80200	999999	0	0	1	1	369	150	0	0	0	0	6970	0	2500	0	500	1	30	0	★세계 최강 전력의 냥코 군단! 시크릿 참전!?★10+1연속 뽑기 울슈레 1개 이상 확정!★
20190225	1100	20190311	1100	80201	999999	0	0	1	1	368	150	0	0	0	0	7000	0	2500	0	500	0	0	0	★극장판 「Fate/stay night [Heaven's Feel]」콜라보 뽑기!★자세한 내용은 배너를 클릭!!★
20190225	1100	20190227	1100	80200	999999	0	0	1	2	-1	150	0	0	0	0	7500	0	2000	0	500	0	0	0		330	150	0	0	0	0	6970	0	2500	0	500	0	30	0	★검은 적에게 강한 바사라즈! 비밀스럽게 무장하고 새롭게 참전?! ★자세한 내용은 배너를 클릭!!
20190227	1100	20190301	1100	80200	999999	0	0	1	2	-1	150	0	0	0	0	7500	0	2000	0	500	0	0	0		333	150	0	0	0	0	6970	0	2500	0	500	0	30	0	파워풀 & 큐트한 사이버학원 소녀전사들! 시크릿 참전!?★자세한 내용은 배너를 클릭! 
20190301	1100	20190304	1100	80200	999999	0	0	1	2	-1	150	0	0	0	0	7500	0	2000	0	500	0	0	0		360	150	0	0	0	0	6500	0	2600	0	900	0	0	0	★강력한 한정 캐릭터 「쾌걸 달타냥」 참전!★울슈레 확률 지금만 초 UP★
[end]
