Version 4
SHEET 1 1924 1252
WIRE 1056 608 1024 608
WIRE 1104 608 1056 608
WIRE 960 640 928 640
WIRE 1104 640 1104 608
WIRE 1184 640 1184 608
WIRE 1184 640 1104 640
WIRE 1376 640 1184 640
WIRE 1040 672 1024 672
WIRE 1184 672 1184 640
WIRE 1376 688 1376 640
WIRE 1376 688 1344 688
WIRE 928 704 928 640
WIRE 928 704 848 704
WIRE 1120 704 928 704
WIRE 1280 720 1248 720
WIRE 1424 720 1280 720
WIRE 928 736 848 736
WIRE 1120 736 928 736
WIRE 1360 752 1344 752
WIRE 1184 784 1184 768
WIRE 1184 784 1104 784
WIRE 1056 800 1056 608
WIRE 1056 800 1024 800
WIRE 1376 816 1376 688
WIRE 1376 816 1200 816
WIRE 928 832 928 736
WIRE 960 832 928 832
WIRE 1104 848 1104 784
WIRE 1136 848 1104 848
WIRE 1040 864 1040 672
WIRE 1040 864 1024 864
WIRE 1216 880 1200 880
WIRE 1360 880 1360 752
WIRE 1360 880 1216 880
WIRE 1040 896 1040 864
WIRE 1104 896 1104 848
WIRE 1216 928 1216 880
FLAG 1424 720 out
IOPIN 1424 720 Out
FLAG 848 704 inm
IOPIN 848 704 In
FLAG 848 736 inp
IOPIN 848 736 In
FLAG 1184 608 Vdd
IOPIN 1184 608 In
FLAG 1040 896 0
FLAG 1216 928 0
FLAG 1104 896 vbias
IOPIN 1104 896 In
SYMBOL op2 1184 736 R0
SYMATTR InstName X1
SYMBOL ESD_PAD 992 640 R0
SYMATTR InstName X2
SYMBOL ESD_PAD 992 832 R0
SYMATTR InstName X3
SYMBOL ESD_PAD 1312 720 R0
SYMATTR InstName X4
SYMBOL ESD_PAD 1168 848 R0
SYMATTR InstName X5
