*.MODEL YSS_SOI_PMOS PMOS
.MODEL Pch PMOS
+ LEVEL = 49
+ VERSION = 3.3
+ PARAMCHK = 1
+ BINUNIT = 1
+ MOBMOD = 1
+ CAPMOD = 3
+ NQSMOD = 0
+ ACNQSMOD = 0
+ NOIMOD = 1
+ VTH0 = -0.55077
+ K1 = 0.0010275
+ K2 = 0
+ K3 = 80
+ K3B = 0
+ W0 = 2.5E-006
+ NLX = 1.74E-007
+ VBM = -3
+ DVT0 = 2.2
+ DVT1 = 0.53
+ DVT2 = -0.032
+ DVT0W = 0
+ DVT1W = 5300000
+ DVT2W = -0.032
+ U0 = 250
+ UA = 2.25e-09
+ UB = 5.87e-19
+ UC = -4.65e-11
+ VSAT = 80000
+ A0 = 1
+ AGS = 0.01
+ B0 = 0
+ B1 = 0
+ KETA = -0.047
+ A1 = 0
+ A2 = 1
+ RDSW = 72368.0124
+ PRWG = 0
+ PRWB = 0
+ WR = 1
+ LINT = 1.35e-06
+ WINT = -1.35e-06
+ DWG = 0
+ DWB = 0
+ VOFF = -0.08
+ NFACTOR = 0.78076
+ ETA0 = 1.9999
+ ETAB = -0.07
+ DSUB = 0.56
+ CIT = 0
+ CDSC = 0.00024
+ CDSCD = 0
+ CDSCB = 0
+ PCLM = 1.3
+ PDIBLC1 = 0.39
+ PDIBLC2 = 0.0086
+ PDIBLCB = 0
+ DROUT = 0.56
+ PSCBE1 = 4.24E+008
+ PSCBE2 = 1E-005
+ PVAG = 0
+ DELTA = 0.01
+ NGATE = 0
+ ALPHA0 = 0
+ ALPHA1 = 0
+ BETA0 = 30
+ RSH = 0
+ JSW = 0
+ JS = 0.0001
+ IJTH = 0.1
+ XPART = 0
+ VOFFCV = 0
+ CGSO = 0
+ CGDO = 0
+ CGBO = 0
+ CJ = 0.0005
+ MJ = 0.5
+ MJSW = 0.33
+ CJSW = 5E-010
+ CJSWG = 5E-010
+ MJSWG = 0.33
+ PBSW = 1
+ PB = 1
+ PBSWG = 1
+ CGSL = 0
+ CGDL = 0
+ CKAPPA = 0.6
+ CLC = 1E-007
+ CLE = 0.6
+ DLC = 0
+ DWC = 0
+ VFBCV = -1
+ NOFF = 1
+ VOFFCV = 0
+ ACDE = 1
+ MOIN = 15
+ ELM = 5
+ WL = 0
+ WLN = 1
+ WW = 0
+ WWN = 1
+ WWL = 0
+ LL = 0
+ LLN = 1
+ LW = 0
+ LWN = 1
+ LWL = 0
+ LLC = 0
+ LWC = 0
+ LWLC = 0
+ WLC = 0
+ WWC = 0
+ WWLC = 0
+ TNOM = 27
+ UTE = -1.5
+ KT1 = -0.11
+ KT1L = 0
+ KT2 = -0.022
+ UA1 = 4.31E-009
+ UB1 = -7.61E-018
+ UC1 = -5.6E-011
+ AT = 33000
+ PRT = 0
+ NJ = 1
+ XTI = 3
+ TPB = 0
+ TPBSW = 0
+ TPBSWG = 0
+ TCJ = 0
+ TCJSW = 0
+ TCJSWG = 0
+ NOIA = 1E+020
+ NOIB = 50000
+ NOIC = -1.4E-012
+ EM = 41000000
+ AF = 1
+ EF = 1
+ KF = 0
+ LINTNOI = 0
+ TOX = 2e-08
+ XJ = 1.5E-007
+ NCH = 1.7E+017
+ NSUB = 6E+016
+ XT = 1.55E-007
+ BINUNIT = 1
+ LMIN = 0
+ LMAX = 1
+ WMIN = 0
+ WMAX = 1


