Version 4
SHEET 1 1620 1256
WIRE 1280 688 704 688
WIRE 1280 704 1280 688
WIRE 896 736 832 736
WIRE 1024 736 992 736
WIRE 1152 736 1024 736
WIRE 1216 736 1152 736
WIRE 1408 752 1344 752
WIRE 1488 752 1408 752
WIRE 1616 752 1488 752
WIRE 832 768 832 736
WIRE 1216 768 1152 768
WIRE 1152 800 1152 768
WIRE 1152 800 1088 800
WIRE 704 848 704 688
WIRE 1088 896 1088 800
WIRE 704 1072 704 928
WIRE 832 1072 832 848
WIRE 832 1072 704 1072
WIRE 1088 1072 1088 976
WIRE 1088 1072 832 1072
WIRE 1024 1104 1024 736
WIRE 1216 1104 1024 1104
WIRE 1488 1104 1488 752
WIRE 1488 1104 1312 1104
WIRE 832 1152 832 1072
FLAG 832 1152 0
FLAG 1152 736 inm
FLAG 1152 768 inp
FLAG 1408 752 out
SYMBOL MinedaLIB\\RES_MIN 992 736 R90
WINDOW 0 -16 48 VBottom 2
WINDOW 3 16 48 VTop 2
SYMATTR InstName R2
SYMATTR Value 10k
SYMATTR Value2 10k
SYMBOL MinedaLIB\\RES_MIN 1312 1104 R90
WINDOW 0 -16 48 VBottom 2
WINDOW 3 16 48 VTop 2
SYMATTR InstName R3
SYMATTR Value 100k
SYMATTR Value2 100k
SYMBOL voltage 704 832 R0
SYMATTR InstName V1
SYMATTR Value 5
SYMBOL voltage 832 752 R0
WINDOW 123 24 124 Left 2
WINDOW 39 0 0 Left 2
SYMATTR Value2 AC 1
SYMATTR InstName V2
SYMATTR Value SINE(2.5 0.1 1k)
SYMBOL voltage 1088 880 R0
SYMATTR InstName V3
SYMATTR Value 2.5
SYMBOL op2_apsCap_PADS 1280 768 R0
SYMATTR InstName X1
TEXT 888 1216 Left 2 !.include ../../models/SOI_CMOS
TEXT 672 1240 Left 2 !.tran 10m
TEXT 888 1176 Left 2 ;.param cc=1p
