* Z:\home\seijirom\Dropbox\work\Mineda2021_2#1\OpAMP\cdraw\op2_tb.asc
R2 inm N002 10k 10k
R3 out inm 100k 100k
V1 N001 0 5
V2 N002 0 SINE(2.5 0.1 1k) AC 1
V3 inp 0 2.5
XX1 inm inp N001 out NC_01 op2_pads

* block symbol definitions
.subckt op2_pads inm inp Vdd out vbias
XX1 inm inp Vdd out vbias op2
XX2 inm Vdd 0 esd_pad
XX3 inp Vdd 0 esd_pad
XX4 out Vdd 0 esd_pad
XX5 vbias Vdd 0 esd_pad
.ends op2_pads

.subckt op2 inm inp Vdd out vbias
M2 N001 inm N003 N003 nch l=10u w=20u
M3 N003 vbias 0 0 nch l=10u w=20u
M6 N002 inp N003 N003 nch l=10u w=20u
M5 N002 N001 Vdd Vdd pch l=10u w=40u
M4 N001 N001 Vdd Vdd pch l=10u w=40u
M1 vbias vbias 0 0 nch l=10u w=20u
R1 Vdd vbias 100k
M8 out vbias 0 0 nch l=10u w=20u
M7 out N002 Vdd Vdd pch l=10u w=40u
C1 P001 out 10p
R4 P001 N002 10k
.ends op2

.subckt esd_pad IN VDD VSS
M1 VDD VDD IN VDD pch l=10um w=300um
M2 IN IN VSS IN pch l=10um w=300um
.ends esd_pad

.model NMOS NMOS
.model PMOS PMOS
.lib C:\users\seijirom\My Documents\LTspiceXVII\lib\cmp\standard.mos
.include ../../models/SOI_CMOS
.tran 10m
* .param cc=1p
.backanno
.end
