.TITLE KICAD SCHEMATIC
*.INCLUDE "MODELS/SOI_CMOS"
*V1 "/SHEET603DAC43/VDD" GND DC(5)
*V3 "/SHEET603DAC43/INP" GND DC(2.5)
*V2 NET__R2_PAD1_ GND AC 1 SIN(2.5 0.1 1K)
*R2 NET__R2_PAD1_ "/SHEET603DAC43/INM" 10K
*R3 "/SHEET603DAC43/INM" OUT 100K
M2 NET__M2_PAD1_ "/SHEET603DAC43/INM" NET__M2_PAD3_ NET__M2_PAD3_ NCH L=10U W=20U
M3 NET__M2_PAD3_ NET__M1_PAD1_ GND GND NCH L=10U W=20U
M6 NET__C1_PAD1_ "/SHEET603DAC43/INP" NET__M2_PAD3_ NET__M2_PAD3_ NCH L=10U W=20U
M5 NET__C1_PAD1_ NET__M2_PAD1_ "/SHEET603DAC43/VDD" "/SHEET603DAC43/VDD" PCH L=10U W=40U
M4 NET__M2_PAD1_ NET__M2_PAD1_ "/SHEET603DAC43/VDD" "/SHEET603DAC43/VDD" PCH L=10U W=40U
M1 NET__M1_PAD1_ NET__M1_PAD1_ GND GND NCH L=10U W=20U
R1 "/SHEET603DAC43/VDD" NET__M1_PAD1_ 100K
M8 OUT NET__M1_PAD1_ GND GND NCH L=10U W=20U
M7 OUT NET__C1_PAD1_ "/SHEET603DAC43/VDD" "/SHEET603DAC43/VDD" PCH L=10U W=40U
C1 NET__C1_PAD1_ NET__C1_PAD2_ 10P
R4 NET__C1_PAD2_ OUT 10K
.END
