Version 4
SHEET 1 1536 2968
WIRE 784 0 720 0
WIRE 784 80 784 0
WIRE 784 80 608 80
WIRE 960 80 784 80
WIRE 608 112 608 80
WIRE 608 112 576 112
WIRE 784 112 784 80
WIRE 960 112 960 80
WIRE 992 112 960 112
WIRE 512 144 464 144
WIRE 640 144 512 144
WIRE 912 144 880 144
WIRE 1056 144 928 144
WIRE 1072 144 1056 144
WIRE 624 176 576 176
WIRE 992 176 944 176
WIRE 928 192 928 144
WIRE 928 192 896 192
WIRE 608 208 608 112
WIRE 608 208 576 208
WIRE 960 208 960 112
WIRE 992 208 960 208
WIRE 512 240 464 240
WIRE 640 240 512 240
WIRE 896 240 896 192
WIRE 896 240 880 240
WIRE 912 240 912 144
WIRE 1056 240 912 240
WIRE 1072 240 1056 240
WIRE 624 272 624 176
WIRE 624 272 576 272
WIRE 944 272 944 176
WIRE 992 272 944 272
WIRE 624 304 624 272
WIRE 784 304 784 272
WIRE 784 304 624 304
WIRE 944 304 944 272
WIRE 944 304 784 304
WIRE 784 416 784 304
WIRE 784 416 720 416
FLAG 1072 144 -OUT
IOPIN 1072 144 Out
FLAG 1072 240 +OUT
IOPIN 1072 240 Out
FLAG 720 0 VDD
IOPIN 720 0 In
FLAG 720 416 VSS
IOPIN 720 416 In
FLAG 464 240 +IN
IOPIN 464 240 In
FLAG 464 144 -IN
IOPIN 464 144 In
SYMBOL FFOTA_core 704 192 R0
SYMATTR InstName X1
SYMBOL ESD_PAD 544 144 R0
WINDOW 0 8 -56 Bottom 2
SYMATTR InstName X2
SYMBOL ESD_PAD 544 240 R0
WINDOW 0 8 -56 Bottom 2
SYMATTR InstName X3
SYMBOL ESD_PAD 1024 144 M0
WINDOW 0 72 14 Bottom 2
SYMATTR InstName X4
SYMBOL ESD_PAD 1024 240 M0
WINDOW 0 72 14 Bottom 2
SYMATTR InstName X5
