Version 4
SHEET 1 2028 680
WIRE -160 -32 -176 -32
WIRE 96 -32 -160 -32
WIRE 336 -32 96 -32
WIRE 576 -32 336 -32
WIRE 816 -32 576 -32
WIRE 1056 -32 816 -32
WIRE 1296 -32 1056 -32
WIRE 1536 -32 1296 -32
WIRE 1776 -32 1536 -32
WIRE 96 0 96 -32
WIRE 336 0 336 -32
WIRE 576 0 576 -32
WIRE 816 0 816 -32
WIRE 1056 0 1056 -32
WIRE 1296 0 1296 -32
WIRE 1536 0 1536 -32
WIRE 1776 0 1776 -32
WIRE 32 48 -96 48
WIRE 224 48 224 -96
WIRE 224 48 160 48
WIRE 272 48 224 48
WIRE 480 48 480 -96
WIRE 480 48 400 48
WIRE 512 48 480 48
WIRE 720 48 720 -96
WIRE 720 48 640 48
WIRE 752 48 720 48
WIRE 944 48 944 -96
WIRE 944 48 880 48
WIRE 992 48 944 48
WIRE 1184 48 1184 -96
WIRE 1184 48 1120 48
WIRE 1232 48 1184 48
WIRE 1424 48 1424 -96
WIRE 1424 48 1360 48
WIRE 1472 48 1424 48
WIRE 1664 48 1664 -96
WIRE 1664 48 1600 48
WIRE 1712 48 1664 48
WIRE 1904 48 1840 48
WIRE 32 96 16 96
WIRE 176 96 160 96
WIRE 272 96 256 96
WIRE 416 96 400 96
WIRE 512 96 496 96
WIRE 656 96 640 96
WIRE 752 96 736 96
WIRE 896 96 880 96
WIRE 992 96 976 96
WIRE 1136 96 1120 96
WIRE 1232 96 1216 96
WIRE 1376 96 1360 96
WIRE 1472 96 1456 96
WIRE 1616 96 1600 96
WIRE 1712 96 1696 96
WIRE 1856 96 1840 96
WIRE -160 224 -160 -32
WIRE -128 224 -160 224
WIRE 16 240 16 96
WIRE 16 240 -16 240
WIRE 256 240 256 96
WIRE 256 240 16 240
WIRE 496 240 496 96
WIRE 496 240 256 240
WIRE 736 240 736 96
WIRE 736 240 496 240
WIRE 976 240 976 96
WIRE 976 240 736 240
WIRE 1216 240 1216 96
WIRE 1216 240 976 240
WIRE 1456 240 1456 96
WIRE 1456 240 1216 240
WIRE 1696 240 1696 96
WIRE 1696 240 1456 240
WIRE -128 256 -208 256
WIRE 176 272 176 96
WIRE 176 272 -16 272
WIRE 416 272 416 96
WIRE 416 272 176 272
WIRE 656 272 656 96
WIRE 656 272 416 272
WIRE 896 272 896 96
WIRE 896 272 656 272
WIRE 1136 272 1136 96
WIRE 1136 272 896 272
WIRE 1376 272 1376 96
WIRE 1376 272 1136 272
WIRE 1616 272 1616 96
WIRE 1616 272 1376 272
WIRE 1856 272 1856 96
WIRE 1856 272 1616 272
WIRE -128 288 -160 288
WIRE -160 352 -160 288
WIRE -160 352 -320 352
WIRE 96 352 96 144
WIRE 96 352 -160 352
WIRE 336 352 336 144
WIRE 336 352 96 352
WIRE 576 352 576 144
WIRE 576 352 336 352
WIRE 816 352 816 144
WIRE 816 352 576 352
WIRE 1056 352 1056 144
WIRE 1056 352 816 352
WIRE 1296 352 1296 144
WIRE 1296 352 1056 352
WIRE 1536 352 1536 144
WIRE 1536 352 1296 352
WIRE 1776 352 1776 144
WIRE 1776 352 1536 352
WIRE -320 384 -320 352
WIRE 0 0 0 0
FLAG -176 -32 VDD
IOPIN -176 -32 In
FLAG -320 384 0
FLAG -96 48 IN
IOPIN -96 48 In
FLAG -208 256 CLK
IOPIN -208 256 In
FLAG 1904 48 OUT0
IOPIN 1904 48 Out
FLAG 1424 -96 OUT2
IOPIN 1424 -96 Out
FLAG 944 -96 OUT4
IOPIN 944 -96 Out
FLAG 1184 -96 OUT3
IOPIN 1184 -96 Out
FLAG 1664 -96 OUT1
IOPIN 1664 -96 Out
FLAG 720 -96 OUT5
IOPIN 720 -96 Out
FLAG 480 -96 OUT6
IOPIN 480 -96 Out
FLAG 224 -96 OUT7
IOPIN 224 -96 Out
SYMBOL NoOvClk -80 256 R0
SYMATTR InstName X1
SYMBOL Stage 96 64 R0
SYMATTR InstName X2
SYMBOL Stage 336 64 R0
SYMATTR InstName X3
SYMBOL Stage 576 64 R0
SYMATTR InstName X4
SYMBOL Stage 816 64 R0
SYMATTR InstName X5
SYMBOL Stage 1056 64 R0
SYMATTR InstName X6
SYMBOL Stage 1296 64 R0
SYMATTR InstName X7
SYMBOL Stage 1536 64 R0
SYMATTR InstName X8
SYMBOL Stage 1776 64 R0
SYMATTR InstName X9
TEXT -216 392 Left 2 !.include models.txt
TEXT -352 416 Left 2 !.tran 3m
