<svg width="28" height="28" viewBox="0 0 28 28" fill="none" xmlns="http://www.w3.org/2000/svg">
<path d="M15.3336 7.33307L12.6669 7.33307L12.6669 12.6664L7.33361 12.6664L7.33361 15.3331L12.6669 15.3331L12.6669 20.6664L15.3336 20.6664L15.3336 15.3331L20.6669 15.3331L20.6669 12.6664L15.3336 12.6664L15.3336 7.33307ZM14.0003 0.666404C6.64028 0.666404 0.666943 6.63974 0.666943 13.9997C0.666943 21.3597 6.64028 27.3331 14.0003 27.3331C21.3603 27.3331 27.3336 21.3597 27.3336 13.9997C27.3336 6.63974 21.3603 0.666404 14.0003 0.666404ZM14.0003 24.6664C8.12028 24.6664 3.33361 19.8797 3.33361 13.9997C3.33361 8.11974 8.12028 3.33307 14.0003 3.33307C19.8803 3.33307 24.6669 8.11974 24.6669 13.9997C24.6669 19.8797 19.8803 24.6664 14.0003 24.6664Z" fill="#747881"/>
</svg>
