<svg width="9" height="11" viewBox="0 0 9 11" fill="none" xmlns="http://www.w3.org/2000/svg">
<path fill-rule="evenodd" clip-rule="evenodd" d="M5.24427 1.89524L5.76384 1.19341C6.26639 0.514576 7.22588 0.375403 7.90059 0.883483C8.56755 1.38573 8.70478 2.33181 8.208 3.00285L7.66049 3.74242C6.69803 3.37412 5.85677 2.73408 5.24427 1.89524ZM6.4379 5.39388L3.94836 8.75671L3.94836 8.75672L3.94835 8.75673C3.58909 9.24201 3.40946 9.48465 3.1706 9.66185C2.93173 9.83906 2.64742 9.9406 2.07879 10.1437L1.359 10.4007C1.03956 10.5148 0.879838 10.5719 0.772503 10.492C0.665168 10.4121 0.673947 10.2427 0.691505 9.90398L0.732707 9.10909L0.732709 9.10908C0.763684 8.51145 0.779174 8.21264 0.87876 7.93512C0.978347 7.65759 1.15638 7.41711 1.51245 6.93613L4.01365 3.55755C4.68673 4.33335 5.51356 4.95817 6.4379 5.39388Z" fill="black"/>
</svg>
