<svg width="18" height="18" viewBox="0 0 18 18" fill="none" xmlns="http://www.w3.org/2000/svg">
<path d="M8.48553 2.54785H3.06753C2.65698 2.54785 2.26324 2.71094 1.97293 3.00125C1.68262 3.29156 1.51953 3.6853 1.51953 4.09585V14.9319C1.51953 15.3424 1.68262 15.7361 1.97293 16.0265C2.26324 16.3168 2.65698 16.4799 3.06753 16.4799H13.9035C14.3141 16.4799 14.7078 16.3168 14.9981 16.0265C15.2884 15.7361 15.4515 15.3424 15.4515 14.9319V9.51385" stroke="black" stroke-width="1.5" stroke-linecap="round" stroke-linejoin="round"/>
<path d="M14.2212 1.47677C14.5265 1.1715 14.9405 1 15.3723 1C15.804 1 16.218 1.1715 16.5233 1.47677C16.8286 1.78204 17.0001 2.19608 17.0001 2.6278C17.0001 3.05951 16.8286 3.47355 16.5233 3.77882L9.23346 11.0687L6.16406 11.836L6.93141 8.7666L14.2212 1.47677Z" stroke="black" stroke-width="1.5" stroke-linecap="round" stroke-linejoin="round"/>
</svg>
