<svg width="40" height="40" viewBox="0 0 40 40" fill="none" xmlns="http://www.w3.org/2000/svg">
<rect width="40" height="40" rx="20" fill="#0BDA51"/>
<path d="M12.0095 30L32 20L12.0095 10L12 17.7778L26.2857 20L12 22.2222L12.0095 30Z" fill="black"/>
</svg>
