<svg width="16" height="18" viewBox="0 0 16 18" fill="none" xmlns="http://www.w3.org/2000/svg">
<path d="M1 4.39209H2.50765H14.5689" stroke="#FA3838" stroke-width="1.5" stroke-linecap="round" stroke-linejoin="round"/>
<path d="M12.872 4.39222V14.7385C12.872 15.1434 12.7188 15.5316 12.4462 15.8179C12.1735 16.1042 11.8037 16.265 11.4182 16.265H4.14912C3.76355 16.265 3.39377 16.1042 3.12112 15.8179C2.84848 15.5316 2.69531 15.1434 2.69531 14.7385V4.39222M4.87603 4.053V2.5265C4.87603 2.12165 5.0292 1.73338 5.30184 1.4471C5.57448 1.16083 5.94426 1 6.32984 1H9.23746C9.62303 1 9.99281 1.16083 10.2655 1.4471C10.5381 1.73338 10.6913 2.12165 10.6913 2.5265V4.053" stroke="#FA3838" stroke-width="1.5" stroke-linecap="round" stroke-linejoin="round"/>
<path d="M6.08984 7.78467V12.873" stroke="#FA3838" stroke-width="1.5" stroke-linecap="round" stroke-linejoin="round"/>
<path d="M9.48047 7.78467V12.873" stroke="#FA3838" stroke-width="1.5" stroke-linecap="round" stroke-linejoin="round"/>
</svg>
