{
  "header_types" : [
    {
      "name" : "scalars_0",
      "id" : 0,
      "fields" : [
        ["userMetadata.metadata_register", 8, false]
      ]
    },
    {
      "name" : "standard_metadata",
      "id" : 1,
      "fields" : [
        ["ingress_port", 9, false],
        ["egress_spec", 9, false],
        ["egress_port", 9, false],
        ["instance_type", 32, false],
        ["packet_length", 32, false],
        ["enq_timestamp", 32, false],
        ["enq_qdepth", 19, false],
        ["deq_timedelta", 32, false],
        ["deq_qdepth", 19, false],
        ["ingress_global_timestamp", 48, false],
        ["egress_global_timestamp", 48, false],
        ["mcast_grp", 16, false],
        ["egress_rid", 16, false],
        ["checksum_error", 1, false],
        ["parser_error", 32, false],
        ["priority", 3, false],
        ["mp_egress_spec_1", 9, false],
        ["mp_egress_spec_2", 9, false],
        ["other_port", 9, false]
      ]
    },
    {
      "name" : "ipv4_header_t",
      "id" : 2,
      "fields" : [
        ["dst_addr", 32, false],
        ["ttl", 8, false]
      ]
    },
    {
      "name" : "invalid_header_t",
      "id" : 3,
      "fields" : [
        ["_invalid", 8, false]
      ]
    }
  ],
  "headers" : [
    {
      "name" : "scalars",
      "id" : 0,
      "header_type" : "scalars_0",
      "metadata" : true,
      "pi_omit" : true
    },
    {
      "name" : "standard_metadata",
      "id" : 1,
      "header_type" : "standard_metadata",
      "metadata" : true,
      "pi_omit" : true
    },
    {
      "name" : "ipv4_header",
      "id" : 2,
      "header_type" : "ipv4_header_t",
      "metadata" : false,
      "pi_omit" : true
    },
    {
      "name" : "invalid_header",
      "id" : 3,
      "header_type" : "invalid_header_t",
      "metadata" : false,
      "pi_omit" : true
    }
  ],
  "header_stacks" : [],
  "header_union_types" : [],
  "header_unions" : [],
  "header_union_stacks" : [],
  "field_lists" : [],
  "errors" : [
    ["NoError", 0],
    ["PacketTooShort", 1],
    ["NoMatch", 2],
    ["StackOutOfBounds", 3],
    ["HeaderTooShort", 4],
    ["ParserTimeout", 5],
    ["ParserInvalidArgument", 6]
  ],
  "enums" : [
    {
      "name" : "HashAlgorithm",
      "entries" : [
        ["crc16", 2],
        ["crc16_custom", 3],
        ["crc32", 0],
        ["crc32_custom", 1],
        ["csum16", 6],
        ["identity", 5],
        ["random", 4],
        ["xor16", 7]
      ]
    },
    {
      "name" : "MeterType",
      "entries" : [
        ["bytes", 1],
        ["packets", 0]
      ]
    },
    {
      "name" : "CounterType",
      "entries" : [
        ["bytes", 1],
        ["packets", 0],
        ["packets_and_bytes", 2]
      ]
    }
  ],
  "parsers" : [
    {
      "name" : "parser",
      "id" : 0,
      "init_state" : "start",
      "parse_states" : [
        {
          "name" : "start",
          "id" : 0,
          "parser_ops" : [
            {
              "parameters" : [
                {
                  "type" : "regular",
                  "value" : "ipv4_header"
                }
              ],
              "op" : "extract"
            }
          ],
          "transitions" : [
            {
              "type" : "default",
              "value" : null,
              "mask" : null,
              "next_state" : null
            }
          ],
          "transition_key" : []
        }
      ]
    }
  ],
  "parse_vsets" : [],
  "deparsers" : [
    {
      "name" : "deparser",
      "id" : 0,
      "source_info" : {
        "filename" : "complex.p4",
        "line" : 128,
        "column" : 8,
        "source_fragment" : "PacketDeparser"
      },
      "order" : ["ipv4_header"],
      "primitives" : []
    }
  ],
  "meter_arrays" : [],
  "counter_arrays" : [],
  "register_arrays" : [],
  "calculations" : [],
  "learn_lists" : [],
  "actions" : [
    {
      "name" : "ProcessIngress.process_ingress_ipv4.act_miss",
      "id" : 0,
      "runtime_data" : [],
      "primitives" : [
        {
          "op" : "mark_to_drop",
          "parameters" : [
            {
              "type" : "header",
              "value" : "standard_metadata"
            }
          ],
          "source_info" : {
            "filename" : "complex.p4",
            "line" : 64,
            "column" : 8,
            "source_fragment" : "mark_to_drop(standard_metadata)"
          }
        }
      ]
    },
    {
      "name" : "ProcessIngress.process_ingress_ipv4.act_hit",
      "id" : 1,
      "runtime_data" : [
        {
          "name" : "out_port",
          "bitwidth" : 9
        }
      ],
      "primitives" : [
        {
          "op" : "assign",
          "parameters" : [
            {
              "type" : "field",
              "value" : ["standard_metadata", "egress_spec"]
            },
            {
              "type" : "runtime_data",
              "value" : 0
            }
          ],
          "source_info" : {
            "filename" : "complex.p4",
            "line" : 68,
            "column" : 8,
            "source_fragment" : "standard_metadata.egress_spec = out_port"
          }
        }
      ]
    },
    {
      "name" : "complex91",
      "id" : 2,
      "runtime_data" : [],
      "primitives" : [
        {
          "op" : "assign",
          "parameters" : [
            {
              "type" : "field",
              "value" : ["scalars", "userMetadata.metadata_register"]
            },
            {
              "type" : "field",
              "value" : ["ipv4_header", "ttl"]
            }
          ],
          "source_info" : {
            "filename" : "complex.p4",
            "line" : 91,
            "column" : 12,
            "source_fragment" : "metadata.metadata_register = headers.ipv4_header.ttl"
          }
        }
      ]
    },
    {
      "name" : "complex95",
      "id" : 3,
      "runtime_data" : [],
      "primitives" : [
        {
          "op" : "assign",
          "parameters" : [
            {
              "type" : "field",
              "value" : ["invalid_header", "_invalid"]
            },
            {
              "type" : "hexstr",
              "value" : "0x01"
            }
          ],
          "source_info" : {
            "filename" : "complex.p4",
            "line" : 95,
            "column" : 12,
            "source_fragment" : "headers.invalid_header._invalid = 1"
          }
        }
      ]
    },
    {
      "name" : "complex119",
      "id" : 4,
      "runtime_data" : [],
      "primitives" : [
        {
          "op" : "assign",
          "parameters" : [
            {
              "type" : "field",
              "value" : ["ipv4_header", "ttl"]
            },
            {
              "type" : "expression",
              "value" : {
                "type" : "expression",
                "value" : {
                  "op" : "&",
                  "left" : {
                    "type" : "expression",
                    "value" : {
                      "op" : "+",
                      "left" : {
                        "type" : "field",
                        "value" : ["scalars", "userMetadata.metadata_register"]
                      },
                      "right" : {
                        "type" : "hexstr",
                        "value" : "0xff"
                      }
                    }
                  },
                  "right" : {
                    "type" : "hexstr",
                    "value" : "0xff"
                  }
                }
              }
            }
          ],
          "source_info" : {
            "filename" : "complex.p4",
            "line" : 119,
            "column" : 12,
            "source_fragment" : "headers.ipv4_header.ttl = metadata.metadata_register - 1"
          }
        }
      ]
    }
  ],
  "pipelines" : [
    {
      "name" : "ingress",
      "id" : 0,
      "source_info" : {
        "filename" : "complex.p4",
        "line" : 100,
        "column" : 8,
        "source_fragment" : "ProcessIngress"
      },
      "init_table" : "node_2",
      "tables" : [
        {
          "name" : "tbl_complex91",
          "id" : 0,
          "source_info" : {
            "filename" : "complex.p4",
            "line" : 91,
            "column" : 39,
            "source_fragment" : "="
          },
          "key" : [],
          "match_type" : "exact",
          "type" : "simple",
          "max_size" : 1024,
          "with_counters" : false,
          "support_timeout" : false,
          "direct_meters" : null,
          "action_ids" : [2],
          "actions" : ["complex91"],
          "base_default_next" : "ProcessIngress.process_ingress_ipv4.ipv4_fib",
          "next_tables" : {
            "complex91" : "ProcessIngress.process_ingress_ipv4.ipv4_fib"
          },
          "default_entry" : {
            "action_id" : 2,
            "action_const" : true,
            "action_data" : [],
            "action_entry_const" : true
          }
        },
        {
          "name" : "ProcessIngress.process_ingress_ipv4.ipv4_fib",
          "id" : 1,
          "source_info" : {
            "filename" : "complex.p4",
            "line" : 71,
            "column" : 10,
            "source_fragment" : "ipv4_fib"
          },
          "key" : [
            {
              "match_type" : "lpm",
              "name" : "headers.ipv4_header.dst_addr",
              "target" : ["ipv4_header", "dst_addr"],
              "mask" : null
            }
          ],
          "match_type" : "lpm",
          "type" : "simple",
          "max_size" : 1024,
          "with_counters" : false,
          "support_timeout" : false,
          "direct_meters" : null,
          "action_ids" : [0, 1],
          "actions" : ["ProcessIngress.process_ingress_ipv4.act_miss", "ProcessIngress.process_ingress_ipv4.act_hit"],
          "base_default_next" : "node_5",
          "next_tables" : {
            "ProcessIngress.process_ingress_ipv4.act_miss" : "node_5",
            "ProcessIngress.process_ingress_ipv4.act_hit" : "node_5"
          },
          "default_entry" : {
            "action_id" : 0,
            "action_const" : true,
            "action_data" : [],
            "action_entry_const" : true
          },
          "entries" : [
            {
              "source_info" : {
                "filename" : "complex.p4",
                "line" : 81,
                "column" : 12,
                "source_fragment" : "32w0x0a010203 &&& 32w0xffffffff: act_hit(1)"
              },
              "match_key" : [
                {
                  "match_type" : "lpm",
                  "key" : "0x0a010203",
                  "prefix_length" : 32
                }
              ],
              "action_entry" : {
                "action_id" : 1,
                "action_data" : ["0x1"]
              },
              "priority" : 1
            },
            {
              "source_info" : {
                "filename" : "complex.p4",
                "line" : 82,
                "column" : 12,
                "source_fragment" : "32w0x0a010200 &&& 32w0xffffff00: act_hit(2)"
              },
              "match_key" : [
                {
                  "match_type" : "lpm",
                  "key" : "0x0a010200",
                  "prefix_length" : 24
                }
              ],
              "action_entry" : {
                "action_id" : 1,
                "action_data" : ["0x2"]
              },
              "priority" : 2
            },
            {
              "source_info" : {
                "filename" : "complex.p4",
                "line" : 83,
                "column" : 12,
                "source_fragment" : "32w0x0a010000 &&& 32w0xffff0000: act_hit(3)"
              },
              "match_key" : [
                {
                  "match_type" : "lpm",
                  "key" : "0x0a010000",
                  "prefix_length" : 16
                }
              ],
              "action_entry" : {
                "action_id" : 1,
                "action_data" : ["0x3"]
              },
              "priority" : 3
            },
            {
              "source_info" : {
                "filename" : "complex.p4",
                "line" : 84,
                "column" : 12,
                "source_fragment" : "32w0x0a000000 &&& 32w0xff000000: act_hit(4)"
              },
              "match_key" : [
                {
                  "match_type" : "lpm",
                  "key" : "0x0a000000",
                  "prefix_length" : 8
                }
              ],
              "action_entry" : {
                "action_id" : 1,
                "action_data" : ["0x4"]
              },
              "priority" : 4
            }
          ]
        },
        {
          "name" : "tbl_complex95",
          "id" : 2,
          "source_info" : {
            "filename" : "complex.p4",
            "line" : 95,
            "column" : 44,
            "source_fragment" : "="
          },
          "key" : [],
          "match_type" : "exact",
          "type" : "simple",
          "max_size" : 1024,
          "with_counters" : false,
          "support_timeout" : false,
          "direct_meters" : null,
          "action_ids" : [3],
          "actions" : ["complex95"],
          "base_default_next" : null,
          "next_tables" : {
            "complex95" : null
          },
          "default_entry" : {
            "action_id" : 3,
            "action_const" : true,
            "action_data" : [],
            "action_entry_const" : true
          }
        }
      ],
      "action_profiles" : [],
      "conditionals" : [
        {
          "name" : "node_2",
          "id" : 0,
          "source_info" : {
            "filename" : "complex.p4",
            "line" : 89,
            "column" : 12,
            "source_fragment" : "headers.ipv4_header.isValid()"
          },
          "expression" : {
            "type" : "expression",
            "value" : {
              "op" : "d2b",
              "left" : null,
              "right" : {
                "type" : "field",
                "value" : ["ipv4_header", "$valid$"]
              }
            }
          },
          "true_next" : "tbl_complex91",
          "false_next" : "node_5"
        },
        {
          "name" : "node_5",
          "id" : 1,
          "source_info" : {
            "filename" : "complex.p4",
            "line" : 94,
            "column" : 12,
            "source_fragment" : "headers.invalid_header.isValid()"
          },
          "expression" : {
            "type" : "expression",
            "value" : {
              "op" : "d2b",
              "left" : null,
              "right" : {
                "type" : "field",
                "value" : ["invalid_header", "$valid$"]
              }
            }
          },
          "false_next" : null,
          "true_next" : "tbl_complex95"
        }
      ]
    },
    {
      "name" : "egress",
      "id" : 1,
      "source_info" : {
        "filename" : "complex.p4",
        "line" : 111,
        "column" : 8,
        "source_fragment" : "ProgressEgress"
      },
      "init_table" : "node_9",
      "tables" : [
        {
          "name" : "tbl_complex119",
          "id" : 3,
          "source_info" : {
            "filename" : "complex.p4",
            "line" : 119,
            "column" : 36,
            "source_fragment" : "="
          },
          "key" : [],
          "match_type" : "exact",
          "type" : "simple",
          "max_size" : 1024,
          "with_counters" : false,
          "support_timeout" : false,
          "direct_meters" : null,
          "action_ids" : [4],
          "actions" : ["complex119"],
          "base_default_next" : null,
          "next_tables" : {
            "complex119" : null
          },
          "default_entry" : {
            "action_id" : 4,
            "action_const" : true,
            "action_data" : [],
            "action_entry_const" : true
          }
        }
      ],
      "action_profiles" : [],
      "conditionals" : [
        {
          "name" : "node_9",
          "id" : 2,
          "source_info" : {
            "filename" : "complex.p4",
            "line" : 117,
            "column" : 12,
            "source_fragment" : "headers.ipv4_header.isValid()"
          },
          "expression" : {
            "type" : "expression",
            "value" : {
              "op" : "d2b",
              "left" : null,
              "right" : {
                "type" : "field",
                "value" : ["ipv4_header", "$valid$"]
              }
            }
          },
          "false_next" : null,
          "true_next" : "tbl_complex119"
        }
      ]
    }
  ],
  "checksums" : [],
  "force_arith" : [],
  "extern_instances" : [],
  "field_aliases" : [
    [
      "queueing_metadata.enq_timestamp",
      ["standard_metadata", "enq_timestamp"]
    ],
    [
      "queueing_metadata.enq_qdepth",
      ["standard_metadata", "enq_qdepth"]
    ],
    [
      "queueing_metadata.deq_timedelta",
      ["standard_metadata", "deq_timedelta"]
    ],
    [
      "queueing_metadata.deq_qdepth",
      ["standard_metadata", "deq_qdepth"]
    ],
    [
      "intrinsic_metadata.ingress_global_timestamp",
      ["standard_metadata", "ingress_global_timestamp"]
    ],
    [
      "intrinsic_metadata.egress_global_timestamp",
      ["standard_metadata", "egress_global_timestamp"]
    ],
    [
      "intrinsic_metadata.mcast_grp",
      ["standard_metadata", "mcast_grp"]
    ],
    [
      "intrinsic_metadata.egress_rid",
      ["standard_metadata", "egress_rid"]
    ],
    [
      "intrinsic_metadata.priority",
      ["standard_metadata", "priority"]
    ]
  ],
  "program" : "./complex.p4i",
  "__meta__" : {
    "version" : [2, 23],
    "compiler" : "https://github.com/p4lang/p4c"
  }
}