{
  "header_types" : [
    {
      "name" : "scalars_0",
      "id" : 0,
      "fields" : []
    },
    {
      "name" : "standard_metadata",
      "id" : 1,
      "fields" : [
        ["ingress_port", 9, false],
        ["egress_spec", 9, false],
        ["egress_port", 9, false],
        ["instance_type", 32, false],
        ["packet_length", 32, false],
        ["enq_timestamp", 32, false],
        ["enq_qdepth", 19, false],
        ["deq_timedelta", 32, false],
        ["deq_qdepth", 19, false],
        ["ingress_global_timestamp", 48, false],
        ["egress_global_timestamp", 48, false],
        ["mcast_grp", 16, false],
        ["egress_rid", 16, false],
        ["checksum_error", 1, false],
        ["parser_error", 32, false],
        ["priority", 3, false],
        ["mp_egress_spec_1", 9, false],
        ["mp_egress_spec_2", 9, false],
        ["other_port", 9, false]
      ]
    },
    {
      "name" : "gen_t",
      "id" : 2,
      "fields" : [
        ["id", 8, false]
      ]
    }
  ],
  "headers" : [
    {
      "name" : "scalars",
      "id" : 0,
      "header_type" : "scalars_0",
      "metadata" : true,
      "pi_omit" : true
    },
    {
      "name" : "standard_metadata",
      "id" : 1,
      "header_type" : "standard_metadata",
      "metadata" : true,
      "pi_omit" : true
    },
    {
      "name" : "gen",
      "id" : 2,
      "header_type" : "gen_t",
      "metadata" : false,
      "pi_omit" : true
    }
  ],
  "header_stacks" : [],
  "header_union_types" : [],
  "header_unions" : [],
  "header_union_stacks" : [],
  "field_lists" : [],
  "errors" : [
    ["NoError", 0],
    ["PacketTooShort", 1],
    ["NoMatch", 2],
    ["StackOutOfBounds", 3],
    ["HeaderTooShort", 4],
    ["ParserTimeout", 5],
    ["ParserInvalidArgument", 6]
  ],
  "enums" : [
    {
      "name" : "HashAlgorithm",
      "entries" : [
        ["crc16", 2],
        ["crc16_custom", 3],
        ["crc32", 0],
        ["crc32_custom", 1],
        ["csum16", 6],
        ["identity", 5],
        ["random", 4],
        ["xor16", 7]
      ]
    },
    {
      "name" : "MeterType",
      "entries" : [
        ["bytes", 1],
        ["packets", 0]
      ]
    },
    {
      "name" : "CounterType",
      "entries" : [
        ["bytes", 1],
        ["packets", 0],
        ["packets_and_bytes", 2]
      ]
    }
  ],
  "parsers" : [
    {
      "name" : "parser",
      "id" : 0,
      "init_state" : "start",
      "parse_states" : [
        {
          "name" : "start",
          "id" : 0,
          "parser_ops" : [
            {
              "parameters" : [
                {
                  "type" : "regular",
                  "value" : "gen"
                }
              ],
              "op" : "extract"
            }
          ],
          "transitions" : [
            {
              "type" : "default",
              "value" : null,
              "mask" : null,
              "next_state" : null
            }
          ],
          "transition_key" : []
        }
      ]
    }
  ],
  "parse_vsets" : [],
  "deparsers" : [
    {
      "name" : "deparser",
      "id" : 0,
      "source_info" : {
        "filename" : "v1quantum.p4",
        "line" : 131,
        "column" : 8,
        "source_fragment" : "MyDeparser"
      },
      "order" : ["gen"],
      "primitives" : []
    }
  ],
  "meter_arrays" : [],
  "counter_arrays" : [],
  "register_arrays" : [],
  "calculations" : [],
  "learn_lists" : [],
  "actions" : [
    {
      "name" : "MyIngress.drop",
      "id" : 0,
      "runtime_data" : [],
      "primitives" : [
        {
          "op" : "mark_to_drop",
          "parameters" : [
            {
              "type" : "header",
              "value" : "standard_metadata"
            }
          ],
          "source_info" : {
            "filename" : "v1quantum.p4",
            "line" : 59,
            "column" : 8,
            "source_fragment" : "mark_to_drop(standard_metadata)"
          }
        }
      ]
    },
    {
      "name" : "MyIngress.action_mp_gen_response",
      "id" : 1,
      "runtime_data" : [
        {
          "name" : "port_1",
          "bitwidth" : 9
        },
        {
          "name" : "port_2",
          "bitwidth" : 9
        }
      ],
      "primitives" : [
        {
          "op" : "mp_gen_response",
          "parameters" : [
            {
              "type" : "header",
              "value" : "standard_metadata"
            },
            {
              "type" : "runtime_data",
              "value" : 0
            },
            {
              "type" : "runtime_data",
              "value" : 1
            }
          ],
          "source_info" : {
            "filename" : "v1quantum.p4",
            "line" : 63,
            "column" : 8,
            "source_fragment" : "mp_gen_response(standard_metadata, port_1, port_2)"
          }
        }
      ]
    },
    {
      "name" : "MyEgress.drop",
      "id" : 2,
      "runtime_data" : [],
      "primitives" : [
        {
          "op" : "mark_to_drop",
          "parameters" : [
            {
              "type" : "header",
              "value" : "standard_metadata"
            }
          ],
          "source_info" : {
            "filename" : "v1quantum.p4",
            "line" : 94,
            "column" : 8,
            "source_fragment" : "mark_to_drop(standard_metadata)"
          }
        }
      ]
    },
    {
      "name" : "MyEgress.update_id",
      "id" : 3,
      "runtime_data" : [],
      "primitives" : [
        {
          "op" : "assign",
          "parameters" : [
            {
              "type" : "field",
              "value" : ["gen", "id"]
            },
            {
              "type" : "expression",
              "value" : {
                "type" : "expression",
                "value" : {
                  "op" : "&",
                  "left" : {
                    "type" : "field",
                    "value" : ["standard_metadata", "egress_spec"]
                  },
                  "right" : {
                    "type" : "hexstr",
                    "value" : "0xff"
                  }
                }
              }
            }
          ],
          "source_info" : {
            "filename" : "v1quantum.p4",
            "line" : 98,
            "column" : 8,
            "source_fragment" : "hdr.gen.id = (bit<8>)standard_metadata.egress_spec"
          }
        }
      ]
    }
  ],
  "pipelines" : [
    {
      "name" : "ingress",
      "id" : 0,
      "source_info" : {
        "filename" : "v1quantum.p4",
        "line" : 53,
        "column" : 8,
        "source_fragment" : "MyIngress"
      },
      "init_table" : "node_2",
      "tables" : [
        {
          "name" : "MyIngress.v1q_tbl",
          "id" : 0,
          "source_info" : {
            "filename" : "v1quantum.p4",
            "line" : 66,
            "column" : 10,
            "source_fragment" : "v1q_tbl"
          },
          "key" : [
            {
              "match_type" : "exact",
              "name" : "hdr.gen.id",
              "target" : ["gen", "id"],
              "mask" : null
            }
          ],
          "match_type" : "exact",
          "type" : "simple",
          "max_size" : 1024,
          "with_counters" : false,
          "support_timeout" : false,
          "direct_meters" : null,
          "action_ids" : [0, 1],
          "actions" : ["MyIngress.drop", "MyIngress.action_mp_gen_response"],
          "base_default_next" : null,
          "next_tables" : {
            "MyIngress.drop" : null,
            "MyIngress.action_mp_gen_response" : null
          },
          "default_entry" : {
            "action_id" : 0,
            "action_const" : false,
            "action_data" : [],
            "action_entry_const" : false
          }
        }
      ],
      "action_profiles" : [],
      "conditionals" : [
        {
          "name" : "node_2",
          "id" : 0,
          "source_info" : {
            "filename" : "v1quantum.p4",
            "line" : 78,
            "column" : 12,
            "source_fragment" : "hdr.gen.isValid()"
          },
          "expression" : {
            "type" : "expression",
            "value" : {
              "op" : "d2b",
              "left" : null,
              "right" : {
                "type" : "field",
                "value" : ["gen", "$valid$"]
              }
            }
          },
          "false_next" : null,
          "true_next" : "MyIngress.v1q_tbl"
        }
      ]
    },
    {
      "name" : "egress",
      "id" : 1,
      "source_info" : {
        "filename" : "v1quantum.p4",
        "line" : 88,
        "column" : 8,
        "source_fragment" : "MyEgress"
      },
      "init_table" : "node_6",
      "tables" : [
        {
          "name" : "MyEgress.v1q_tbl",
          "id" : 1,
          "source_info" : {
            "filename" : "v1quantum.p4",
            "line" : 101,
            "column" : 10,
            "source_fragment" : "v1q_tbl"
          },
          "key" : [
            {
              "match_type" : "exact",
              "name" : "standard_metadata.egress_spec",
              "target" : ["standard_metadata", "egress_spec"],
              "mask" : null
            }
          ],
          "match_type" : "exact",
          "type" : "simple",
          "max_size" : 1024,
          "with_counters" : false,
          "support_timeout" : false,
          "direct_meters" : null,
          "action_ids" : [2, 3],
          "actions" : ["MyEgress.drop", "MyEgress.update_id"],
          "base_default_next" : null,
          "next_tables" : {
            "MyEgress.drop" : null,
            "MyEgress.update_id" : null
          },
          "default_entry" : {
            "action_id" : 3,
            "action_const" : false,
            "action_data" : [],
            "action_entry_const" : false
          }
        }
      ],
      "action_profiles" : [],
      "conditionals" : [
        {
          "name" : "node_6",
          "id" : 1,
          "source_info" : {
            "filename" : "v1quantum.p4",
            "line" : 113,
            "column" : 12,
            "source_fragment" : "hdr.gen.isValid()"
          },
          "expression" : {
            "type" : "expression",
            "value" : {
              "op" : "d2b",
              "left" : null,
              "right" : {
                "type" : "field",
                "value" : ["gen", "$valid$"]
              }
            }
          },
          "false_next" : null,
          "true_next" : "MyEgress.v1q_tbl"
        }
      ]
    }
  ],
  "checksums" : [],
  "force_arith" : [],
  "extern_instances" : [],
  "field_aliases" : [
    [
      "queueing_metadata.enq_timestamp",
      ["standard_metadata", "enq_timestamp"]
    ],
    [
      "queueing_metadata.enq_qdepth",
      ["standard_metadata", "enq_qdepth"]
    ],
    [
      "queueing_metadata.deq_timedelta",
      ["standard_metadata", "deq_timedelta"]
    ],
    [
      "queueing_metadata.deq_qdepth",
      ["standard_metadata", "deq_qdepth"]
    ],
    [
      "intrinsic_metadata.ingress_global_timestamp",
      ["standard_metadata", "ingress_global_timestamp"]
    ],
    [
      "intrinsic_metadata.egress_global_timestamp",
      ["standard_metadata", "egress_global_timestamp"]
    ],
    [
      "intrinsic_metadata.mcast_grp",
      ["standard_metadata", "mcast_grp"]
    ],
    [
      "intrinsic_metadata.egress_rid",
      ["standard_metadata", "egress_rid"]
    ],
    [
      "intrinsic_metadata.priority",
      ["standard_metadata", "priority"]
    ]
  ],
  "program" : "./v1quantum.p4i",
  "__meta__" : {
    "version" : [2, 23],
    "compiler" : "https://github.com/p4lang/p4c"
  }
}