[
{
  "name": "Mannheim",
  "zone": "mannheim",
  "year": "2014",
  "observations": [
    {"code": "natrium", "value": 13.3, "uom": "mg/l"},
    {"code": "calcium", "value": 113, "uom": "mg/l"},
    {"code": "magnesium", "value": 13.9, "uom": "mg/l"},
    {"code": "chloride", "value": 19.6, "uom": "mg/l"},
    {"code": "nitrate", "value": 1.3, "uom": "mg/l"},
    {"code": "sulfate", "value": 60.4, "uom": "mg/l"},
    {"code": "hardness", "value": 19, "uom": "dH"}
  ]
},
{
  "name": "Wasserwerk I PARKINSEL",
  "zones": [
    "ludwigshafen_west",
    "ludwigshafen_hemshof",
    "ludwigshafen_mitte",
    "ludwigshafen_sud",
    "ludwigshafen_gartenstadt",
    "ludwigshafen_mundenheim",
    "ludwigshafen_rheingonheim",
    "ludwigshafen_altrip"
  ],
  "year": "2014",
  "description": "Wasserwerk I PARKINSEL",
  "observations": [
    {"code": "natrium", "value": 37.6, "uom": "mg/l"},
    {"code": "kalium", "value": 2.6, "uom": "mg/l"},
    {"code": "calcium", "value": 92.3, "uom": "mg/l"},
    {"code": "magnesium", "value": 12.8, "uom": "mg/l"},
    {"code": "chloride", "value": 35.2, "uom": "mg/l"},
    {"code": "nitrate", "value": 1.6, "uom": "mg/l"},
    {"code": "sulfate", "value": 11.7, "uom": "mg/l"},
    {"code": "hardness", "value": 15.8, "uom": "dH"}
  ]
},
{
  "name": "Wasserwerk II Maudach-Oggersheim",
  "zones": [
    "ludwigshafen_pfingstweide",
    "ludwigshafen_edigheim",
    "ludwigshafen_oppau",
    "ludwigshafen_oggersheim",
    "ludwigshafen_friesenheim",
    "ludwigshafen_ruchheim",
    "ludwigshafen_maudach"
  ],
  "year": "2014",
  "description": "Wasserwerk II Maudach-Oggersheim",
  "observations": [
    {"code": "natrium", "value": 29.9, "uom": "mg/l"},
    {"code": "kalium", "value": 2.4, "uom": "mg/l"},
    {"code": "calcium", "value": 62.8, "uom": "mg/l"},
    {"code": "magnesium", "value": 8, "uom": "mg/l"},
    {"code": "chloride", "value": 20.5, "uom": "mg/l"},
    {"code": "nitrate", "value": 2.3, "uom": "mg/l"},
    {"code": "sulfate", "value": 33.5, "uom": "mg/l"},
    {"code": "hardness", "value": 10.6, "uom": "dH"}
  ]
},
{
  "name": "Heidelberg",
  "zone": "heidelberg",
  "year": "2014",
  "observations": [
    {"code": "natrium", "value": 14.2, "uom": "mg/l"},
    {"code": "calcium", "value": 43.8, "uom": "mg/l"},
    {"code": "magnesium", "value": 7.7, "uom": "mg/l"},
    {"code": "chloride", "value": 24.8, "uom": "mg/l"},
    {"code": "nitrate", "value": 2.3, "uom": "mg/l"},
    {"code": "sulfate", "value": 27.8, "uom": "mg/l"},
    {"code": "hardness", "value": 5.7, "min": 3, "max": 8.4, "uom": "dH"}
  ]
},
{
  "name": "Worms",
  "zone": "worms",
  "year": "2014",
  "observations": [
    {"code": "natrium", "value": 8.8, "uom": "mg/l"},
    {"code": "kalium", "value": 1.2, "uom": "mg/l"},
    {"code": "calcium", "value": 105, "uom": "mg/l"},
    {"code": "magnesium", "value": 11.1, "uom": "mg/l"},
    {"code": "chloride", "value": 17, "uom": "mg/l"},
    {"code": "sulfate", "value": 50, "uom": "mg/l"},
    {"code": "hardness", "value": 17.6, "uom": "dH"}
  ]
},
{
  "name": "Neustadt a. d. Weinstraße",
  "zone": "neustadt_a_d_weinstrasse",
  "year": "2014",
  "observations": [
    {"code": "natrium", "value": 10.5, "uom": "mg/l"},
    {"code": "kalium", "value": 2.5, "uom": "mg/l"},
    {"code": "calcium", "value": 29.7, "uom": "mg/l"},
    {"code": "magnesium", "value": 5.3, "uom": "mg/l"},
    {"code": "chloride", "value": 10.9, "uom": "mg/l"},
    {"code": "sulfate", "value": 17.7, "uom": "mg/l"},
    {"code": "hardness", "value": 5.4, "uom": "dH"}
  ]
},
{
  "name": "Speyer",
  "zone": "speyer",
  "year": "2014",
  "observations": [
    {"code": "natrium", "value": 12.5, "uom": "mg/l"},
    {"code": "kalium", "value": 2.3, "uom": "mg/l"},
    {"code": "calcium", "value": 79.7, "uom": "mg/l"},
    {"code": "magnesium", "value": 11.8, "uom": "mg/l"},
    {"code": "nitrate", "value": 1.1, "uom": "mg/l"},
    {"code": "hardness", "value": 13.9, "uom": "dH"}
  ]
},
{
  "name": "Frankenthal",
  "zone": "frankenthal",
  "year": "2014",
  "observations": [
    {"code": "natrium", "value": 28.6, "uom": "mg/l"},
    {"code": "kalium", "value": 2.6, "uom": "mg/l"},
    {"code": "calcium", "value": 72.3, "uom": "mg/l"},
    {"code": "magnesium", "value": 10.6, "uom": "mg/l"},
    {"code": "chloride", "value": 13.8, "uom": "mg/l"},
    {"code": "nitrate", "value": 2, "uom": "mg/l"},
    {"code": "sulfate", "value": 12.3, "uom": "mg/l"},
    {"code": "hardness", "value": 12.5, "uom": "dH"}
  ]
},
{
  "name": "Weinheim",
  "zones": [
    "weinheim_kernstadt",
    "weinheim_sulzbach",
    "weinheim_lutzelsachsen",
    "weinheim_hohensachsen",
    "weinheim_waid",
    "weinheim_ofling",
    "weinheim_gorxheimertal"
  ],
  "year": "2014",
  "observations": [
    {"code": "natrium", "value": 10.3, "uom": "mg/l"},
    {"code": "calcium", "value": 87.4, "uom": "mg/l"},
    {"code": "magnesium", "value": 11.7, "uom": "mg/l"},
    {"code": "chloride", "value": 8, "uom": "mg/l"},
    {"code": "nitrate", "value": 0.4, "uom": "mg/l"},
    {"code": "sulfate", "value": 3, "uom": "mg/l"},
    {"code": "hardness", "value": 14.9, "uom": "dH"}
  ]
},
{
  "name": "Bensheim",
  "zone": "bensheim",
  "year": "2014",
  "observations": [
    {"code": "natrium", "value": 10.3, "uom": "mg/l"},
    {"code": "calcium", "value": 87.4, "uom": "mg/l"},
    {"code": "magnesium", "value": 11.7, "uom": "mg/l"},
    {"code": "chloride", "value": 8, "uom": "mg/l"},
    {"code": "nitrate", "value": 0.4, "uom": "mg/l"},
    {"code": "sulfate", "value": 3, "uom": "mg/l"},
    {"code": "hardness", "value": 14.9, "uom": "dH"}
  ]
},
{
  "name": "Brühl",
  "zone": "bruhl",
  "year": "2014",
  "observations": [
    {"code": "hardness", "value": 20.67, "uom": "dH"}
  ]
}
]
