{
  "project_info": {
    "project_number": "945788038140",
    "firebase_url": "https://barrency-7bd90.firebaseio.com",
    "project_id": "barrency-7bd90",
    "storage_bucket": "barrency-7bd90.appspot.com"
  },
  "client": [
    {
      "client_info": {
        "mobilesdk_app_id": "1:945788038140:android:b2ed6c052e5f705f9d6079",
        "android_client_info": {
          "package_name": "com.barrency"
        }
      },
      "oauth_client": [
        {
          "client_id": "945788038140-out5c99rfm4tb6i2vv2ofr8hlmgq0g1u.apps.googleusercontent.com",
          "client_type": 3
        }
      ],
      "api_key": [
        {
          "current_key": "AIzaSyDC0wxFktwc9Kk1exzzBozhebEEiay4nFw"
        }
      ],
      "services": {
        "appinvite_service": {
          "other_platform_oauth_client": [
            {
              "client_id": "945788038140-out5c99rfm4tb6i2vv2ofr8hlmgq0g1u.apps.googleusercontent.com",
              "client_type": 3
            }
          ]
        }
      }
    }
  ],
  "configuration_version": "1"
}