<?xml version="1.0" encoding="UTF-8" standalone="no"?><svg xmlns="http://www.w3.org/2000/svg" xmlns:xlink="http://www.w3.org/1999/xlink" contentScriptType="application/ecmascript" contentStyleType="text/css" height="2894px" preserveAspectRatio="none" style="width:1781px;height:2894px;background:#FFFFFF;" version="1.1" viewBox="0 0 1781 2894" width="1781px" zoomAndPan="magnify"><defs><filter height="300%" id="fscq82c1zb5n8" width="300%" x="-1" y="-1"><feGaussianBlur result="blurOut" stdDeviation="2.0"/><feColorMatrix in="blurOut" result="blurOut2" type="matrix" values="0 0 0 0 0 0 0 0 0 0 0 0 0 0 0 0 0 0 .4 0"/><feOffset dx="4.0" dy="4.0" in="blurOut2" result="blurOut3"/><feBlend in="SourceGraphic" in2="blurOut3" mode="normal"/></filter></defs><g><ellipse cx="877" cy="20" fill="#000000" filter="url(#fscq82c1zb5n8)" rx="10" ry="10" style="stroke:none;stroke-width:1.0;"/><rect fill="#ADD8E6" filter="url(#fscq82c1zb5n8)" height="35.0938" rx="12.5" ry="12.5" style="stroke:#A80036;stroke-width:1.5;" width="177" x="788.5" y="50"/><text fill="#000000" font-family="sans-serif" font-size="12" lengthAdjust="spacing" textLength="157" x="798.5" y="72.457">User opens the search page</text><rect fill="#FFFFFF" filter="url(#fscq82c1zb5n8)" height="497.1016" style="stroke:#000000;stroke-width:2.0;" width="608.5" x="572" y="95.0938"/><path d="M654,95.0938 L654,105.7031 L644,115.7031 L572,115.7031 " fill="none" style="stroke:#000000;stroke-width:2.0;"/><text fill="#000000" font-family="sans-serif" font-size="14" lengthAdjust="spacing" textLength="72" x="575" y="110.627">Initialization</text><rect fill="#FEFECE" filter="url(#fscq82c1zb5n8)" height="35.0938" rx="12.5" ry="12.5" style="stroke:#A80036;stroke-width:1.5;" width="270" x="742" y="132.7031"/><text fill="#000000" font-family="sans-serif" font-size="12" lengthAdjust="spacing" textLength="250" x="752" y="155.1602">Resolve the URL locations by getting their IDs</text><rect fill="#FEFECE" filter="url(#fscq82c1zb5n8)" height="35.0938" rx="12.5" ry="12.5" style="stroke:#A80036;stroke-width:1.5;" width="431" x="661.5" y="187.7969"/><text fill="#000000" font-family="sans-serif" font-size="12" lengthAdjust="spacing" textLength="411" x="671.5" y="210.2539">Resolve the URL by getting the estate category and estate transaction types</text><rect fill="#FEFECE" filter="url(#fscq82c1zb5n8)" height="35.0938" rx="12.5" ry="12.5" style="stroke:#A80036;stroke-width:1.5;" width="112" x="821" y="242.8906"/><text fill="#000000" font-family="sans-serif" font-size="12" lengthAdjust="spacing" textLength="92" x="831" y="265.3477">Get the page title</text><rect fill="#FEFECE" filter="url(#fscq82c1zb5n8)" height="35.0938" rx="12.5" ry="12.5" style="stroke:#A80036;stroke-width:1.5;" width="163" x="795.5" y="297.9844"/><text fill="#000000" font-family="sans-serif" font-size="12" lengthAdjust="spacing" textLength="143" x="805.5" y="320.4414">Get the primary filters data</text><rect fill="#FEFECE" filter="url(#fscq82c1zb5n8)" height="35.0938" rx="12.5" ry="12.5" style="stroke:#A80036;stroke-width:1.5;" width="107" x="823.5" y="353.0781"/><text fill="#000000" font-family="sans-serif" font-size="12" lengthAdjust="spacing" textLength="87" x="833.5" y="375.5352">Get sort options</text><rect fill="#FEFECE" filter="url(#fscq82c1zb5n8)" height="35.0938" rx="12.5" ry="12.5" style="stroke:#A80036;stroke-width:1.5;" width="215" x="769.5" y="408.1719"/><text fill="#000000" font-family="sans-serif" font-size="12" lengthAdjust="spacing" textLength="195" x="779.5" y="430.6289">Get estate displayed characteristics</text><polygon fill="#FEFECE" filter="url(#fscq82c1zb5n8)" points="746.5,463.2656,1007.5,463.2656,1019.5,475.2656,1007.5,487.2656,746.5,487.2656,734.5,475.2656,746.5,463.2656" style="stroke:#A80036;stroke-width:1.5;"/><text fill="#000000" font-family="sans-serif" font-size="11" lengthAdjust="spacing" textLength="261" x="746.5" y="479.7666">Is the lowest URL location parameter a neighborhood?</text><rect fill="#FEFECE" filter="url(#fscq82c1zb5n8)" height="35.0938" rx="12.5" ry="12.5" style="stroke:#A80036;stroke-width:1.5;" width="275" x="582" y="511.1016"/><text fill="#000000" font-family="sans-serif" font-size="12" lengthAdjust="spacing" textLength="255" x="592" y="533.5586">The selected neighborhoods section is hidden</text><rect fill="#FEFECE" filter="url(#fscq82c1zb5n8)" height="35.0938" rx="12.5" ry="12.5" style="stroke:#A80036;stroke-width:1.5;" width="272" x="898.5" y="511.1016"/><text fill="#000000" font-family="sans-serif" font-size="12" lengthAdjust="spacing" textLength="252" x="908.5" y="533.5586">The selected neighborhoods section is visible</text><polygon fill="#FEFECE" filter="url(#fscq82c1zb5n8)" points="877,556.1953,877,556.1953,889,568.1953,877,580.1953,877,580.1953,865,568.1953,877,556.1953" style="stroke:#A80036;stroke-width:1.5;"/><rect fill="#FFFFFF" filter="url(#fscq82c1zb5n8)" height="249.9844" style="stroke:#000000;stroke-width:2.0;" width="211" x="771.5" y="602.1953"/><path d="M925.5,602.1953 L925.5,612.8047 L915.5,622.8047 L771.5,622.8047 " fill="none" style="stroke:#000000;stroke-width:2.0;"/><text fill="#000000" font-family="sans-serif" font-size="14" lengthAdjust="spacing" textLength="144" x="774.5" y="617.7285">Do after page's loaded</text><rect fill="#FEFECE" filter="url(#fscq82c1zb5n8)" height="35.0938" rx="12.5" ry="12.5" style="stroke:#A80036;stroke-width:1.5;" width="121" x="816.5" y="639.8047"/><text fill="#000000" font-family="sans-serif" font-size="12" lengthAdjust="spacing" textLength="101" x="826.5" y="662.2617">Get extra filter data</text><rect fill="#FEFECE" filter="url(#fscq82c1zb5n8)" height="35.0938" rx="12.5" ry="12.5" style="stroke:#A80036;stroke-width:1.5;" width="191" x="781.5" y="694.8984"/><text fill="#000000" font-family="sans-serif" font-size="12" lengthAdjust="spacing" textLength="171" x="791.5" y="717.3555">Get the estate dialog questions</text><rect fill="#FEFECE" filter="url(#fscq82c1zb5n8)" height="35.0938" rx="12.5" ry="12.5" style="stroke:#A80036;stroke-width:1.5;" width="182" x="786" y="749.9922"/><text fill="#000000" font-family="sans-serif" font-size="12" lengthAdjust="spacing" textLength="162" x="796" y="772.4492">Get all the city neighborhoods</text><rect fill="#FEFECE" filter="url(#fscq82c1zb5n8)" height="35.0938" rx="12.5" ry="12.5" style="stroke:#A80036;stroke-width:1.5;" width="127" x="813.5" y="805.0859"/><text fill="#000000" font-family="sans-serif" font-size="12" lengthAdjust="spacing" textLength="107" x="823.5" y="827.543">Get the ads spaces</text><path d="M715,916.1797 L715,942.5313 L1039,942.5313 L1039,926.1797 L1029,916.1797 L715,916.1797 " fill="#FBFB77" filter="url(#fscq82c1zb5n8)" style="stroke:#A80036;stroke-width:1.0;"/><path d="M1029,916.1797 L1029,926.1797 L1039,926.1797 L1029,916.1797 " fill="#FBFB77" style="stroke:#A80036;stroke-width:1.0;"/><text fill="#000000" font-family="sans-serif" font-size="13" lengthAdjust="spacing" textLength="303" x="721" y="934.6748">First time the search is done in the initialization step</text><rect fill="#FFFFFF" filter="url(#fscq82c1zb5n8)" height="779.2891" style="stroke:#000000;stroke-width:2.0;" width="323" x="714" y="952.5313"/><path d="M797,952.5313 L797,963.1406 L787,973.1406 L714,973.1406 " fill="none" style="stroke:#000000;stroke-width:2.0;"/><text fill="#000000" font-family="sans-serif" font-size="14" lengthAdjust="spacing" textLength="73" x="717" y="968.0645">New search</text><rect fill="#FEFECE" filter="url(#fscq82c1zb5n8)" height="35.0938" rx="12.5" ry="12.5" style="stroke:#A80036;stroke-width:1.5;" width="238" x="758" y="990.1406"/><text fill="#000000" font-family="sans-serif" font-size="12" lengthAdjust="spacing" textLength="218" x="768" y="1012.5977">Get the estates by user's selected filters</text><rect fill="#FEFECE" filter="url(#fscq82c1zb5n8)" height="35.0938" rx="12.5" ry="12.5" style="stroke:#A80036;stroke-width:1.5;" width="146" x="804" y="1045.2344"/><text fill="#000000" font-family="sans-serif" font-size="12" lengthAdjust="spacing" textLength="126" x="814" y="1067.6914">Get the estates' agents</text><rect fill="#FEFECE" filter="url(#fscq82c1zb5n8)" height="35.0938" rx="12.5" ry="12.5" style="stroke:#A80036;stroke-width:1.5;" width="247" x="753.5" y="1100.3281"/><text fill="#000000" font-family="sans-serif" font-size="12" lengthAdjust="spacing" textLength="227" x="763.5" y="1122.7852">For each agent show the type of the agent</text><rect fill="#FEFECE" filter="url(#fscq82c1zb5n8)" height="35.0938" rx="12.5" ry="12.5" style="stroke:#A80036;stroke-width:1.5;" width="176" x="789" y="1155.4219"/><text fill="#000000" font-family="sans-serif" font-size="12" lengthAdjust="spacing" textLength="156" x="799" y="1177.8789">Change the URL of the page</text><rect fill="#FEFECE" filter="url(#fscq82c1zb5n8)" height="35.0938" rx="12.5" ry="12.5" style="stroke:#A80036;stroke-width:1.5;" width="191" x="781.5" y="1254.5156"/><text fill="#000000" font-family="sans-serif" font-size="12" lengthAdjust="spacing" textLength="171" x="791.5" y="1276.9727">Calculate the locations to show</text><rect fill="#FEFECE" filter="url(#fscq82c1zb5n8)" height="35.0938" rx="12.5" ry="12.5" style="stroke:#A80036;stroke-width:1.5;" width="258" x="748" y="1309.6094"/><text fill="#000000" font-family="sans-serif" font-size="12" lengthAdjust="spacing" textLength="238" x="758" y="1332.0664">Calculate the primary characteristics values</text><rect fill="#FEFECE" filter="url(#fscq82c1zb5n8)" height="35.0938" rx="12.5" ry="12.5" style="stroke:#A80036;stroke-width:1.5;" width="144" x="805" y="1413.6211"/><text fill="#000000" font-family="sans-serif" font-size="12" lengthAdjust="spacing" textLength="124" x="815" y="1436.0781">Show the VR Tour icon</text><polygon fill="#FEFECE" filter="url(#fscq82c1zb5n8)" points="826.5,1364.7031,927.5,1364.7031,939.5,1376.7031,927.5,1388.7031,826.5,1388.7031,814.5,1376.7031,826.5,1364.7031" style="stroke:#A80036;stroke-width:1.5;"/><text fill="#000000" font-family="sans-serif" font-size="11" lengthAdjust="spacing" textLength="20" x="881" y="1400.1221">Yes</text><text fill="#000000" font-family="sans-serif" font-size="11" lengthAdjust="spacing" textLength="101" x="826.5" y="1381.2041">Has estate VR Tour?</text><polygon fill="#FEFECE" filter="url(#fscq82c1zb5n8)" points="877,1468.7148,889,1480.7148,877,1492.7148,865,1480.7148,877,1468.7148" style="stroke:#A80036;stroke-width:1.5;"/><rect fill="#FEFECE" filter="url(#fscq82c1zb5n8)" height="35.0938" rx="12.5" ry="12.5" style="stroke:#A80036;stroke-width:1.5;" width="198" x="778" y="1561.6328"/><text fill="#000000" font-family="sans-serif" font-size="12" lengthAdjust="spacing" textLength="178" x="788" y="1584.0898">Show "+TVA" alongside the price</text><polygon fill="#FEFECE" filter="url(#fscq82c1zb5n8)" points="835.5,1512.7148,918.5,1512.7148,930.5,1524.7148,918.5,1536.7148,835.5,1536.7148,823.5,1524.7148,835.5,1512.7148" style="stroke:#A80036;stroke-width:1.5;"/><text fill="#000000" font-family="sans-serif" font-size="11" lengthAdjust="spacing" textLength="20" x="881" y="1548.1338">Yes</text><text fill="#000000" font-family="sans-serif" font-size="11" lengthAdjust="spacing" textLength="83" x="835.5" y="1529.2158">Has estate TVA?</text><polygon fill="#FEFECE" filter="url(#fscq82c1zb5n8)" points="877,1616.7266,889,1628.7266,877,1640.7266,865,1628.7266,877,1616.7266" style="stroke:#A80036;stroke-width:1.5;"/><polygon fill="#FEFECE" filter="url(#fscq82c1zb5n8)" points="839,1210.5156,915,1210.5156,927,1222.5156,915,1234.5156,839,1234.5156,827,1222.5156,839,1210.5156" style="stroke:#A80036;stroke-width:1.5;"/><text fill="#000000" font-family="sans-serif" font-size="11" lengthAdjust="spacing" textLength="76" x="839" y="1227.0166">For each estate</text><rect fill="#FEFECE" filter="url(#fscq82c1zb5n8)" height="35.0938" rx="12.5" ry="12.5" style="stroke:#A80036;stroke-width:1.5;" width="189" x="782.5" y="1684.7266"/><text fill="#000000" font-family="sans-serif" font-size="12" lengthAdjust="spacing" textLength="169" x="792.5" y="1707.1836">Calculate the number of pages</text><rect fill="#000000" filter="url(#fscq82c1zb5n8)" height="6" rx="2.5" ry="2.5" style="stroke:#000000;stroke-width:1.0;" width="1732" x="11" y="1751.8203"/><rect fill="#ADD8E6" filter="url(#fscq82c1zb5n8)" height="35.0938" rx="12.5" ry="12.5" style="stroke:#A80036;stroke-width:1.5;" width="178" x="69" y="2034.7617"/><text fill="#000000" font-family="sans-serif" font-size="12" lengthAdjust="spacing" textLength="158" x="79" y="2057.2188">User change one filter option</text><rect fill="#FEFECE" filter="url(#fscq82c1zb5n8)" height="35.0938" rx="12.5" ry="12.5" style="stroke:#A80036;stroke-width:1.5;" width="270" x="23" y="2104.8555"/><text fill="#000000" font-family="sans-serif" font-size="12" lengthAdjust="spacing" textLength="250" x="33" y="2127.3125">Update the search data with the new changes</text><rect fill="#ADD8E6" filter="url(#fscq82c1zb5n8)" height="35.0938" rx="12.5" ry="12.5" style="stroke:#A80036;stroke-width:1.5;" width="560" x="321" y="1915.75"/><text fill="#000000" font-family="sans-serif" font-size="12" lengthAdjust="spacing" textLength="540" x="331" y="1938.207">User clicks on the delete icon of one tag with neighborhood from the list of selected neighborhoods</text><rect fill="#FEFECE" filter="url(#fscq82c1zb5n8)" height="35.0938" rx="12.5" ry="12.5" style="stroke:#A80036;stroke-width:1.5;" width="238" x="482" y="1985.8438"/><text fill="#000000" font-family="sans-serif" font-size="12" lengthAdjust="spacing" textLength="218" x="492" y="2008.3008">Delete the location from the search data</text><rect fill="#FEFECE" filter="url(#fscq82c1zb5n8)" height="35.0938" rx="12.5" ry="12.5" style="stroke:#A80036;stroke-width:1.5;" width="378" x="412" y="2055.9375"/><text fill="#000000" font-family="sans-serif" font-size="12" lengthAdjust="spacing" textLength="358" x="422" y="2078.3945">The tag is deleted from the list/section of selected neighborhoods</text><rect fill="#FEFECE" filter="url(#fscq82c1zb5n8)" height="35.0938" rx="12.5" ry="12.5" style="stroke:#A80036;stroke-width:1.5;" width="278" x="462" y="2174.9492"/><text fill="#000000" font-family="sans-serif" font-size="12" lengthAdjust="spacing" textLength="258" x="472" y="2197.4063">Hide the list/section of selected neighborhoods</text><polygon fill="#FEFECE" filter="url(#fscq82c1zb5n8)" points="494,2126.0313,708,2126.0313,720,2138.0313,708,2150.0313,494,2150.0313,482,2138.0313,494,2126.0313" style="stroke:#A80036;stroke-width:1.5;"/><text fill="#000000" font-family="sans-serif" font-size="11" lengthAdjust="spacing" textLength="20" x="605" y="2161.4502">Yes</text><text fill="#000000" font-family="sans-serif" font-size="11" lengthAdjust="spacing" textLength="214" x="494" y="2142.5322">There are no more selected neighborhoods?</text><polygon fill="#FEFECE" filter="url(#fscq82c1zb5n8)" points="601,2234.9609,613,2246.9609,601,2258.9609,589,2246.9609,601,2234.9609" style="stroke:#A80036;stroke-width:1.5;"/><rect fill="#ADD8E6" filter="url(#fscq82c1zb5n8)" height="35.0938" rx="12.5" ry="12.5" style="stroke:#A80036;stroke-width:1.5;" width="203" x="1012" y="1777.8203"/><text fill="#000000" font-family="sans-serif" font-size="12" lengthAdjust="spacing" textLength="183" x="1022" y="1800.2773">User clicks on the locations' input</text><rect fill="#FEFECE" filter="url(#fscq82c1zb5n8)" height="35.0938" rx="12.5" ry="12.5" style="stroke:#A80036;stroke-width:1.5;" width="390" x="918.5" y="1832.9141"/><text fill="#000000" font-family="sans-serif" font-size="12" lengthAdjust="spacing" textLength="370" x="928.5" y="1855.3711">The dialog with all the neighborhoods of the selected city are shown</text><rect fill="#FEFECE" filter="url(#fscq82c1zb5n8)" height="35.0938" rx="12.5" ry="12.5" style="stroke:#A80036;stroke-width:1.5;" width="389" x="919" y="1936.9258"/><text fill="#000000" font-family="sans-serif" font-size="12" lengthAdjust="spacing" textLength="369" x="929" y="1959.3828">Show only the neighborhoods that match/starts with the user's input</text><polygon fill="#ADD8E6" filter="url(#fscq82c1zb5n8)" points="1039.5,1888.0078,1187.5,1888.0078,1199.5,1900.0078,1187.5,1912.0078,1039.5,1912.0078,1027.5,1900.0078,1039.5,1888.0078" style="stroke:#A80036;stroke-width:1.5;"/><text fill="#000000" font-family="sans-serif" font-size="11" lengthAdjust="spacing" textLength="20" x="1117.5" y="1923.4268">Yes</text><text fill="#000000" font-family="sans-serif" font-size="11" lengthAdjust="spacing" textLength="148" x="1039.5" y="1904.5088">Is the user writing in the input?</text><polygon fill="#ADD8E6" filter="url(#fscq82c1zb5n8)" points="1113.5,1996.9375,1125.5,2008.9375,1113.5,2020.9375,1101.5,2008.9375,1113.5,1996.9375" style="stroke:#A80036;stroke-width:1.5;"/><rect fill="#FEFECE" filter="url(#fscq82c1zb5n8)" height="35.0938" rx="12.5" ry="12.5" style="stroke:#A80036;stroke-width:1.5;" width="386" x="920.5" y="2104.8555"/><text fill="#000000" font-family="sans-serif" font-size="12" lengthAdjust="spacing" textLength="366" x="930.5" y="2127.3125">Add the neighborhood to the list/section of selected neighborhoods</text><rect fill="#FEFECE" filter="url(#fscq82c1zb5n8)" height="35.0938" rx="12.5" ry="12.5" style="stroke:#A80036;stroke-width:1.5;" width="114" x="1056.5" y="2223.8672"/><text fill="#000000" font-family="sans-serif" font-size="12" lengthAdjust="spacing" textLength="94" x="1066.5" y="2246.3242">Show the section</text><polygon fill="#FEFECE" filter="url(#fscq82c1zb5n8)" points="987,2174.9492,1240,2174.9492,1252,2186.9492,1240,2198.9492,987,2198.9492,975,2186.9492,987,2174.9492" style="stroke:#A80036;stroke-width:1.5;"/><text fill="#000000" font-family="sans-serif" font-size="11" lengthAdjust="spacing" textLength="20" x="1117.5" y="2210.3682">Yes</text><text fill="#000000" font-family="sans-serif" font-size="11" lengthAdjust="spacing" textLength="253" x="987" y="2191.4502">Is the section/list of selected neighborhoods hidden?</text><polygon fill="#FEFECE" filter="url(#fscq82c1zb5n8)" points="1113.5,2278.9609,1125.5,2290.9609,1113.5,2302.9609,1101.5,2290.9609,1113.5,2278.9609" style="stroke:#A80036;stroke-width:1.5;"/><rect fill="#FEFECE" filter="url(#fscq82c1zb5n8)" height="35.0938" rx="12.5" ry="12.5" style="stroke:#A80036;stroke-width:1.5;" width="110" x="1058.5" y="2322.9609"/><text fill="#000000" font-family="sans-serif" font-size="12" lengthAdjust="spacing" textLength="90" x="1068.5" y="2345.418">Close the dialog</text><polygon fill="#ADD8E6" filter="url(#fscq82c1zb5n8)" points="997.5,2055.9375,1229.5,2055.9375,1241.5,2067.9375,1229.5,2079.9375,997.5,2079.9375,985.5,2067.9375,997.5,2055.9375" style="stroke:#A80036;stroke-width:1.5;"/><text fill="#000000" font-family="sans-serif" font-size="11" lengthAdjust="spacing" textLength="20" x="1117.5" y="2091.3564">Yes</text><text fill="#000000" font-family="sans-serif" font-size="11" lengthAdjust="spacing" textLength="232" x="997.5" y="2072.4385">Did the user clicked on an neighborhood button?</text><polygon fill="#ADD8E6" filter="url(#fscq82c1zb5n8)" points="1113.5,2378.0547,1125.5,2390.0547,1113.5,2402.0547,1101.5,2390.0547,1113.5,2378.0547" style="stroke:#A80036;stroke-width:1.5;"/><rect fill="#ADD8E6" filter="url(#fscq82c1zb5n8)" height="35.0938" rx="12.5" ry="12.5" style="stroke:#A80036;stroke-width:1.5;" width="373" x="1358" y="2034.7617"/><text fill="#000000" font-family="sans-serif" font-size="12" lengthAdjust="spacing" textLength="353" x="1368" y="2057.2188">User clicks on the next/previous page, or a specific page number</text><rect fill="#FEFECE" filter="url(#fscq82c1zb5n8)" height="35.0938" rx="12.5" ry="12.5" style="stroke:#A80036;stroke-width:1.5;" width="310" x="1389.5" y="2104.8555"/><text fill="#000000" font-family="sans-serif" font-size="12" lengthAdjust="spacing" textLength="290" x="1399.5" y="2127.3125">The starting index of the estates to get is recalculated</text><rect fill="#000000" filter="url(#fscq82c1zb5n8)" height="6" rx="2.5" ry="2.5" style="stroke:#000000;stroke-width:1.0;" width="1732" x="11" y="2422.0547"/><polygon fill="#FEFECE" filter="url(#fscq82c1zb5n8)" points="877,872.1797,889,884.1797,877,896.1797,865,884.1797,877,872.1797" style="stroke:#A80036;stroke-width:1.5;"/><polygon fill="#FEFECE" filter="url(#fscq82c1zb5n8)" points="798.5,2448.0547,955.5,2448.0547,967.5,2460.0547,955.5,2472.0547,798.5,2472.0547,786.5,2460.0547,798.5,2448.0547" style="stroke:#A80036;stroke-width:1.5;"/><text fill="#000000" font-family="sans-serif" font-size="11" lengthAdjust="spacing" textLength="157" x="798.5" y="2464.5557">User did one action from above?</text><text fill="#000000" font-family="sans-serif" font-size="11" lengthAdjust="spacing" textLength="20" x="967.5" y="2457.6377">Yes</text><rect fill="#000000" filter="url(#fscq82c1zb5n8)" height="6" rx="2.5" ry="2.5" style="stroke:#000000;stroke-width:1.0;" width="1544" x="105" y="2492.0547"/><rect fill="#ADD8E6" filter="url(#fscq82c1zb5n8)" height="35.0938" rx="12.5" ry="12.5" style="stroke:#A80036;stroke-width:1.5;" width="314" x="119" y="2643.2422"/><text fill="#000000" font-family="sans-serif" font-size="12" lengthAdjust="spacing" textLength="294" x="129" y="2665.6992">User change the display from/to grid/list of the estates</text><rect fill="#ADD8E6" filter="url(#fscq82c1zb5n8)" height="35.0938" rx="12.5" ry="12.5" style="stroke:#A80036;stroke-width:1.5;" width="231" x="461" y="2608.1953"/><text fill="#000000" font-family="sans-serif" font-size="12" lengthAdjust="spacing" textLength="211" x="471" y="2630.6523">User click on estate's link to view more</text><rect fill="#FEFECE" filter="url(#fscq82c1zb5n8)" height="35.0938" rx="12.5" ry="12.5" style="stroke:#A80036;stroke-width:1.5;" width="228" x="462.5" y="2678.2891"/><text fill="#000000" font-family="sans-serif" font-size="12" lengthAdjust="spacing" textLength="208" x="472.5" y="2700.7461">User is redirected to the estate's page</text><rect fill="#ADD8E6" filter="url(#fscq82c1zb5n8)" height="35.0938" rx="12.5" ry="12.5" style="stroke:#A80036;stroke-width:1.5;" width="313" x="755" y="2518.0547"/><text fill="#000000" font-family="sans-serif" font-size="12" lengthAdjust="spacing" textLength="293" x="765" y="2540.5117">User clicks on the estate's button for asking more info</text><rect fill="#FEFECE" filter="url(#fscq82c1zb5n8)" height="35.0938" rx="12.5" ry="12.5" style="stroke:#A80036;stroke-width:1.5;" width="198" x="812.5" y="2582.1953"/><text fill="#000000" font-family="sans-serif" font-size="12" lengthAdjust="spacing" textLength="178" x="822.5" y="2604.6523">The dialog with the options open</text><rect fill="#000000" filter="url(#fscq82c1zb5n8)" height="6" rx="2.5" ry="2.5" style="stroke:#000000;stroke-width:1.0;" width="383" x="720" y="2652.2891"/><rect fill="#ADD8E6" filter="url(#fscq82c1zb5n8)" height="35.0938" rx="12.5" ry="12.5" style="stroke:#A80036;stroke-width:1.5;" width="182" x="734" y="2678.2891"/><text fill="#000000" font-family="sans-serif" font-size="12" lengthAdjust="spacing" textLength="162" x="744" y="2700.7461">User clicks outside the dialog</text><rect fill="#FEFECE" filter="url(#fscq82c1zb5n8)" height="35.0938" rx="12.5" ry="12.5" style="stroke:#A80036;stroke-width:1.5;" width="118" x="766" y="2748.3828"/><text fill="#000000" font-family="sans-serif" font-size="12" lengthAdjust="spacing" textLength="98" x="776" y="2770.8398">The dialog closes</text><rect fill="#ADD8E6" filter="url(#fscq82c1zb5n8)" height="35.0938" rx="12.5" ry="12.5" style="stroke:#A80036;stroke-width:1.5;" width="145" x="944" y="2713.3359"/><text fill="#000000" font-family="sans-serif" font-size="12" lengthAdjust="spacing" textLength="125" x="954" y="2735.793">User click on an option</text><rect fill="#000000" filter="url(#fscq82c1zb5n8)" height="6" rx="2.5" ry="2.5" style="stroke:#000000;stroke-width:1.0;" width="383" x="720" y="2803.4766"/><rect fill="#ADD8E6" filter="url(#fscq82c1zb5n8)" height="35.0938" rx="12.5" ry="12.5" style="stroke:#A80036;stroke-width:1.5;" width="274" x="1246" y="2573.1484"/><text fill="#000000" font-family="sans-serif" font-size="12" lengthAdjust="spacing" textLength="254" x="1256" y="2595.6055">User clicks on the button for more filter options</text><rect fill="#FEFECE" filter="url(#fscq82c1zb5n8)" height="35.0938" rx="12.5" ry="12.5" style="stroke:#A80036;stroke-width:1.5;" width="202" x="1282" y="2643.2422"/><text fill="#000000" font-family="sans-serif" font-size="12" lengthAdjust="spacing" textLength="182" x="1292" y="2665.6992">Show the list of extra filter options</text><rect fill="#FEFECE" filter="url(#fscq82c1zb5n8)" height="35.0938" rx="12.5" ry="12.5" style="stroke:#A80036;stroke-width:1.5;" width="504" x="1131" y="2713.3359"/><text fill="#000000" font-family="sans-serif" font-size="12" lengthAdjust="spacing" textLength="484" x="1141" y="2735.793">Change the button to indicate that can close the list of extra options from the same button</text><rect fill="#000000" filter="url(#fscq82c1zb5n8)" height="6" rx="2.5" ry="2.5" style="stroke:#000000;stroke-width:1.0;" width="1544" x="105" y="2829.4766"/><ellipse cx="877" cy="2866.4766" fill="#FFFFFF" filter="url(#fscq82c1zb5n8)" rx="11" ry="11" style="stroke:#000000;stroke-width:1.0;"/><ellipse cx="877" cy="2866.4766" fill="#000000" rx="6" ry="6" style="stroke:#7F7F7F;stroke-width:1.0;"/><line style="stroke:#A80036;stroke-width:1.5;" x1="877" x2="877" y1="30" y2="50"/><polygon fill="#A80036" points="873,40,877,50,881,40,877,44" style="stroke:#A80036;stroke-width:1.0;"/><line style="stroke:#A80036;stroke-width:1.5;" x1="877" x2="877" y1="167.7969" y2="187.7969"/><polygon fill="#A80036" points="873,177.7969,877,187.7969,881,177.7969,877,181.7969" style="stroke:#A80036;stroke-width:1.0;"/><line style="stroke:#A80036;stroke-width:1.5;" x1="877" x2="877" y1="222.8906" y2="242.8906"/><polygon fill="#A80036" points="873,232.8906,877,242.8906,881,232.8906,877,236.8906" style="stroke:#A80036;stroke-width:1.0;"/><line style="stroke:#A80036;stroke-width:1.5;" x1="877" x2="877" y1="277.9844" y2="297.9844"/><polygon fill="#A80036" points="873,287.9844,877,297.9844,881,287.9844,877,291.9844" style="stroke:#A80036;stroke-width:1.0;"/><line style="stroke:#A80036;stroke-width:1.5;" x1="877" x2="877" y1="333.0781" y2="353.0781"/><polygon fill="#A80036" points="873,343.0781,877,353.0781,881,343.0781,877,347.0781" style="stroke:#A80036;stroke-width:1.0;"/><line style="stroke:#A80036;stroke-width:1.5;" x1="877" x2="877" y1="388.1719" y2="408.1719"/><polygon fill="#A80036" points="873,398.1719,877,408.1719,881,398.1719,877,402.1719" style="stroke:#A80036;stroke-width:1.0;"/><line style="stroke:#A80036;stroke-width:1.5;" x1="734.5" x2="719.5" y1="475.2656" y2="475.2656"/><line style="stroke:#A80036;stroke-width:1.5;" x1="719.5" x2="719.5" y1="475.2656" y2="511.1016"/><polygon fill="#A80036" points="715.5,501.1016,719.5,511.1016,723.5,501.1016,719.5,505.1016" style="stroke:#A80036;stroke-width:1.0;"/><text fill="#000000" font-family="sans-serif" font-size="11" lengthAdjust="spacing" textLength="20" x="719.5" y="497.6846">Yes</text><line style="stroke:#A80036;stroke-width:1.5;" x1="1019.5" x2="1034.5" y1="475.2656" y2="475.2656"/><line style="stroke:#A80036;stroke-width:1.5;" x1="1034.5" x2="1034.5" y1="475.2656" y2="511.1016"/><polygon fill="#A80036" points="1030.5,501.1016,1034.5,511.1016,1038.5,501.1016,1034.5,505.1016" style="stroke:#A80036;stroke-width:1.0;"/><text fill="#000000" font-family="sans-serif" font-size="11" lengthAdjust="spacing" textLength="13" x="1034.5" y="497.6846">No</text><line style="stroke:#A80036;stroke-width:1.5;" x1="719.5" x2="719.5" y1="546.1953" y2="568.1953"/><line style="stroke:#A80036;stroke-width:1.5;" x1="719.5" x2="865" y1="568.1953" y2="568.1953"/><polygon fill="#A80036" points="855,564.1953,865,568.1953,855,572.1953,859,568.1953" style="stroke:#A80036;stroke-width:1.0;"/><line style="stroke:#A80036;stroke-width:1.5;" x1="1034.5" x2="1034.5" y1="546.1953" y2="568.1953"/><line style="stroke:#A80036;stroke-width:1.5;" x1="1034.5" x2="889" y1="568.1953" y2="568.1953"/><polygon fill="#A80036" points="899,564.1953,889,568.1953,899,572.1953,895,568.1953" style="stroke:#A80036;stroke-width:1.0;"/><line style="stroke:#A80036;stroke-width:1.5;" x1="877" x2="877" y1="443.2656" y2="463.2656"/><polygon fill="#A80036" points="873,453.2656,877,463.2656,881,453.2656,877,457.2656" style="stroke:#A80036;stroke-width:1.0;"/><line style="stroke:#A80036;stroke-width:1.5;" x1="877" x2="877" y1="85.0938" y2="132.7031"/><polygon fill="#A80036" points="873,122.7031,877,132.7031,881,122.7031,877,126.7031" style="stroke:#A80036;stroke-width:1.0;"/><line style="stroke:#A80036;stroke-width:1.5;" x1="877" x2="877" y1="674.8984" y2="694.8984"/><polygon fill="#A80036" points="873,684.8984,877,694.8984,881,684.8984,877,688.8984" style="stroke:#A80036;stroke-width:1.0;"/><line style="stroke:#A80036;stroke-width:1.5;" x1="877" x2="877" y1="729.9922" y2="749.9922"/><polygon fill="#A80036" points="873,739.9922,877,749.9922,881,739.9922,877,743.9922" style="stroke:#A80036;stroke-width:1.0;"/><line style="stroke:#A80036;stroke-width:1.5;" x1="877" x2="877" y1="785.0859" y2="805.0859"/><polygon fill="#A80036" points="873,795.0859,877,805.0859,881,795.0859,877,799.0859" style="stroke:#A80036;stroke-width:1.0;"/><line style="stroke:#A80036;stroke-width:1.5;" x1="877" x2="877" y1="580.1953" y2="639.8047"/><polygon fill="#A80036" points="873,629.8047,877,639.8047,881,629.8047,877,633.8047" style="stroke:#A80036;stroke-width:1.0;"/><line style="stroke:#A80036;stroke-width:1.5;" x1="877" x2="877" y1="1025.2344" y2="1045.2344"/><polygon fill="#A80036" points="873,1035.2344,877,1045.2344,881,1035.2344,877,1039.2344" style="stroke:#A80036;stroke-width:1.0;"/><line style="stroke:#A80036;stroke-width:1.5;" x1="877" x2="877" y1="1080.3281" y2="1100.3281"/><polygon fill="#A80036" points="873,1090.3281,877,1100.3281,881,1090.3281,877,1094.3281" style="stroke:#A80036;stroke-width:1.0;"/><line style="stroke:#A80036;stroke-width:1.5;" x1="877" x2="877" y1="1135.4219" y2="1155.4219"/><polygon fill="#A80036" points="873,1145.4219,877,1155.4219,881,1145.4219,877,1149.4219" style="stroke:#A80036;stroke-width:1.0;"/><line style="stroke:#A80036;stroke-width:1.5;" x1="877" x2="877" y1="1289.6094" y2="1309.6094"/><polygon fill="#A80036" points="873,1299.6094,877,1309.6094,881,1299.6094,877,1303.6094" style="stroke:#A80036;stroke-width:1.0;"/><line style="stroke:#A80036;stroke-width:1.5;" x1="877" x2="877" y1="1388.7031" y2="1413.6211"/><polygon fill="#A80036" points="873,1403.6211,877,1413.6211,881,1403.6211,877,1407.6211" style="stroke:#A80036;stroke-width:1.0;"/><line style="stroke:#A80036;stroke-width:1.5;" x1="939.5" x2="959" y1="1376.7031" y2="1376.7031"/><polygon fill="#A80036" points="955,1421.168,959,1431.168,963,1421.168,959,1425.168" style="stroke:#A80036;stroke-width:1.5;"/><line style="stroke:#A80036;stroke-width:1.5;" x1="959" x2="959" y1="1376.7031" y2="1480.7148"/><line style="stroke:#A80036;stroke-width:1.5;" x1="959" x2="889" y1="1480.7148" y2="1480.7148"/><polygon fill="#A80036" points="899,1476.7148,889,1480.7148,899,1484.7148,895,1480.7148" style="stroke:#A80036;stroke-width:1.0;"/><line style="stroke:#A80036;stroke-width:1.5;" x1="877" x2="877" y1="1448.7148" y2="1468.7148"/><polygon fill="#A80036" points="873,1458.7148,877,1468.7148,881,1458.7148,877,1462.7148" style="stroke:#A80036;stroke-width:1.0;"/><line style="stroke:#A80036;stroke-width:1.5;" x1="877" x2="877" y1="1344.7031" y2="1364.7031"/><polygon fill="#A80036" points="873,1354.7031,877,1364.7031,881,1354.7031,877,1358.7031" style="stroke:#A80036;stroke-width:1.0;"/><line style="stroke:#A80036;stroke-width:1.5;" x1="877" x2="877" y1="1536.7148" y2="1561.6328"/><polygon fill="#A80036" points="873,1551.6328,877,1561.6328,881,1551.6328,877,1555.6328" style="stroke:#A80036;stroke-width:1.0;"/><line style="stroke:#A80036;stroke-width:1.5;" x1="930.5" x2="986" y1="1524.7148" y2="1524.7148"/><polygon fill="#A80036" points="982,1569.1797,986,1579.1797,990,1569.1797,986,1573.1797" style="stroke:#A80036;stroke-width:1.5;"/><line style="stroke:#A80036;stroke-width:1.5;" x1="986" x2="986" y1="1524.7148" y2="1628.7266"/><line style="stroke:#A80036;stroke-width:1.5;" x1="986" x2="889" y1="1628.7266" y2="1628.7266"/><polygon fill="#A80036" points="899,1624.7266,889,1628.7266,899,1632.7266,895,1628.7266" style="stroke:#A80036;stroke-width:1.0;"/><line style="stroke:#A80036;stroke-width:1.5;" x1="877" x2="877" y1="1596.7266" y2="1616.7266"/><polygon fill="#A80036" points="873,1606.7266,877,1616.7266,881,1606.7266,877,1610.7266" style="stroke:#A80036;stroke-width:1.0;"/><line style="stroke:#A80036;stroke-width:1.5;" x1="877" x2="877" y1="1492.7148" y2="1512.7148"/><polygon fill="#A80036" points="873,1502.7148,877,1512.7148,881,1502.7148,877,1506.7148" style="stroke:#A80036;stroke-width:1.0;"/><line style="stroke:#A80036;stroke-width:1.5;" x1="877" x2="877" y1="1234.5156" y2="1254.5156"/><polygon fill="#A80036" points="873,1244.5156,877,1254.5156,881,1244.5156,877,1248.5156" style="stroke:#A80036;stroke-width:1.0;"/><line style="stroke:#A80036;stroke-width:1.5;" x1="877" x2="877" y1="1640.7266" y2="1652.7266"/><line style="stroke:#A80036;stroke-width:1.5;" x1="877" x2="1018" y1="1652.7266" y2="1652.7266"/><polygon fill="#A80036" points="1014,1443.0391,1018,1433.0391,1022,1443.0391,1018,1439.0391" style="stroke:#A80036;stroke-width:1.5;"/><line style="stroke:#A80036;stroke-width:1.5;" x1="1018" x2="1018" y1="1222.5156" y2="1652.7266"/><line style="stroke:#A80036;stroke-width:1.5;" x1="1018" x2="927" y1="1222.5156" y2="1222.5156"/><polygon fill="#A80036" points="937,1218.5156,927,1222.5156,937,1226.5156,933,1222.5156" style="stroke:#A80036;stroke-width:1.0;"/><line style="stroke:#A80036;stroke-width:1.5;" x1="827" x2="736" y1="1222.5156" y2="1222.5156"/><polygon fill="#A80036" points="732,1429.0391,736,1439.0391,740,1429.0391,736,1433.0391" style="stroke:#A80036;stroke-width:1.5;"/><line style="stroke:#A80036;stroke-width:1.5;" x1="736" x2="736" y1="1222.5156" y2="1664.7266"/><line style="stroke:#A80036;stroke-width:1.5;" x1="736" x2="877" y1="1664.7266" y2="1664.7266"/><line style="stroke:#A80036;stroke-width:1.5;" x1="877" x2="877" y1="1664.7266" y2="1684.7266"/><polygon fill="#A80036" points="873,1674.7266,877,1684.7266,881,1674.7266,877,1678.7266" style="stroke:#A80036;stroke-width:1.0;"/><line style="stroke:#A80036;stroke-width:1.5;" x1="877" x2="877" y1="1190.5156" y2="1210.5156"/><polygon fill="#A80036" points="873,1200.5156,877,1210.5156,881,1200.5156,877,1204.5156" style="stroke:#A80036;stroke-width:1.0;"/><line style="stroke:#A80036;stroke-width:1.5;" x1="877" x2="877" y1="942.5313" y2="990.1406"/><polygon fill="#A80036" points="873,980.1406,877,990.1406,881,980.1406,877,984.1406" style="stroke:#A80036;stroke-width:1.0;"/><line style="stroke:#A80036;stroke-width:1.5;" x1="158" x2="158" y1="2069.8555" y2="2104.8555"/><polygon fill="#A80036" points="154,2094.8555,158,2104.8555,162,2094.8555,158,2098.8555" style="stroke:#A80036;stroke-width:1.0;"/><line style="stroke:#A80036;stroke-width:1.5;" x1="601" x2="601" y1="1950.8438" y2="1985.8438"/><polygon fill="#A80036" points="597,1975.8438,601,1985.8438,605,1975.8438,601,1979.8438" style="stroke:#A80036;stroke-width:1.0;"/><line style="stroke:#A80036;stroke-width:1.5;" x1="601" x2="601" y1="2020.9375" y2="2055.9375"/><polygon fill="#A80036" points="597,2045.9375,601,2055.9375,605,2045.9375,601,2049.9375" style="stroke:#A80036;stroke-width:1.0;"/><line style="stroke:#A80036;stroke-width:1.5;" x1="601" x2="601" y1="2150.0313" y2="2174.9492"/><polygon fill="#A80036" points="597,2164.9492,601,2174.9492,605,2164.9492,601,2168.9492" style="stroke:#A80036;stroke-width:1.0;"/><line style="stroke:#A80036;stroke-width:1.5;" x1="720" x2="750" y1="2138.0313" y2="2138.0313"/><polygon fill="#A80036" points="746,2182.4961,750,2192.4961,754,2182.4961,750,2186.4961" style="stroke:#A80036;stroke-width:1.5;"/><line style="stroke:#A80036;stroke-width:1.5;" x1="750" x2="750" y1="2138.0313" y2="2246.9609"/><line style="stroke:#A80036;stroke-width:1.5;" x1="750" x2="613" y1="2246.9609" y2="2246.9609"/><polygon fill="#A80036" points="623,2242.9609,613,2246.9609,623,2250.9609,619,2246.9609" style="stroke:#A80036;stroke-width:1.0;"/><line style="stroke:#A80036;stroke-width:1.5;" x1="601" x2="601" y1="2210.043" y2="2234.9609"/><polygon fill="#A80036" points="597,2224.9609,601,2234.9609,605,2224.9609,601,2228.9609" style="stroke:#A80036;stroke-width:1.0;"/><line style="stroke:#A80036;stroke-width:1.5;" x1="601" x2="601" y1="2091.0313" y2="2126.0313"/><polygon fill="#A80036" points="597,2116.0313,601,2126.0313,605,2116.0313,601,2120.0313" style="stroke:#A80036;stroke-width:1.0;"/><line style="stroke:#A80036;stroke-width:1.5;" x1="1113.5" x2="1113.5" y1="1812.9141" y2="1832.9141"/><polygon fill="#A80036" points="1109.5,1822.9141,1113.5,1832.9141,1117.5,1822.9141,1113.5,1826.9141" style="stroke:#A80036;stroke-width:1.0;"/><line style="stroke:#A80036;stroke-width:1.5;" x1="1113.5" x2="1113.5" y1="1912.0078" y2="1936.9258"/><polygon fill="#A80036" points="1109.5,1926.9258,1113.5,1936.9258,1117.5,1926.9258,1113.5,1930.9258" style="stroke:#A80036;stroke-width:1.0;"/><line style="stroke:#A80036;stroke-width:1.5;" x1="1199.5" x2="1318" y1="1900.0078" y2="1900.0078"/><polygon fill="#A80036" points="1314,1944.4727,1318,1954.4727,1322,1944.4727,1318,1948.4727" style="stroke:#A80036;stroke-width:1.5;"/><line style="stroke:#A80036;stroke-width:1.5;" x1="1318" x2="1318" y1="1900.0078" y2="2008.9375"/><line style="stroke:#A80036;stroke-width:1.5;" x1="1318" x2="1125.5" y1="2008.9375" y2="2008.9375"/><polygon fill="#A80036" points="1135.5,2004.9375,1125.5,2008.9375,1135.5,2012.9375,1131.5,2008.9375" style="stroke:#A80036;stroke-width:1.0;"/><line style="stroke:#A80036;stroke-width:1.5;" x1="1113.5" x2="1113.5" y1="1972.0195" y2="1996.9375"/><polygon fill="#A80036" points="1109.5,1986.9375,1113.5,1996.9375,1117.5,1986.9375,1113.5,1990.9375" style="stroke:#A80036;stroke-width:1.0;"/><line style="stroke:#A80036;stroke-width:1.5;" x1="1113.5" x2="1113.5" y1="1868.0078" y2="1888.0078"/><polygon fill="#A80036" points="1109.5,1878.0078,1113.5,1888.0078,1117.5,1878.0078,1113.5,1882.0078" style="stroke:#A80036;stroke-width:1.0;"/><line style="stroke:#A80036;stroke-width:1.5;" x1="1113.5" x2="1113.5" y1="2198.9492" y2="2223.8672"/><polygon fill="#A80036" points="1109.5,2213.8672,1113.5,2223.8672,1117.5,2213.8672,1113.5,2217.8672" style="stroke:#A80036;stroke-width:1.0;"/><line style="stroke:#A80036;stroke-width:1.5;" x1="1252" x2="1264" y1="2186.9492" y2="2186.9492"/><polygon fill="#A80036" points="1260,2231.4141,1264,2241.4141,1268,2231.4141,1264,2235.4141" style="stroke:#A80036;stroke-width:1.5;"/><line style="stroke:#A80036;stroke-width:1.5;" x1="1264" x2="1264" y1="2186.9492" y2="2290.9609"/><line style="stroke:#A80036;stroke-width:1.5;" x1="1264" x2="1125.5" y1="2290.9609" y2="2290.9609"/><polygon fill="#A80036" points="1135.5,2286.9609,1125.5,2290.9609,1135.5,2294.9609,1131.5,2290.9609" style="stroke:#A80036;stroke-width:1.0;"/><line style="stroke:#A80036;stroke-width:1.5;" x1="1113.5" x2="1113.5" y1="2258.9609" y2="2278.9609"/><polygon fill="#A80036" points="1109.5,2268.9609,1113.5,2278.9609,1117.5,2268.9609,1113.5,2272.9609" style="stroke:#A80036;stroke-width:1.0;"/><line style="stroke:#A80036;stroke-width:1.5;" x1="1113.5" x2="1113.5" y1="2139.9492" y2="2174.9492"/><polygon fill="#A80036" points="1109.5,2164.9492,1113.5,2174.9492,1117.5,2164.9492,1113.5,2168.9492" style="stroke:#A80036;stroke-width:1.0;"/><line style="stroke:#A80036;stroke-width:1.5;" x1="1113.5" x2="1113.5" y1="2302.9609" y2="2322.9609"/><polygon fill="#A80036" points="1109.5,2312.9609,1113.5,2322.9609,1117.5,2312.9609,1113.5,2316.9609" style="stroke:#A80036;stroke-width:1.0;"/><line style="stroke:#A80036;stroke-width:1.5;" x1="1113.5" x2="1113.5" y1="2079.9375" y2="2104.8555"/><polygon fill="#A80036" points="1109.5,2094.8555,1113.5,2104.8555,1117.5,2094.8555,1113.5,2098.8555" style="stroke:#A80036;stroke-width:1.0;"/><line style="stroke:#A80036;stroke-width:1.5;" x1="1241.5" x2="1316.5" y1="2067.9375" y2="2067.9375"/><polygon fill="#A80036" points="1312.5,2231.4141,1316.5,2241.4141,1320.5,2231.4141,1316.5,2235.4141" style="stroke:#A80036;stroke-width:1.5;"/><line style="stroke:#A80036;stroke-width:1.5;" x1="1316.5" x2="1316.5" y1="2067.9375" y2="2390.0547"/><line style="stroke:#A80036;stroke-width:1.5;" x1="1316.5" x2="1125.5" y1="2390.0547" y2="2390.0547"/><polygon fill="#A80036" points="1135.5,2386.0547,1125.5,2390.0547,1135.5,2394.0547,1131.5,2390.0547" style="stroke:#A80036;stroke-width:1.0;"/><line style="stroke:#A80036;stroke-width:1.5;" x1="1113.5" x2="1113.5" y1="2358.0547" y2="2378.0547"/><polygon fill="#A80036" points="1109.5,2368.0547,1113.5,2378.0547,1117.5,2368.0547,1113.5,2372.0547" style="stroke:#A80036;stroke-width:1.0;"/><line style="stroke:#A80036;stroke-width:1.5;" x1="1113.5" x2="1113.5" y1="2020.9375" y2="2055.9375"/><polygon fill="#A80036" points="1109.5,2045.9375,1113.5,2055.9375,1117.5,2045.9375,1113.5,2049.9375" style="stroke:#A80036;stroke-width:1.0;"/><line style="stroke:#A80036;stroke-width:1.5;" x1="1544.5" x2="1544.5" y1="2069.8555" y2="2104.8555"/><polygon fill="#A80036" points="1540.5,2094.8555,1544.5,2104.8555,1548.5,2094.8555,1544.5,2098.8555" style="stroke:#A80036;stroke-width:1.0;"/><line style="stroke:#A80036;stroke-width:1.5;" x1="158" x2="158" y1="1757.8203" y2="2034.7617"/><polygon fill="#A80036" points="154,2024.7617,158,2034.7617,162,2024.7617,158,2028.7617" style="stroke:#A80036;stroke-width:1.0;"/><line style="stroke:#A80036;stroke-width:1.5;" x1="601" x2="601" y1="1757.8203" y2="1915.75"/><polygon fill="#A80036" points="597,1905.75,601,1915.75,605,1905.75,601,1909.75" style="stroke:#A80036;stroke-width:1.0;"/><line style="stroke:#A80036;stroke-width:1.5;" x1="1113.5" x2="1113.5" y1="1757.8203" y2="1777.8203"/><polygon fill="#A80036" points="1109.5,1767.8203,1113.5,1777.8203,1117.5,1767.8203,1113.5,1771.8203" style="stroke:#A80036;stroke-width:1.0;"/><line style="stroke:#A80036;stroke-width:1.5;" x1="1544.5" x2="1544.5" y1="1757.8203" y2="2034.7617"/><polygon fill="#A80036" points="1540.5,2024.7617,1544.5,2034.7617,1548.5,2024.7617,1544.5,2028.7617" style="stroke:#A80036;stroke-width:1.0;"/><line style="stroke:#A80036;stroke-width:1.5;" x1="158" x2="158" y1="2139.9492" y2="2422.0547"/><polygon fill="#A80036" points="154,2412.0547,158,2422.0547,162,2412.0547,158,2416.0547" style="stroke:#A80036;stroke-width:1.0;"/><line style="stroke:#A80036;stroke-width:1.5;" x1="601" x2="601" y1="2258.9609" y2="2422.0547"/><polygon fill="#A80036" points="597,2412.0547,601,2422.0547,605,2412.0547,601,2416.0547" style="stroke:#A80036;stroke-width:1.0;"/><line style="stroke:#A80036;stroke-width:1.5;" x1="1113.5" x2="1113.5" y1="2402.0547" y2="2422.0547"/><polygon fill="#A80036" points="1109.5,2412.0547,1113.5,2422.0547,1117.5,2412.0547,1113.5,2416.0547" style="stroke:#A80036;stroke-width:1.0;"/><line style="stroke:#A80036;stroke-width:1.5;" x1="1544.5" x2="1544.5" y1="2139.9492" y2="2422.0547"/><polygon fill="#A80036" points="1540.5,2412.0547,1544.5,2422.0547,1548.5,2412.0547,1544.5,2416.0547" style="stroke:#A80036;stroke-width:1.0;"/><line style="stroke:#A80036;stroke-width:1.5;" x1="877" x2="877" y1="1719.8203" y2="1751.8203"/><polygon fill="#A80036" points="873,1741.8203,877,1751.8203,881,1741.8203,877,1745.8203" style="stroke:#A80036;stroke-width:1.0;"/><line style="stroke:#A80036;stroke-width:1.5;" x1="877" x2="877" y1="896.1797" y2="916.1797"/><polygon fill="#A80036" points="873,906.1797,877,916.1797,881,906.1797,877,910.1797" style="stroke:#A80036;stroke-width:1.0;"/><line style="stroke:#A80036;stroke-width:1.5;" x1="967.5" x2="1755" y1="2460.0547" y2="2460.0547"/><polygon fill="#A80036" points="1751,1656.6172,1755,1646.6172,1759,1656.6172,1755,1652.6172" style="stroke:#A80036;stroke-width:1.5;"/><line style="stroke:#A80036;stroke-width:1.5;" x1="1755" x2="1755" y1="884.1797" y2="2460.0547"/><line style="stroke:#A80036;stroke-width:1.5;" x1="1755" x2="889" y1="884.1797" y2="884.1797"/><polygon fill="#A80036" points="899,880.1797,889,884.1797,899,888.1797,895,884.1797" style="stroke:#A80036;stroke-width:1.0;"/><line style="stroke:#A80036;stroke-width:1.5;" x1="877" x2="877" y1="2428.0547" y2="2448.0547"/><polygon fill="#A80036" points="873,2438.0547,877,2448.0547,881,2438.0547,877,2442.0547" style="stroke:#A80036;stroke-width:1.0;"/><line style="stroke:#A80036;stroke-width:1.5;" x1="877" x2="877" y1="840.1797" y2="872.1797"/><polygon fill="#A80036" points="873,862.1797,877,872.1797,881,862.1797,877,866.1797" style="stroke:#A80036;stroke-width:1.0;"/><line style="stroke:#A80036;stroke-width:1.5;" x1="576.5" x2="576.5" y1="2643.2891" y2="2678.2891"/><polygon fill="#A80036" points="572.5,2668.2891,576.5,2678.2891,580.5,2668.2891,576.5,2672.2891" style="stroke:#A80036;stroke-width:1.0;"/><line style="stroke:#A80036;stroke-width:1.5;" x1="911.5" x2="911.5" y1="2553.1484" y2="2582.1953"/><polygon fill="#A80036" points="907.5,2572.1953,911.5,2582.1953,915.5,2572.1953,911.5,2576.1953" style="stroke:#A80036;stroke-width:1.0;"/><line style="stroke:#A80036;stroke-width:1.5;" x1="825" x2="825" y1="2713.3828" y2="2748.3828"/><polygon fill="#A80036" points="821,2738.3828,825,2748.3828,829,2738.3828,825,2742.3828" style="stroke:#A80036;stroke-width:1.0;"/><line style="stroke:#A80036;stroke-width:1.5;" x1="825" x2="825" y1="2658.2891" y2="2678.2891"/><polygon fill="#A80036" points="821,2668.2891,825,2678.2891,829,2668.2891,825,2672.2891" style="stroke:#A80036;stroke-width:1.0;"/><line style="stroke:#A80036;stroke-width:1.5;" x1="1016.5" x2="1016.5" y1="2658.2891" y2="2713.3359"/><polygon fill="#A80036" points="1012.5,2703.3359,1016.5,2713.3359,1020.5,2703.3359,1016.5,2707.3359" style="stroke:#A80036;stroke-width:1.0;"/><line style="stroke:#A80036;stroke-width:1.5;" x1="1016.5" x2="1016.5" y1="2748.4297" y2="2803.4766"/><polygon fill="#A80036" points="1012.5,2793.4766,1016.5,2803.4766,1020.5,2793.4766,1016.5,2797.4766" style="stroke:#A80036;stroke-width:1.0;"/><line style="stroke:#A80036;stroke-width:1.5;" x1="911.5" x2="911.5" y1="2617.2891" y2="2652.2891"/><polygon fill="#A80036" points="907.5,2642.2891,911.5,2652.2891,915.5,2642.2891,911.5,2646.2891" style="stroke:#A80036;stroke-width:1.0;"/><line style="stroke:#A80036;stroke-width:1.5;" x1="1383" x2="1383" y1="2608.2422" y2="2643.2422"/><polygon fill="#A80036" points="1379,2633.2422,1383,2643.2422,1387,2633.2422,1383,2637.2422" style="stroke:#A80036;stroke-width:1.0;"/><line style="stroke:#A80036;stroke-width:1.5;" x1="1383" x2="1383" y1="2678.3359" y2="2713.3359"/><polygon fill="#A80036" points="1379,2703.3359,1383,2713.3359,1387,2703.3359,1383,2707.3359" style="stroke:#A80036;stroke-width:1.0;"/><line style="stroke:#A80036;stroke-width:1.5;" x1="276" x2="276" y1="2498.0547" y2="2643.2422"/><polygon fill="#A80036" points="272,2633.2422,276,2643.2422,280,2633.2422,276,2637.2422" style="stroke:#A80036;stroke-width:1.0;"/><line style="stroke:#A80036;stroke-width:1.5;" x1="576.5" x2="576.5" y1="2498.0547" y2="2608.1953"/><polygon fill="#A80036" points="572.5,2598.1953,576.5,2608.1953,580.5,2598.1953,576.5,2602.1953" style="stroke:#A80036;stroke-width:1.0;"/><line style="stroke:#A80036;stroke-width:1.5;" x1="911.5" x2="911.5" y1="2498.0547" y2="2518.0547"/><polygon fill="#A80036" points="907.5,2508.0547,911.5,2518.0547,915.5,2508.0547,911.5,2512.0547" style="stroke:#A80036;stroke-width:1.0;"/><line style="stroke:#A80036;stroke-width:1.5;" x1="1383" x2="1383" y1="2498.0547" y2="2573.1484"/><polygon fill="#A80036" points="1379,2563.1484,1383,2573.1484,1387,2563.1484,1383,2567.1484" style="stroke:#A80036;stroke-width:1.0;"/><line style="stroke:#A80036;stroke-width:1.5;" x1="276" x2="276" y1="2678.3359" y2="2829.4766"/><polygon fill="#A80036" points="272,2819.4766,276,2829.4766,280,2819.4766,276,2823.4766" style="stroke:#A80036;stroke-width:1.0;"/><line style="stroke:#A80036;stroke-width:1.5;" x1="576.5" x2="576.5" y1="2713.3828" y2="2829.4766"/><polygon fill="#A80036" points="572.5,2819.4766,576.5,2829.4766,580.5,2819.4766,576.5,2823.4766" style="stroke:#A80036;stroke-width:1.0;"/><line style="stroke:#A80036;stroke-width:1.5;" x1="911.5" x2="911.5" y1="2809.4766" y2="2829.4766"/><polygon fill="#A80036" points="907.5,2819.4766,911.5,2829.4766,915.5,2819.4766,911.5,2823.4766" style="stroke:#A80036;stroke-width:1.0;"/><line style="stroke:#A80036;stroke-width:1.5;" x1="1383" x2="1383" y1="2748.4297" y2="2829.4766"/><polygon fill="#A80036" points="1379,2819.4766,1383,2829.4766,1387,2819.4766,1383,2823.4766" style="stroke:#A80036;stroke-width:1.0;"/><line style="stroke:#A80036;stroke-width:1.5;" x1="877" x2="877" y1="2472.0547" y2="2492.0547"/><polygon fill="#A80036" points="873,2482.0547,877,2492.0547,881,2482.0547,877,2486.0547" style="stroke:#A80036;stroke-width:1.0;"/><line style="stroke:#A80036;stroke-width:1.5;" x1="877" x2="877" y1="2835.4766" y2="2855.4766"/><polygon fill="#A80036" points="873,2845.4766,877,2855.4766,881,2845.4766,877,2849.4766" style="stroke:#A80036;stroke-width:1.0;"/><!--MD5=[e0a99b4d7c39468447596a2fb00cdad5]
@startuml SearchPage_Activity_Tehnical
start
#LightBlue:User opens the search page;
group Initialization
    :Resolve the URL locations by getting their IDs;
    :Resolve the URL by getting the estate category and estate transaction types;
    :Get the page title;
    :Get the primary filters data;
    :Get sort options;
    :Get estate displayed characteristics;
    switch (Is the lowest URL location parameter a neighborhood?)
    case (Yes)
        :The selected neighborhoods section is hidden;
    case (No)
        :The selected neighborhoods section is visible;
    endswitch
end group
group Do after page's loaded 
    :Get extra filter data;
    :Get the estate dialog questions;
    :Get all the city neighborhoods;
    :Get the ads spaces;
end group
repeat
note
    First time the search is done in the initialization step
end note
group New search
:Get the estates by user's selected filters;
:Get the estates' agents;
:For each agent show the type of the agent;
:Change the URL of the page;
while (For each estate)
    :Calculate the locations to show;
    :Calculate the primary characteristics values;
    if (Has estate VR Tour?) then (Yes)
        :Show the VR Tour icon;
    endif
    if (Has estate TVA?) then (Yes)
        :Show "+TVA" alongside the price;
    endif
endwhile
:Calculate the number of pages;
end group
fork
    #LightBlue:User change one filter option;
    :Update the search data with the new changes;
fork again
    #LightBlue:User clicks on the delete icon of one tag with neighborhood from the list of selected neighborhoods;
    :Delete the location from the search data;
    :The tag is deleted from the list/section of selected neighborhoods;
    if (There are no more selected neighborhoods?) then (Yes)
        :Hide the list/section of selected neighborhoods;
    endif
fork again
    #LightBlue:User clicks on the locations' input;
    :The dialog with all the neighborhoods of the selected city are shown;
    #LightBlue:if (Is the user writing in the input?) then (Yes)
        :Show only the neighborhoods that match/starts with the user's input;
    endif
    #LightBlue:if (Did the user clicked on an neighborhood button?) then (Yes)
        :Add the neighborhood to the list/section of selected neighborhoods;
        if (Is the section/list of selected neighborhoods hidden?) then (Yes)
            :Show the section;
        endif
        :Close the dialog;
    endif
fork again
    #LightBlue:User clicks on the next/previous page, or a specific page number;
    :The starting index of the estates to get is recalculated;
endfork
repeat while (User did one action from above?) is (Yes)
fork
    #LightBlue:User change the display from/to grid/list of the estates;
fork again
    #LightBlue:User click on estate's link to view more;
    :User is redirected to the estate's page;
fork again
    #LightBlue:User clicks on the estate's button for asking more info;
    :The dialog with the options open;
    fork
        #LightBlue:User clicks outside the dialog;
        :The dialog closes;
        kill
    fork again
        #LightBlue:User click on an option;
    endfork
fork again
    #LightBlue:User clicks on the button for more filter options;
    :Show the list of extra filter options;
    :Change the button to indicate that can close the list of extra options from the same button;
endfork
stop
@enduml

PlantUML version 1.2021.7(Sun May 23 15:40:07 EEST 2021)
(GPL source distribution)
Java Runtime: Java(TM) SE Runtime Environment
JVM: Java HotSpot(TM) 64-Bit Server VM
Default Encoding: Cp1252
Language: en
Country: US
--></g></svg>