{
	"info": {
		"_postman_id": "6869578f-3a6f-40f1-83e3-6d7e62750f08",
		"name": "LaravelApp",
		"schema": "https://schema.getpostman.com/json/collection/v2.1.0/collection.json",
		"_exporter_id": "16646999"
	},
	"item": [
		{
			"name": "auth",
			"item": [
				{
					"name": "[POST] Login",
					"request": {
						"method": "POST",
						"header": [],
						"body": {
							"mode": "raw",
							"raw": "{\n    \"email\": \"test123@yopmail.com\",\n    \"password\": \"Test@123\"\n}",
							"options": {
								"raw": {
									"language": "json"
								}
							}
						},
						"url": {
							"raw": "{{laravelPath}}/auth/login/",
							"host": [
								"{{laravelPath}}"
							],
							"path": [
								"auth",
								"login",
								""
							]
						}
					},
					"response": []
				},
				{
					"name": "[POST] register",
					"request": {
						"method": "POST",
						"header": [],
						"body": {
							"mode": "raw",
							"raw": "{\n    \"username\": \"David\",\n    \"email\": \"test123@yopmail.com\",\n    \"password\": \"Test@123\",\n    \"c_password\": \"Test@123\"\n}",
							"options": {
								"raw": {
									"language": "json"
								}
							}
						},
						"url": {
							"raw": "{{laravelPath}}/auth/register/",
							"host": [
								"{{laravelPath}}"
							],
							"path": [
								"auth",
								"register",
								""
							]
						}
					},
					"response": []
				}
			]
		},
		{
			"name": "posts",
			"item": [
				{
					"name": "[POST] Post of website",
					"request": {
						"auth": {
							"type": "bearer",
							"bearer": [
								{
									"key": "token",
									"value": "{{laravelToken}}",
									"type": "string"
								}
							]
						},
						"method": "POST",
						"header": [],
						"body": {
							"mode": "raw",
							"raw": "{\n    \"title\": \"David\",\n    \"body\": \"Python 2222\"\n}",
							"options": {
								"raw": {
									"language": "json"
								}
							}
						},
						"url": {
							"raw": "{{laravelPath}}/websites/:websiteId/posts",
							"host": [
								"{{laravelPath}}"
							],
							"path": [
								"websites",
								":websiteId",
								"posts"
							],
							"variable": [
								{
									"key": "websiteId",
									"value": "2"
								}
							]
						}
					},
					"response": []
				},
				{
					"name": "[GET] Posts of website",
					"protocolProfileBehavior": {
						"disableBodyPruning": true
					},
					"request": {
						"auth": {
							"type": "bearer",
							"bearer": [
								{
									"key": "token",
									"value": "{{laravelToken}}",
									"type": "string"
								}
							]
						},
						"method": "GET",
						"header": [],
						"body": {
							"mode": "raw",
							"raw": "{\n    \"name\": \"David\",\n    \"detail\": \"Laravel\"\n}",
							"options": {
								"raw": {
									"language": "json"
								}
							}
						},
						"url": {
							"raw": "{{laravelPath}}/websites/:websiteId/posts",
							"host": [
								"{{laravelPath}}"
							],
							"path": [
								"websites",
								":websiteId",
								"posts"
							],
							"variable": [
								{
									"key": "websiteId",
									"value": "2"
								}
							]
						}
					},
					"response": []
				}
			]
		},
		{
			"name": "subscribes",
			"item": [
				{
					"name": "[POST] Subscribe of website",
					"request": {
						"auth": {
							"type": "bearer",
							"bearer": [
								{
									"key": "token",
									"value": "{{laravelToken}}",
									"type": "string"
								}
							]
						},
						"method": "POST",
						"header": [],
						"url": {
							"raw": "{{laravelPath}}/websites/:websiteId/subscribes",
							"host": [
								"{{laravelPath}}"
							],
							"path": [
								"websites",
								":websiteId",
								"subscribes"
							],
							"variable": [
								{
									"key": "websiteId",
									"value": "3"
								}
							]
						}
					},
					"response": []
				}
			]
		},
		{
			"name": "websites",
			"item": [
				{
					"name": "[POST] Websites",
					"request": {
						"auth": {
							"type": "bearer",
							"bearer": [
								{
									"key": "token",
									"value": "{{laravelToken}}",
									"type": "string"
								}
							]
						},
						"method": "POST",
						"header": [],
						"body": {
							"mode": "raw",
							"raw": "{\n    \"title\": \"David 333\",\n    \"body\": \"Python 333\"\n}",
							"options": {
								"raw": {
									"language": "json"
								}
							}
						},
						"url": {
							"raw": "{{laravelPath}}/websites",
							"host": [
								"{{laravelPath}}"
							],
							"path": [
								"websites"
							]
						}
					},
					"response": []
				},
				{
					"name": "[GET] Websites",
					"protocolProfileBehavior": {
						"disableBodyPruning": true
					},
					"request": {
						"auth": {
							"type": "bearer",
							"bearer": [
								{
									"key": "token",
									"value": "{{laravelToken}}",
									"type": "string"
								}
							]
						},
						"method": "GET",
						"header": [],
						"body": {
							"mode": "raw",
							"raw": "{\n    \"name\": \"David\",\n    \"detail\": \"Laravel\"\n}",
							"options": {
								"raw": {
									"language": "json"
								}
							}
						},
						"url": {
							"raw": "{{laravelPath}}/websites",
							"host": [
								"{{laravelPath}}"
							],
							"path": [
								"websites"
							]
						}
					},
					"response": []
				}
			]
		}
	]
}