<?xml version="1.0" encoding="UTF-8" standalone="no"?>
<!-- Created with Inkscape (http://www.inkscape.org/) -->

<svg
   xmlns:dc="http://purl.org/dc/elements/1.1/"
   xmlns:cc="http://creativecommons.org/ns#"
   xmlns:rdf="http://www.w3.org/1999/02/22-rdf-syntax-ns#"
   xmlns:svg="http://www.w3.org/2000/svg"
   xmlns="http://www.w3.org/2000/svg"
   xmlns:xlink="http://www.w3.org/1999/xlink"
   xmlns:sodipodi="http://sodipodi.sourceforge.net/DTD/sodipodi-0.dtd"
   xmlns:inkscape="http://www.inkscape.org/namespaces/inkscape"
   version="1.0"
   id="svg2"
   sodipodi:version="0.32"
   inkscape:version="0.92.4 (5da689c313, 2019-01-14)"
   sodipodi:docname="pcfp-black-rect-alt.svg"
   width="1024"
   height="572.09497"
   inkscape:export-filename="/home/zodiac/Development/softbutterfly/python-club-for-physicists/logo-design/proposal-2/pcfp-black-rect.png"
   inkscape:export-xdpi="96"
   inkscape:export-ydpi="96">
  <metadata
     id="metadata371">
    <rdf:RDF>
      <cc:Work
         rdf:about="">
        <dc:format>image/svg+xml</dc:format>
        <dc:type
           rdf:resource="http://purl.org/dc/dcmitype/StillImage" />
        <dc:title />
      </cc:Work>
    </rdf:RDF>
  </metadata>
  <sodipodi:namedview
     inkscape:window-height="980"
     inkscape:window-width="1920"
     inkscape:pageshadow="2"
     inkscape:pageopacity="0.0"
     guidetolerance="10.0"
     gridtolerance="10.0"
     objecttolerance="10.0"
     borderopacity="1.0"
     bordercolor="#666666"
     pagecolor="#ffffff"
     id="base"
     inkscape:zoom="0.70710678"
     inkscape:cx="143.38109"
     inkscape:cy="120.51278"
     inkscape:window-x="0"
     inkscape:window-y="0"
     inkscape:current-layer="svg2"
     width="210mm"
     height="40mm"
     units="px"
     showgrid="false"
     inkscape:window-maximized="1"
     inkscape:snap-bbox="true"
     inkscape:bbox-paths="true"
     inkscape:bbox-nodes="true"
     inkscape:snap-bbox-edge-midpoints="true"
     inkscape:snap-bbox-midpoints="true"
     inkscape:object-paths="true"
     inkscape:snap-intersection-paths="true"
     inkscape:snap-smooth-nodes="true"
     inkscape:snap-midpoints="true"
     inkscape:snap-object-midpoints="true"
     inkscape:snap-center="true"
     inkscape:snap-text-baseline="false"
     inkscape:snap-page="true"
     showguides="false"
     fit-margin-top="0"
     fit-margin-left="0"
     fit-margin-right="0"
     fit-margin-bottom="0" />
  <defs
     id="defs4">
    <linearGradient
       id="linearGradient2795">
      <stop
         style="stop-color:#b8b8b8;stop-opacity:0.49803922;"
         offset="0"
         id="stop2797" />
      <stop
         style="stop-color:#7f7f7f;stop-opacity:0;"
         offset="1"
         id="stop2799" />
    </linearGradient>
    <linearGradient
       id="linearGradient2787">
      <stop
         style="stop-color:#7f7f7f;stop-opacity:0.5;"
         offset="0"
         id="stop2789" />
      <stop
         style="stop-color:#7f7f7f;stop-opacity:0;"
         offset="1"
         id="stop2791" />
    </linearGradient>
    <linearGradient
       id="linearGradient3676">
      <stop
         style="stop-color:#b2b2b2;stop-opacity:0.5;"
         offset="0"
         id="stop3678" />
      <stop
         style="stop-color:#b3b3b3;stop-opacity:0;"
         offset="1"
         id="stop3680" />
    </linearGradient>
    <linearGradient
       id="linearGradient3236">
      <stop
         style="stop-color:#f4f4f4;stop-opacity:1"
         offset="0"
         id="stop3244" />
      <stop
         style="stop-color:white;stop-opacity:1"
         offset="1"
         id="stop3240" />
    </linearGradient>
    <linearGradient
       id="linearGradient4671">
      <stop
         style="stop-color:#ffd43b;stop-opacity:1;"
         offset="0"
         id="stop4673" />
      <stop
         style="stop-color:#ffe873;stop-opacity:1"
         offset="1"
         id="stop4675" />
    </linearGradient>
    <linearGradient
       id="linearGradient4689">
      <stop
         style="stop-color:#5a9fd4;stop-opacity:1;"
         offset="0"
         id="stop4691" />
      <stop
         style="stop-color:#306998;stop-opacity:1;"
         offset="1"
         id="stop4693" />
    </linearGradient>
    <linearGradient
       x1="224.23996"
       y1="144.75717"
       x2="-65.308502"
       y2="144.75717"
       id="linearGradient2987"
       xlink:href="#linearGradient4671"
       gradientUnits="userSpaceOnUse"
       gradientTransform="translate(100.2702,99.61116)" />
    <linearGradient
       x1="172.94208"
       y1="77.475983"
       x2="26.670298"
       y2="76.313133"
       id="linearGradient2990"
       xlink:href="#linearGradient4689"
       gradientUnits="userSpaceOnUse"
       gradientTransform="translate(100.2702,99.61116)" />
    <linearGradient
       inkscape:collect="always"
       xlink:href="#linearGradient4689"
       id="linearGradient2587"
       gradientUnits="userSpaceOnUse"
       gradientTransform="translate(100.2702,99.61116)"
       x1="172.94208"
       y1="77.475983"
       x2="26.670298"
       y2="76.313133" />
    <linearGradient
       inkscape:collect="always"
       xlink:href="#linearGradient4671"
       id="linearGradient2589"
       gradientUnits="userSpaceOnUse"
       gradientTransform="translate(100.2702,99.61116)"
       x1="224.23996"
       y1="144.75717"
       x2="-65.308502"
       y2="144.75717" />
    <linearGradient
       inkscape:collect="always"
       xlink:href="#linearGradient4689"
       id="linearGradient2248"
       gradientUnits="userSpaceOnUse"
       gradientTransform="translate(100.2702,99.61116)"
       x1="172.94208"
       y1="77.475983"
       x2="26.670298"
       y2="76.313133" />
    <linearGradient
       inkscape:collect="always"
       xlink:href="#linearGradient4671"
       id="linearGradient2250"
       gradientUnits="userSpaceOnUse"
       gradientTransform="translate(100.2702,99.61116)"
       x1="224.23996"
       y1="144.75717"
       x2="-65.308502"
       y2="144.75717" />
    <linearGradient
       inkscape:collect="always"
       xlink:href="#linearGradient4671"
       id="linearGradient2255"
       gradientUnits="userSpaceOnUse"
       gradientTransform="matrix(0.562541,0,0,0.567972,-11.5974,-7.60954)"
       x1="224.23996"
       y1="144.75717"
       x2="-65.308502"
       y2="144.75717" />
    <linearGradient
       inkscape:collect="always"
       xlink:href="#linearGradient4689"
       id="linearGradient2258"
       gradientUnits="userSpaceOnUse"
       gradientTransform="matrix(0.562541,0,0,0.567972,-11.5974,-7.60954)"
       x1="172.94208"
       y1="76.176224"
       x2="26.670298"
       y2="76.313133" />
    <radialGradient
       inkscape:collect="always"
       xlink:href="#linearGradient2795"
       id="radialGradient2801"
       cx="61.518883"
       cy="132.28575"
       fx="61.518883"
       fy="132.28575"
       r="29.036913"
       gradientTransform="matrix(1,0,0,0.177966,0,108.7434)"
       gradientUnits="userSpaceOnUse" />
    <linearGradient
       inkscape:collect="always"
       xlink:href="#linearGradient4671"
       id="linearGradient1475-9-2"
       gradientUnits="userSpaceOnUse"
       gradientTransform="matrix(0.28126943,0,0,0.28398492,392.00847,181.24242)"
       x1="150.96111"
       y1="192.35176"
       x2="112.03144"
       y2="137.27299" />
    <linearGradient
       inkscape:collect="always"
       xlink:href="#linearGradient4689"
       id="linearGradient2102"
       gradientUnits="userSpaceOnUse"
       gradientTransform="matrix(1.2790401,0,0,1.2913885,351.76842,217.15958)"
       x1="26.648937"
       y1="20.603781"
       x2="135.66525"
       y2="114.39767" />
    <linearGradient
       inkscape:collect="always"
       xlink:href="#linearGradient4671"
       id="linearGradient2104"
       gradientUnits="userSpaceOnUse"
       gradientTransform="matrix(1.2790401,0,0,1.2913885,351.76842,217.15958)"
       x1="150.96111"
       y1="192.35176"
       x2="112.03144"
       y2="137.27299" />
    <linearGradient
       inkscape:collect="always"
       xlink:href="#linearGradient4689"
       id="linearGradient2293"
       gradientUnits="userSpaceOnUse"
       gradientTransform="matrix(1.2790401,0,0,1.2913885,351.76842,33.95461)"
       x1="26.648937"
       y1="20.603781"
       x2="135.66525"
       y2="114.39767" />
    <linearGradient
       inkscape:collect="always"
       xlink:href="#linearGradient4671"
       id="linearGradient2295"
       gradientUnits="userSpaceOnUse"
       gradientTransform="matrix(1.2790401,0,0,1.2913885,351.76842,217.15958)"
       x1="150.96111"
       y1="192.35176"
       x2="112.03144"
       y2="137.27299" />
  </defs>
  <rect
     style="opacity:1;fill:#000000;fill-opacity:1;stroke:none;stroke-width:227.41893005;stroke-miterlimit:4;stroke-dasharray:none;stroke-opacity:1"
     id="rect6583"
     width="1024"
     height="572.09497"
     x="0"
     y="0"
     inkscape:export-filename="/home/zodiac/rect6583.png"
     inkscape:export-xdpi="96"
     inkscape:export-ydpi="96" />
  <text
     xml:space="preserve"
     style="font-style:normal;font-weight:normal;font-size:121.12358856px;line-height:1.25;font-family:sans-serif;letter-spacing:0px;word-spacing:0px;fill:#000000;fill-opacity:1;stroke:none;stroke-width:3.02808976"
     x="-193.79774"
     y="843.79694"
     id="text6587"
     inkscape:export-filename="/home/zodiac/rect6583.png"
     inkscape:export-xdpi="96"
     inkscape:export-ydpi="96"><tspan
       sodipodi:role="line"
       id="tspan6585"
       x="-193.79774"
       y="950.96295"
       style="stroke-width:3.02808976" /></text>
  <g
     id="g898"
     transform="translate(-1.25e-6,9.1738464e-5)">
    <path
       inkscape:connector-curvature="0"
       style="fill:url(#linearGradient2293);fill-opacity:1;stroke-width:2.27368331"
       d="m 510.7214,60.56418 c -10.42177,0.0484 -20.37433,0.93726 -29.13156,2.48684 -25.7977,4.5576 -30.48158,14.09707 -30.48158,31.68947 v 23.2342 h 60.96314 v 7.74473 h -60.96314 -22.87893 c -17.71759,0 -33.23161,10.64929 -38.0842,30.90788 -5.59739,23.22107 -5.84566,37.71136 0,61.95788 4.33348,18.04815 14.6824,30.90788 32.39999,30.90788 h 20.96052 v -27.85262 c 0,-20.12187 17.40993,-37.87104 38.0842,-37.87104 h 60.89208 c 16.95019,0 30.48156,-13.95623 30.48156,-30.97894 V 94.74049 c 0,-16.52136 -13.93763,-28.93212 -30.48156,-31.68947 -10.47257,-1.74327 -21.33875,-2.53527 -31.76052,-2.48684 z m -32.96841,18.68684 c 6.29708,0 11.43947,5.2264 11.43947,11.65263 0,6.40346 -5.14239,11.58157 -11.43947,11.58157 -6.31963,0 -11.43946,-5.17811 -11.43946,-11.58157 0,-6.42623 5.11983,-11.65263 11.43946,-11.65263 z"
       id="path2096" />
    <g
       transform="translate(0,-183.20497)"
       id="g1092">
      <path
         style="opacity:1;fill:#ffffff;fill-opacity:1;stroke:none;stroke-width:302.80895996;stroke-miterlimit:4;stroke-dasharray:none;stroke-opacity:1"
         d="M 60.562162,572.41689 345.93618,348.58486 337.60972,363.00889 60.562162,580.17689 Z"
         id="rect6546"
         inkscape:connector-curvature="0"
         sodipodi:nodetypes="ccccc" />
      <g
         id="g1080">
        <path
           inkscape:connector-curvature="0"
           id="path6344"
           d="m 662.48862,320.82114 -26.4668,2.32227 c 1.73713,3.50421 3.17569,7.37989 4.36133,11.54687 l 29.19531,-1.58594 293.77344,103.68164 v -23.89843 z m -281.38086,24.67969 -35.17187,3.08398 -1.25196,2.16992 35.77539,-1.94336 c 0.20322,-1.08803 0.41751,-2.19043 0.64844,-3.31054 z"
           style="opacity:1;fill:#ff0000;fill-opacity:1;fill-rule:evenodd;stroke:#000000;stroke-width:0pt;stroke-linecap:butt;stroke-linejoin:miter;stroke-miterlimit:4;stroke-dasharray:none;stroke-opacity:1" />
        <path
           inkscape:connector-curvature="0"
           id="path6346"
           d="m 669.57846,333.10434 -29.19531,1.58594 c 0.30225,1.06225 0.59316,2.13841 0.86524,3.23438 0.76877,3.09038 1.44461,6.08343 2.03711,9.00195 l 33.88476,-0.67383 286.18164,114.43164 v -23.89844 z m -289.11914,15.70703 -35.77539,1.94336 -1.23047,2.13086 36.41602,-0.72461 c 0.18092,-1.10024 0.37884,-2.21984 0.58984,-3.34961 z"
           style="opacity:1;fill:#ff8500;fill-opacity:1;fill-rule:evenodd;stroke:#000000;stroke-width:0pt;stroke-linecap:butt;stroke-linejoin:miter;stroke-miterlimit:4;stroke-dasharray:none;stroke-opacity:1" />
        <path
           inkscape:connector-curvature="0"
           id="path6348"
           d="m 677.17026,346.25278 -33.88476,0.67383 c 0.90135,4.43993 1.59125,8.69291 2.07617,12.80664 l 39.95508,0.62695 278.03515,124.22266 v -23.89844 z m -297.30078,5.9082 -36.41602,0.72461 -1.21093,2.09571 37.10547,0.58203 c 0.15548,-1.11895 0.33317,-2.25712 0.52148,-3.40235 z"
           style="opacity:1;fill:#ffff00;fill-opacity:1;fill-rule:evenodd;stroke:#000000;stroke-width:0pt;stroke-linecap:butt;stroke-linejoin:miter;stroke-miterlimit:4;stroke-dasharray:none;stroke-opacity:1" />
        <path
           inkscape:connector-curvature="0"
           id="path6350"
           d="m 342.24253,354.9813 -1.1875,2.05859 37.85547,1.98438 c 0.12592,-1.14152 0.27582,-2.29744 0.4375,-3.46094 z m 303.11914,4.75195 c 0.54058,4.5859 0.82825,9.00288 0.83789,13.29687 l 47.88086,2.50977 L 963.3519,508.4813 V 484.58286 L 685.31675,360.3602 Z"
           style="opacity:1;fill:#00d000;fill-opacity:1;fill-rule:evenodd;stroke:#000000;stroke-width:0pt;stroke-linecap:butt;stroke-linejoin:miter;stroke-miterlimit:4;stroke-dasharray:none;stroke-opacity:1" />
        <path
           inkscape:connector-curvature="0"
           id="path6352"
           d="m 341.05503,357.03989 -1.16602,2.01953 38.6875,3.49609 c 0.092,-1.16976 0.20312,-2.34493 0.33399,-3.53124 z m 305.14453,15.99023 c 0.0104,4.6509 -0.31167,9.16258 -0.94141,13.61719 l 58.27539,5.26563 259.81836,140.46679 V 508.4813 L 694.08042,375.53989 Z"
           style="opacity:1;fill:#00abf8;fill-opacity:1;fill-rule:evenodd;stroke:#000000;stroke-width:0pt;stroke-linecap:butt;stroke-linejoin:miter;stroke-miterlimit:4;stroke-dasharray:none;stroke-opacity:1" />
        <path
           inkscape:connector-curvature="0"
           id="path6354"
           d="m 339.88901,359.05942 -1.14648,1.98633 39.61523,5.13281 c 0.0532,-1.20314 0.1234,-2.41014 0.21875,-3.62305 z m 305.36914,27.58789 c -3.7e-4,0.003 -0.002,0.005 -0.002,0.008 -8.7e-4,0.004 -9.5e-4,0.008 -0.002,0.0117 -0.15961,1.12728 -0.33969,2.25223 -0.54102,3.37305 -0.008,0.0448 -0.0154,0.0899 -0.0234,0.13477 -0.003,0.0143 -0.005,0.0286 -0.008,0.043 -0.19172,1.05549 -0.3999,2.11012 -0.62891,3.16211 -10e-4,0.007 -0.002,0.013 -0.004,0.0195 -0.0183,0.084 -0.0381,0.16795 -0.0566,0.25195 -0.0137,0.0586 -0.028,0.1171 -0.041,0.17578 -0.21972,0.98618 -0.44842,1.9719 -0.70117,2.95703 -0.003,0.0117 -0.005,0.0235 -0.008,0.0352 -0.0429,0.16679 -0.0929,0.3332 -0.13672,0.5 -0.0134,0.0488 -0.0262,0.0977 -0.0391,0.14648 -0.25471,0.96363 -0.5162,1.92798 -0.80274,2.89258 -7.7e-4,0.003 -9.5e-4,0.005 -0.002,0.008 l 71.5,9.26367 249.58984,146.64844 V 532.37973 L 703.53354,391.91294 Z"
           style="opacity:1;fill:#000df8;fill-opacity:1;fill-rule:evenodd;stroke:#000000;stroke-width:0pt;stroke-linecap:butt;stroke-linejoin:miter;stroke-miterlimit:4;stroke-dasharray:none;stroke-opacity:1" />
        <path
           inkscape:connector-curvature="0"
           id="path6356"
           d="m 338.73472,361.05747 -1.125,1.95117 40.65039,6.91016 c 0.009,-1.24257 0.0408,-2.48445 0.0957,-3.72852 z m 303.52539,39.3125 c -0.32058,1.07869 -0.65109,2.15822 -1.01172,3.24023 -1.23053,3.70445 -2.47904,7.1742 -3.81836,10.36914 l 87.42383,14.86328 238.58398,151.33399 v -23.89844 l -249.68359,-146.66211 0.008,0.0137 z"
           style="opacity:1;fill:#680df8;fill-opacity:1;fill-rule:evenodd;stroke:#000000;stroke-width:0pt;stroke-linecap:butt;stroke-linejoin:miter;stroke-miterlimit:4;stroke-dasharray:none;stroke-opacity:1" />
        <path
           inkscape:connector-curvature="0"
           style="fill:url(#linearGradient2295);fill-opacity:1;stroke-width:2.27368331"
           d="m 580.56611,308.92439 v 27.07104 c 0,20.98783 -17.79359,38.65262 -38.08419,38.65262 h -60.89208 c -16.67936,0 -30.48158,14.27527 -30.48158,30.97894 v 58.04997 c 0,16.52136 14.36648,26.23904 30.48158,30.97894 19.29749,5.67422 37.8028,6.6997 60.89208,0 15.34772,-4.44367 30.48156,-13.38656 30.48156,-30.97894 v -23.2342 H 512.0714 v -7.74473 h 60.89208 30.48157 c 17.71759,0 24.31989,-12.35841 30.48155,-30.90788 6.36479,-19.09642 6.09397,-37.46071 0,-61.95788 -4.37862,-17.63796 -12.74143,-30.90788 -30.48155,-30.90788 z m -34.24735,147.00784 c 6.31966,0 11.43947,5.17813 11.43947,11.58157 0,6.42623 -5.11981,11.65263 -11.43947,11.65263 -6.29709,0 -11.43947,-5.2264 -11.43947,-11.65263 0,-6.40344 5.14238,-11.58157 11.43947,-11.58157 z"
           id="path2098" />
      </g>
    </g>
    <g
       transform="translate(0,-183.20497)"
       id="g1070">
      <path
         inkscape:connector-curvature="0"
         style="fill:url(#linearGradient2102);fill-opacity:1;stroke-width:2.27368331"
         d="m 510.7214,243.76915 c -10.42177,0.0484 -20.37433,0.93726 -29.13156,2.48684 -25.7977,4.5576 -30.48158,14.09707 -30.48158,31.68947 v 23.2342 h 60.96314 v 7.74473 h -60.96314 -22.87893 c -17.71759,0 -33.23161,10.64929 -38.0842,30.90788 -5.59739,23.22107 -5.84566,37.71136 0,61.95788 4.33348,18.04815 14.6824,30.90788 32.39999,30.90788 h 20.96052 v -27.85262 c 0,-20.12187 17.40993,-37.87104 38.0842,-37.87104 h 60.89208 c 16.95019,0 30.48156,-13.95623 30.48156,-30.97894 v -58.04997 c 0,-16.52136 -13.93763,-28.93212 -30.48156,-31.68947 -10.47257,-1.74327 -21.33875,-2.53527 -31.76052,-2.48684 z m -32.96841,18.68684 c 6.29708,0 11.43947,5.2264 11.43947,11.65263 0,6.40346 -5.14239,11.58157 -11.43947,11.58157 -6.31963,0 -11.43946,-5.17811 -11.43946,-11.58157 0,-6.42623 5.11983,-11.65263 11.43946,-11.65263 z"
         id="path2118" />
      <path
         inkscape:connector-curvature="0"
         style="fill:url(#linearGradient2104);fill-opacity:1;stroke-width:2.27368331"
         d="m 580.56611,308.92439 v 27.07104 c 0,20.98783 -17.79359,38.65262 -38.08419,38.65262 h -60.89208 c -16.67936,0 -30.48158,14.27527 -30.48158,30.97894 v 58.04997 c 0,16.52136 14.36648,26.23904 30.48158,30.97894 19.29749,5.67422 37.8028,6.6997 60.89208,0 15.34772,-4.44367 30.48156,-13.38656 30.48156,-30.97894 v -23.2342 H 512.0714 v -7.74473 h 60.89208 30.48157 c 17.71759,0 24.31989,-12.35841 30.48155,-30.90788 6.36479,-19.09642 6.09397,-37.46071 0,-61.95788 -4.37862,-17.63796 -12.74143,-30.90788 -30.48155,-30.90788 z m -34.24735,147.00784 c 6.31966,0 11.43947,5.17813 11.43947,11.58157 0,6.42623 -5.11981,11.65263 -11.43947,11.65263 -6.29709,0 -11.43947,-5.2264 -11.43947,-11.65263 0,-6.40344 5.14238,-11.58157 11.43947,-11.58157 z"
         id="path2120" />
    </g>
  </g>
  <text
     xml:space="preserve"
     style="font-style:normal;font-variant:normal;font-weight:bold;font-stretch:normal;font-size:54.77500916px;line-height:1.25;font-family:Hack;-inkscape-font-specification:'Hack, Bold';font-variant-ligatures:normal;font-variant-caps:normal;font-variant-numeric:normal;font-feature-settings:normal;text-align:justify;letter-spacing:0px;word-spacing:0px;writing-mode:lr-tb;text-anchor:start;fill:#ffffff;fill-opacity:1;stroke:none;stroke-width:2.93437552"
     x="390.05722"
     y="502.841"
     id="text6591-3"><tspan
       sodipodi:role="line"
       id="tspan6589-6"
       x="390.05722"
       y="502.841"
       style="font-size:54.77500916px;letter-spacing:2.20078158px;stroke-width:2.93437552">&lt;P|Ĉ|P&gt;</tspan></text>
</svg>
