<?xml version="1.0" encoding="UTF-8" standalone="no"?>
<!-- Created with Inkscape (http://www.inkscape.org/) -->

<svg
   xmlns:dc="http://purl.org/dc/elements/1.1/"
   xmlns:cc="http://creativecommons.org/ns#"
   xmlns:rdf="http://www.w3.org/1999/02/22-rdf-syntax-ns#"
   xmlns:svg="http://www.w3.org/2000/svg"
   xmlns="http://www.w3.org/2000/svg"
   xmlns:xlink="http://www.w3.org/1999/xlink"
   xmlns:sodipodi="http://sodipodi.sourceforge.net/DTD/sodipodi-0.dtd"
   xmlns:inkscape="http://www.inkscape.org/namespaces/inkscape"
   version="1.0"
   id="svg2"
   sodipodi:version="0.32"
   inkscape:version="0.92.4 (5da689c313, 2019-01-14)"
   sodipodi:docname="pcfp-black-square-isotype-alt.svg"
   width="1024"
   height="1024"
   inkscape:export-filename="/home/zodiac/Development/softbutterfly/python-club-for-physicists/logo-design/proposal-2/pcfp-black-rect.png"
   inkscape:export-xdpi="96"
   inkscape:export-ydpi="96">
  <metadata
     id="metadata371">
    <rdf:RDF>
      <cc:Work
         rdf:about="">
        <dc:format>image/svg+xml</dc:format>
        <dc:type
           rdf:resource="http://purl.org/dc/dcmitype/StillImage" />
        <dc:title />
      </cc:Work>
    </rdf:RDF>
  </metadata>
  <sodipodi:namedview
     inkscape:window-height="980"
     inkscape:window-width="1920"
     inkscape:pageshadow="2"
     inkscape:pageopacity="0.0"
     guidetolerance="10.0"
     gridtolerance="10.0"
     objecttolerance="10.0"
     borderopacity="1.0"
     bordercolor="#666666"
     pagecolor="#ffffff"
     id="base"
     inkscape:zoom="0.70710678"
     inkscape:cx="199.24253"
     inkscape:cy="601.51998"
     inkscape:window-x="0"
     inkscape:window-y="0"
     inkscape:current-layer="svg2"
     width="210mm"
     height="40mm"
     units="px"
     showgrid="false"
     inkscape:window-maximized="1"
     inkscape:snap-bbox="true"
     inkscape:bbox-paths="true"
     inkscape:bbox-nodes="true"
     inkscape:snap-bbox-edge-midpoints="true"
     inkscape:snap-bbox-midpoints="true"
     inkscape:object-paths="true"
     inkscape:snap-intersection-paths="true"
     inkscape:snap-smooth-nodes="true"
     inkscape:snap-midpoints="true"
     inkscape:snap-object-midpoints="true"
     inkscape:snap-center="true"
     inkscape:snap-text-baseline="false"
     inkscape:snap-page="true"
     showguides="true"
     fit-margin-top="0"
     fit-margin-left="0"
     fit-margin-right="0"
     fit-margin-bottom="0"
     inkscape:snap-nodes="true"
     inkscape:snap-others="true" />
  <defs
     id="defs4">
    <linearGradient
       id="linearGradient2795">
      <stop
         style="stop-color:#b8b8b8;stop-opacity:0.49803922;"
         offset="0"
         id="stop2797" />
      <stop
         style="stop-color:#7f7f7f;stop-opacity:0;"
         offset="1"
         id="stop2799" />
    </linearGradient>
    <linearGradient
       id="linearGradient2787">
      <stop
         style="stop-color:#7f7f7f;stop-opacity:0.5;"
         offset="0"
         id="stop2789" />
      <stop
         style="stop-color:#7f7f7f;stop-opacity:0;"
         offset="1"
         id="stop2791" />
    </linearGradient>
    <linearGradient
       id="linearGradient3676">
      <stop
         style="stop-color:#b2b2b2;stop-opacity:0.5;"
         offset="0"
         id="stop3678" />
      <stop
         style="stop-color:#b3b3b3;stop-opacity:0;"
         offset="1"
         id="stop3680" />
    </linearGradient>
    <linearGradient
       id="linearGradient3236">
      <stop
         style="stop-color:#f4f4f4;stop-opacity:1"
         offset="0"
         id="stop3244" />
      <stop
         style="stop-color:white;stop-opacity:1"
         offset="1"
         id="stop3240" />
    </linearGradient>
    <linearGradient
       id="linearGradient4671">
      <stop
         style="stop-color:#ffd43b;stop-opacity:1;"
         offset="0"
         id="stop4673" />
      <stop
         style="stop-color:#ffe873;stop-opacity:1"
         offset="1"
         id="stop4675" />
    </linearGradient>
    <linearGradient
       id="linearGradient4689">
      <stop
         style="stop-color:#5a9fd4;stop-opacity:1;"
         offset="0"
         id="stop4691" />
      <stop
         style="stop-color:#306998;stop-opacity:1;"
         offset="1"
         id="stop4693" />
    </linearGradient>
    <linearGradient
       x1="224.23996"
       y1="144.75717"
       x2="-65.308502"
       y2="144.75717"
       id="linearGradient2987"
       xlink:href="#linearGradient4671"
       gradientUnits="userSpaceOnUse"
       gradientTransform="translate(100.2702,99.61116)" />
    <linearGradient
       x1="172.94208"
       y1="77.475983"
       x2="26.670298"
       y2="76.313133"
       id="linearGradient2990"
       xlink:href="#linearGradient4689"
       gradientUnits="userSpaceOnUse"
       gradientTransform="translate(100.2702,99.61116)" />
    <linearGradient
       inkscape:collect="always"
       xlink:href="#linearGradient4689"
       id="linearGradient2587"
       gradientUnits="userSpaceOnUse"
       gradientTransform="translate(100.2702,99.61116)"
       x1="172.94208"
       y1="77.475983"
       x2="26.670298"
       y2="76.313133" />
    <linearGradient
       inkscape:collect="always"
       xlink:href="#linearGradient4671"
       id="linearGradient2589"
       gradientUnits="userSpaceOnUse"
       gradientTransform="translate(100.2702,99.61116)"
       x1="224.23996"
       y1="144.75717"
       x2="-65.308502"
       y2="144.75717" />
    <linearGradient
       inkscape:collect="always"
       xlink:href="#linearGradient4689"
       id="linearGradient2248"
       gradientUnits="userSpaceOnUse"
       gradientTransform="translate(100.2702,99.61116)"
       x1="172.94208"
       y1="77.475983"
       x2="26.670298"
       y2="76.313133" />
    <linearGradient
       inkscape:collect="always"
       xlink:href="#linearGradient4671"
       id="linearGradient2250"
       gradientUnits="userSpaceOnUse"
       gradientTransform="translate(100.2702,99.61116)"
       x1="224.23996"
       y1="144.75717"
       x2="-65.308502"
       y2="144.75717" />
    <linearGradient
       inkscape:collect="always"
       xlink:href="#linearGradient4671"
       id="linearGradient2255"
       gradientUnits="userSpaceOnUse"
       gradientTransform="matrix(0.562541,0,0,0.567972,-11.5974,-7.60954)"
       x1="224.23996"
       y1="144.75717"
       x2="-65.308502"
       y2="144.75717" />
    <linearGradient
       inkscape:collect="always"
       xlink:href="#linearGradient4689"
       id="linearGradient2258"
       gradientUnits="userSpaceOnUse"
       gradientTransform="matrix(0.562541,0,0,0.567972,-11.5974,-7.60954)"
       x1="172.94208"
       y1="76.176224"
       x2="26.670298"
       y2="76.313133" />
    <radialGradient
       inkscape:collect="always"
       xlink:href="#linearGradient2795"
       id="radialGradient2801"
       cx="61.518883"
       cy="132.28575"
       fx="61.518883"
       fy="132.28575"
       r="29.036913"
       gradientTransform="matrix(1,0,0,0.177966,0,108.7434)"
       gradientUnits="userSpaceOnUse" />
    <linearGradient
       inkscape:collect="always"
       xlink:href="#linearGradient4671"
       id="linearGradient1475-9-2"
       gradientUnits="userSpaceOnUse"
       gradientTransform="matrix(0.28126943,0,0,0.28398492,392.00847,181.24242)"
       x1="150.96111"
       y1="192.35176"
       x2="112.03144"
       y2="137.27299" />
  </defs>
  <rect
     style="opacity:1;fill:#000000;fill-opacity:1;stroke:none;stroke-width:304.25836182;stroke-miterlimit:4;stroke-dasharray:none;stroke-opacity:1"
     id="rect6583"
     width="1024"
     height="1024"
     x="0"
     y="0"
     inkscape:export-filename="/home/zodiac/rect6583.png"
     inkscape:export-xdpi="96"
     inkscape:export-ydpi="96" />
  <text
     xml:space="preserve"
     style="font-style:normal;font-weight:normal;font-size:121.12358856px;line-height:1.25;font-family:sans-serif;letter-spacing:0px;word-spacing:0px;fill:#000000;fill-opacity:1;stroke:none;stroke-width:3.02808976"
     x="-193.79774"
     y="871.26331"
     id="text6587"
     inkscape:export-filename="/home/zodiac/rect6583.png"
     inkscape:export-xdpi="96"
     inkscape:export-ydpi="96"><tspan
       sodipodi:role="line"
       id="tspan6585"
       x="-193.79774"
       y="981.47064"
       style="stroke-width:3.02808976" /></text>
  <g
     aria-label="&lt;P|Ĉ|P&gt;"
     style="font-style:normal;font-variant:normal;font-weight:bold;font-stretch:normal;font-size:54.77500916px;line-height:1.25;font-family:Hack;-inkscape-font-specification:'Hack, Bold';font-variant-ligatures:normal;font-variant-caps:normal;font-variant-numeric:normal;font-feature-settings:normal;text-align:justify;letter-spacing:0px;word-spacing:0px;writing-mode:lr-tb;text-anchor:start;fill:#ffffff;fill-opacity:1;stroke:none;stroke-width:2.93437552"
     id="text6591-3">
    <path
       d="m 392.41083,516.29267 v -6.31196 l 28.27011,-11.12617 v 6.6864 l -21.26276,7.6225 21.26276,7.569 v 6.65966 z"
       style="font-size:54.77500916px;letter-spacing:2.20078158px;stroke-width:2.93437552"
       id="path844" />
    <path
       d="m 429.64837,490.37618 h 10.83197 q 8.23765,0 11.90179,2.94201 3.61066,2.91528 3.61066,9.54819 0,6.63291 -3.61066,9.54818 -3.66414,2.94202 -11.90179,2.94202 h -2.94202 v 14.95079 h -7.88995 z m 11.12617,18.34749 q 3.90486,0 5.4561,-1.31054 1.55125,-1.31053 1.55125,-4.54675 0,-3.23622 -1.55125,-4.54676 -1.55124,-1.31053 -5.4561,-1.31053 h -3.23622 v 11.71458 z"
       style="font-size:54.77500916px;letter-spacing:2.20078158px;stroke-width:2.93437552"
       id="path846" />
    <path
       d="m 473.78627,488.45049 h 6.07125 v 54.77501 h -6.07125 z"
       style="font-size:54.77500916px;letter-spacing:2.20078158px;stroke-width:2.93437552"
       id="path848" />
    <path
       d="m 507.94805,487.83534 h -4.76072 l 5.91078,-7.06084 h 8.2644 l 5.96427,7.06084 h -4.76072 l -5.32238,-4.30604 z m 16.1811,41.32197 q -3.74439,1.92569 -8.31789,1.92569 -10.75173,0 -14.6031,-9.41446 -1.92568,-4.62699 -1.92568,-11.28665 0,-13.47978 7.51551,-18.34748 3.74439,-2.38036 9.01327,-2.38036 4.68048,0 8.31789,1.92568 v 8.77256 q -2.05941,-1.89894 -3.95835,-2.7548 -1.8722,-0.85586 -3.95835,-0.85586 -4.2793,0 -6.49919,3.47693 -2.21988,3.45019 -2.21988,10.16333 0,13.61352 8.71907,13.61352 2.05941,0 3.98509,-0.88261 1.79196,-0.77562 3.93161,-2.72805 z"
       style="font-size:54.77500916px;letter-spacing:2.20078158px;stroke-width:2.93437552"
       id="path850" />
    <path
       d="m 544.08902,488.45049 h 6.07125 v 54.77501 h -6.07125 z"
       style="font-size:54.77500916px;letter-spacing:2.20078158px;stroke-width:2.93437552"
       id="path852" />
    <path
       d="m 570.25386,490.37618 h 10.83197 q 8.23765,0 11.9018,2.94201 3.61065,2.91528 3.61065,9.54819 0,6.63291 -3.61065,9.54818 -3.66415,2.94202 -11.9018,2.94202 h -2.94202 v 14.95079 h -7.88995 z m 11.12617,18.34749 q 3.90486,0 5.45611,-1.31054 1.55124,-1.31053 1.55124,-4.54675 0,-3.23622 -1.55124,-4.54676 -1.55125,-1.31053 -5.45611,-1.31053 h -3.23622 v 11.71458 z"
       style="font-size:54.77500916px;letter-spacing:2.20078158px;stroke-width:2.93437552"
       id="path854" />
    <path
       d="m 603.31908,520.73244 21.26276,-7.569 -21.26276,-7.6225 v -6.6864 l 28.27011,11.12617 v 6.31196 l -28.27011,11.09943 z"
       style="font-size:54.77500916px;letter-spacing:2.20078158px;stroke-width:2.93437552"
       id="path856" />
  </g>
</svg>
