<svg width="20" height="11" viewBox="0 0 20 11" fill="none" xmlns="http://www.w3.org/2000/svg">
<path fill-rule="evenodd" clip-rule="evenodd" d="M2.52829 2.728L0 5.45625L2.58447 8.22824L5.16871 11V8.76824V6.53624H12.5844H20V5.56937V4.60251H12.5924H5.18489L5.12062 2.30113L5.05635 0L2.52829 2.728Z" fill="#385F4B"/>
</svg>
