<svg width="20" height="20" viewBox="0 0 20 20" fill="none" xmlns="http://www.w3.org/2000/svg">
<path fill-rule="evenodd" clip-rule="evenodd" d="M14.5 2H12.0455C9.78611 2 7.95455 3.79086 7.95455 6V8.4H5.5V11.6H7.95455V18H11.2273V11.6H13.6818L14.5 8.4H11.2273V6C11.2273 5.55817 11.5936 5.2 12.0455 5.2H14.5V2Z" fill="#F2F2F5"/>
</svg>
