<svg width="100%" height="100%" viewBox="0 0 29 28" version="1.1">
    <g>
        <path d="M28.151,24.654C28.151,26.061 27.011,27.201 25.604,27.201L3.531,27.201C2.125,27.201 0.985,26.061 0.985,24.654L0.985,10.685C0.985,10.299 1.072,9.918 1.241,9.57C1.411,9.223 1.656,8.919 1.96,8.681C3.282,7.644 4.374,6.804 10.673,2.233C11.565,1.582 13.337,0.016 14.568,0.035C15.799,0.016 17.571,1.583 18.463,2.233C24.761,6.804 25.855,7.645 27.176,8.681C27.479,8.919 27.725,9.223 27.894,9.57C28.063,9.918 28.151,10.299 28.151,10.685L28.151,24.654ZM24.667,14.223C24.531,14.025 24.258,13.979 24.065,14.121C22.853,15.017 21.123,16.281 18.463,18.211C17.57,18.862 15.799,20.428 14.568,20.409C13.336,20.428 11.567,18.863 10.673,18.211C8.014,16.281 6.283,15.017 5.07,14.121C4.877,13.979 4.605,14.025 4.469,14.223L3.987,14.923C3.925,15.013 3.9,15.125 3.919,15.233C3.937,15.342 3.996,15.439 4.085,15.505C5.299,16.401 7.027,17.664 9.672,19.583C10.748,20.368 12.672,22.12 14.568,22.107C16.463,22.12 18.386,20.369 19.463,19.583C22.108,17.664 23.836,16.401 25.051,15.505C25.139,15.439 25.199,15.342 25.217,15.233C25.235,15.125 25.211,15.013 25.148,14.923L24.667,14.223Z" style="fill:#555555;fill-rule:nonzero;"/>
    </g>
</svg>
