<svg width="26" height="15" viewBox="0 0 26 15" fill="none" xmlns="http://www.w3.org/2000/svg">
<path d="M25.5 0H0.5V15H25.5V0Z" fill="black"/>
<path d="M25.5 5H0.5V15H25.5V5Z" fill="#DD0000"/>
<path d="M25.5 10H0.5V15H25.5V10Z" fill="#FFCE00"/>
</svg>
