<svg width="40" height="40" viewBox="0 0 40 40" fill="none" xmlns="http://www.w3.org/2000/svg">
<path d="M22.917 15C22.917 15.3315 23.0487 15.6495 23.2831 15.8839C23.5175 16.1183 23.8355 16.25 24.167 16.25H30.0003C30.3318 16.25 30.6498 16.1183 30.8842 15.8839C31.1186 15.6495 31.2503 15.3315 31.2503 15C31.2503 14.6685 31.1186 14.3505 30.8842 14.1161C30.6498 13.8817 30.3318 13.75 30.0003 13.75H24.167C23.8355 13.75 23.5175 13.8817 23.2831 14.1161C23.0487 14.3505 22.917 14.6685 22.917 15Z" fill="white"/>
<path d="M32.9167 20C32.9167 19.6685 32.785 19.3505 32.5506 19.1161C32.3161 18.8817 31.9982 18.75 31.6667 18.75H22.5C22.1685 18.75 21.8505 18.8817 21.6161 19.1161C21.3817 19.3505 21.25 19.6685 21.25 20C21.25 20.3315 21.3817 20.6495 21.6161 20.8839C21.8505 21.1183 22.1685 21.25 22.5 21.25H31.6667C31.9982 21.25 32.3161 21.1183 32.5506 20.8839C32.785 20.6495 32.9167 20.3315 32.9167 20Z" fill="white"/>
<path d="M39.9999 18.3333C39.9959 14.7983 38.5899 11.4093 36.0902 8.90964C33.5906 6.41002 30.2015 5.00398 26.6665 5.00001H13.3332C10.9092 4.99642 8.53018 5.65506 6.45313 6.9048C4.37607 8.15454 2.67985 9.94791 1.5476 12.0913C0.415361 14.2347 -0.10989 16.6466 0.0285623 19.0667C0.167015 21.4868 0.963911 23.8231 2.33321 25.8233C2.40866 25.9339 2.45638 26.0609 2.47233 26.1938C2.48829 26.3267 2.47201 26.4614 2.42488 26.5867L0.113211 32.7533C0.0199218 33.0047 -0.0113752 33.2748 0.0219754 33.5407C0.0553259 33.8067 0.15234 34.0607 0.304787 34.2812C0.457234 34.5017 0.660616 34.6822 0.897678 34.8073C1.13474 34.9324 1.39849 34.9985 1.66654 35C1.81456 34.9996 1.9619 34.98 2.10488 34.9417L13.9999 31.6967C14.0726 31.6764 14.1477 31.6663 14.2232 31.6667H26.6665C30.2015 31.6627 33.5906 30.2567 36.0902 27.7571C38.5899 25.2574 39.9959 21.8683 39.9999 18.3333ZM36.6665 18.3333C36.6639 20.9847 35.6095 23.5267 33.7347 25.4015C31.8599 27.2763 29.3179 28.3307 26.6665 28.3333H13.8882C13.7402 28.3334 13.5928 28.353 13.4499 28.3917L5.16654 30.6533C5.0925 30.6736 5.0143 30.673 4.94058 30.6516C4.86686 30.6302 4.80047 30.5889 4.74875 30.5322C4.69703 30.4755 4.66198 30.4056 4.64748 30.3302C4.63297 30.2548 4.63957 30.1769 4.66654 30.105L6.03154 26.465C6.13612 26.1865 6.16422 25.885 6.11294 25.5919C6.06165 25.2988 5.93284 25.0248 5.73988 24.7983C4.4985 23.3484 3.69913 21.5727 3.43662 19.6821C3.17411 17.7915 3.45947 15.8652 4.25884 14.1319C5.05822 12.3985 6.33805 10.9309 7.94649 9.90313C9.55492 8.87534 11.4244 8.33053 13.3332 8.33335H26.6665C29.3179 8.336 31.8599 9.39041 33.7347 11.2652C35.6095 13.14 36.6639 15.682 36.6665 18.3333Z" fill="white"/>
<path d="M13.7285 18.4417C14.3988 18.442 15.0541 18.2436 15.6115 17.8714C16.169 17.4992 16.6036 16.97 16.8602 16.3508C17.1169 15.7316 17.1841 15.0502 17.0534 14.3928C16.9228 13.7353 16.6 13.1314 16.126 12.6575C15.6521 12.1835 15.0482 11.8608 14.3908 11.7301C13.7333 11.5994 13.0519 11.6666 12.4327 11.9233C11.8135 12.1799 11.2843 12.6145 10.9121 13.172C10.54 13.7294 10.3415 14.3848 10.3418 15.055C10.3422 15.9531 10.6992 16.8143 11.3342 17.4493C11.9692 18.0843 12.8304 18.4413 13.7285 18.4417Z" fill="white"/>
<path d="M13.7287 19.675C12.5588 19.6755 11.4192 20.0468 10.4735 20.7355C9.52786 21.4243 8.82482 22.395 8.46539 23.5083C8.44744 23.563 8.44274 23.6212 8.45167 23.678C8.4606 23.7349 8.48291 23.7888 8.51676 23.8354C8.55061 23.8819 8.59504 23.9197 8.64638 23.9458C8.69772 23.9718 8.75451 23.9852 8.81206 23.985H18.5754C18.6416 23.9849 18.7069 23.9689 18.7657 23.9385C18.8246 23.9081 18.8753 23.8641 18.9138 23.8102C18.9523 23.7563 18.9773 23.694 18.9868 23.6284C18.9964 23.5629 18.9902 23.496 18.9687 23.4333C18.5975 22.3379 17.8924 21.3864 16.9526 20.7123C16.0127 20.0382 14.8853 19.6754 13.7287 19.675Z" fill="white"/>
</svg>
