﻿<?xml version="1.0" encoding="UTF-8"?>
<TestRun id="c1fe5f19-121e-46a4-91c8-52ca7158c239" name="Serega@SEREGA-PC 2011-02-05 13:59:31" runUser="Serega-PC\Serega" xmlns="http://microsoft.com/schemas/VisualStudio/TeamTest/2006">
  <TestRunConfiguration name="Локальный тестовый запуск" id="d174884d-6d98-4888-abe6-80fe947008fa">
    <Description>Конфигурация по умолчанию для локального тестового запуска.</Description>
    <Deployment runDeploymentRoot="E:\Мои документы\ASTU\4 курс\NET программирование\MyLabs\TickTackToe\TestResults\Serega_SEREGA-PC 2011-02-05 13_59_31">
      <DeploymentItem filename="E:\Мои документы\ASTU\4 курс\NET программирование\MyLabs\TickTackToe\Test.ASTU.DotNet.TickTackToe\bin\Debug\ASTU.DotNet.TickTackToe.dll" />
    </Deployment>
    <TestTypeSpecific />
  </TestRunConfiguration>
  <ResultSummary outcome="Completed">
    <Counters total="18" executed="18" passed="18" error="0" failed="0" timeout="0" aborted="0" inconclusive="0" passedButRunAborted="0" notRunnable="0" notExecuted="0" disconnected="0" warning="0" completed="0" inProgress="0" pending="0" />
  </ResultSummary>
  <Times creation="2011-02-05T13:59:31.8221551+03:00" queuing="2011-02-05T13:59:40.5425704+03:00" start="2011-02-05T13:59:41.1197714+03:00" finish="2011-02-05T13:59:43.9589763+03:00" />
  <TestDefinitions>
    <UnitTest name="TestTurnTwiceWithTackFail" storage="e:\мои документы\astu\4 курс\net программирование\mylabs\ticktacktoe\test.astu.dotnet.ticktacktoe\bin\debug\test.astu.dotnet.ticktacktoe.dll" id="1fcb3beb-beaf-dd90-0941-1615ba80900c">
      <Css projectStructure="" iteration="" />
      <Owners>
        <Owner name="" />
      </Owners>
      <Execution id="5ff103be-70d1-4bed-8151-c2b68d64d186" />
      <TestMethod codeBase="E:\Мои документы\ASTU\4 курс\NET программирование\MyLabs\TickTackToe\Test.ASTU.DotNet.TickTackToe\bin\Debug\Test.ASTU.DotNet.TickTackToe.dll" adapterTypeName="Microsoft.VisualStudio.TestTools.TestTypes.Unit.UnitTestAdapter, Microsoft.VisualStudio.QualityTools.Tips.UnitTest.Adapter, Version=9.0.0.0, Culture=neutral, PublicKeyToken=b03f5f7f11d50a3a" className="ASTU.DotNet.TickTackToe.FieldTest, Test.ASTU.DotNet.TickTackToe" name="TestTurnTwiceWithTackFail" />
    </UnitTest>
    <UnitTest name="TestGetMarkedCells" storage="e:\мои документы\astu\4 курс\net программирование\mylabs\ticktacktoe\test.astu.dotnet.ticktacktoe\bin\debug\test.astu.dotnet.ticktacktoe.dll" id="4c2e20cf-fc51-dc86-fc85-e4086be86cb9">
      <Css projectStructure="" iteration="" />
      <Execution timeOut="200" id="a2c70597-e073-405a-b5bb-5d144341db1b" />
      <Owners>
        <Owner name="" />
      </Owners>
      <TestMethod codeBase="E:\Мои документы\ASTU\4 курс\NET программирование\MyLabs\TickTackToe\Test.ASTU.DotNet.TickTackToe\bin\Debug\Test.ASTU.DotNet.TickTackToe.dll" adapterTypeName="Microsoft.VisualStudio.TestTools.TestTypes.Unit.UnitTestAdapter, Microsoft.VisualStudio.QualityTools.Tips.UnitTest.Adapter, Version=9.0.0.0, Culture=neutral, PublicKeyToken=b03f5f7f11d50a3a" className="ASTU.DotNet.TickTackToe.FieldTest, Test.ASTU.DotNet.TickTackToe" name="TestGetMarkedCells" />
    </UnitTest>
    <UnitTest name="TestTurnTackSuccess" storage="e:\мои документы\astu\4 курс\net программирование\mylabs\ticktacktoe\test.astu.dotnet.ticktacktoe\bin\debug\test.astu.dotnet.ticktacktoe.dll" id="75ca722b-7035-99d4-02f0-1835bfc541a1">
      <Css projectStructure="" iteration="" />
      <Owners>
        <Owner name="" />
      </Owners>
      <Execution id="0aff941c-886f-40a4-be6e-30969b93405b" />
      <TestMethod codeBase="E:\Мои документы\ASTU\4 курс\NET программирование\MyLabs\TickTackToe\Test.ASTU.DotNet.TickTackToe\bin\Debug\Test.ASTU.DotNet.TickTackToe.dll" adapterTypeName="Microsoft.VisualStudio.TestTools.TestTypes.Unit.UnitTestAdapter, Microsoft.VisualStudio.QualityTools.Tips.UnitTest.Adapter, Version=9.0.0.0, Culture=neutral, PublicKeyToken=b03f5f7f11d50a3a" className="ASTU.DotNet.TickTackToe.FieldTest, Test.ASTU.DotNet.TickTackToe" name="TestTurnTackSuccess" />
    </UnitTest>
    <UnitTest name="TestTurnWithMaxXYSuccess" storage="e:\мои документы\astu\4 курс\net программирование\mylabs\ticktacktoe\test.astu.dotnet.ticktacktoe\bin\debug\test.astu.dotnet.ticktacktoe.dll" id="3a9f98fb-20c9-98bd-2a01-f3221be78905">
      <Css projectStructure="" iteration="" />
      <Owners>
        <Owner name="" />
      </Owners>
      <Execution id="b13972ae-55ad-49ef-8858-8d47dee42bf9" />
      <TestMethod codeBase="E:\Мои документы\ASTU\4 курс\NET программирование\MyLabs\TickTackToe\Test.ASTU.DotNet.TickTackToe\bin\Debug\Test.ASTU.DotNet.TickTackToe.dll" adapterTypeName="Microsoft.VisualStudio.TestTools.TestTypes.Unit.UnitTestAdapter, Microsoft.VisualStudio.QualityTools.Tips.UnitTest.Adapter, Version=9.0.0.0, Culture=neutral, PublicKeyToken=b03f5f7f11d50a3a" className="ASTU.DotNet.TickTackToe.FieldTest, Test.ASTU.DotNet.TickTackToe" name="TestTurnWithMaxXYSuccess" />
    </UnitTest>
    <UnitTest name="TestTurnEmptyCellFail" storage="e:\мои документы\astu\4 курс\net программирование\mylabs\ticktacktoe\test.astu.dotnet.ticktacktoe\bin\debug\test.astu.dotnet.ticktacktoe.dll" id="fe14218f-e222-7abd-f200-c6963ae8b778">
      <Css projectStructure="" iteration="" />
      <Owners>
        <Owner name="" />
      </Owners>
      <Execution id="3dcd2f3c-f840-4caf-8a93-244ec6bdb487" />
      <TestMethod codeBase="E:\Мои документы\ASTU\4 курс\NET программирование\MyLabs\TickTackToe\Test.ASTU.DotNet.TickTackToe\bin\Debug\Test.ASTU.DotNet.TickTackToe.dll" adapterTypeName="Microsoft.VisualStudio.TestTools.TestTypes.Unit.UnitTestAdapter, Microsoft.VisualStudio.QualityTools.Tips.UnitTest.Adapter, Version=9.0.0.0, Culture=neutral, PublicKeyToken=b03f5f7f11d50a3a" className="ASTU.DotNet.TickTackToe.FieldTest, Test.ASTU.DotNet.TickTackToe" name="TestTurnEmptyCellFail" />
    </UnitTest>
    <UnitTest name="TestGameEnd1" storage="e:\мои документы\astu\4 курс\net программирование\mylabs\ticktacktoe\test.astu.dotnet.ticktacktoe\bin\debug\test.astu.dotnet.ticktacktoe.dll" id="ec0349d8-2fde-e48e-ca15-04e7fef66a05">
      <Css projectStructure="" iteration="" />
      <Execution timeOut="200" id="cfc0f06a-35fe-45d4-a55d-8f51b55d97bf" />
      <Owners>
        <Owner name="" />
      </Owners>
      <TestMethod codeBase="E:\Мои документы\ASTU\4 курс\NET программирование\MyLabs\TickTackToe\Test.ASTU.DotNet.TickTackToe\bin\Debug\Test.ASTU.DotNet.TickTackToe.dll" adapterTypeName="Microsoft.VisualStudio.TestTools.TestTypes.Unit.UnitTestAdapter, Microsoft.VisualStudio.QualityTools.Tips.UnitTest.Adapter, Version=9.0.0.0, Culture=neutral, PublicKeyToken=b03f5f7f11d50a3a" className="ASTU.DotNet.TickTackToe.FieldTest, Test.ASTU.DotNet.TickTackToe" name="TestGameEnd1" />
    </UnitTest>
    <UnitTest name="TestTurnTwiceWithTickFail" storage="e:\мои документы\astu\4 курс\net программирование\mylabs\ticktacktoe\test.astu.dotnet.ticktacktoe\bin\debug\test.astu.dotnet.ticktacktoe.dll" id="b7b79e5c-0d10-4d25-8371-5542b16f4fc9">
      <Css projectStructure="" iteration="" />
      <Owners>
        <Owner name="" />
      </Owners>
      <Execution id="69ff1bc7-81cc-4ac2-989f-7673b7a0e148" />
      <TestMethod codeBase="E:\Мои документы\ASTU\4 курс\NET программирование\MyLabs\TickTackToe\Test.ASTU.DotNet.TickTackToe\bin\Debug\Test.ASTU.DotNet.TickTackToe.dll" adapterTypeName="Microsoft.VisualStudio.TestTools.TestTypes.Unit.UnitTestAdapter, Microsoft.VisualStudio.QualityTools.Tips.UnitTest.Adapter, Version=9.0.0.0, Culture=neutral, PublicKeyToken=b03f5f7f11d50a3a" className="ASTU.DotNet.TickTackToe.FieldTest, Test.ASTU.DotNet.TickTackToe" name="TestTurnTwiceWithTickFail" />
    </UnitTest>
    <UnitTest name="TestGameEnd2" storage="e:\мои документы\astu\4 курс\net программирование\mylabs\ticktacktoe\test.astu.dotnet.ticktacktoe\bin\debug\test.astu.dotnet.ticktacktoe.dll" id="9b3c6f7b-3759-cfb8-0224-2983979d00f9">
      <Css projectStructure="" iteration="" />
      <Execution timeOut="200" id="5670d485-71dc-4340-8382-4bc2acf4ef64" />
      <Owners>
        <Owner name="" />
      </Owners>
      <TestMethod codeBase="E:\Мои документы\ASTU\4 курс\NET программирование\MyLabs\TickTackToe\Test.ASTU.DotNet.TickTackToe\bin\Debug\Test.ASTU.DotNet.TickTackToe.dll" adapterTypeName="Microsoft.VisualStudio.TestTools.TestTypes.Unit.UnitTestAdapter, Microsoft.VisualStudio.QualityTools.Tips.UnitTest.Adapter, Version=9.0.0.0, Culture=neutral, PublicKeyToken=b03f5f7f11d50a3a" className="ASTU.DotNet.TickTackToe.FieldTest, Test.ASTU.DotNet.TickTackToe" name="TestGameEnd2" />
    </UnitTest>
    <UnitTest name="TestCellInitConstructor" storage="e:\мои документы\astu\4 курс\net программирование\mylabs\ticktacktoe\test.astu.dotnet.ticktacktoe\bin\debug\test.astu.dotnet.ticktacktoe.dll" id="e83100a5-a4ef-47dc-57af-9ddffcaff485">
      <Css projectStructure="" iteration="" />
      <Owners>
        <Owner name="" />
      </Owners>
      <Execution id="99397294-b3a2-4803-b3fe-b87da91cd57d" />
      <TestMethod codeBase="E:\Мои документы\ASTU\4 курс\NET программирование\MyLabs\TickTackToe\Test.ASTU.DotNet.TickTackToe\bin\Debug\Test.ASTU.DotNet.TickTackToe.dll" adapterTypeName="Microsoft.VisualStudio.TestTools.TestTypes.Unit.UnitTestAdapter, Microsoft.VisualStudio.QualityTools.Tips.UnitTest.Adapter, Version=9.0.0.0, Culture=neutral, PublicKeyToken=b03f5f7f11d50a3a" className="ASTU.DotNet.TickTackToe.FieldCellTest, Test.ASTU.DotNet.TickTackToe" name="TestCellInitConstructor" />
    </UnitTest>
    <UnitTest name="TestGameEnd4" storage="e:\мои документы\astu\4 курс\net программирование\mylabs\ticktacktoe\test.astu.dotnet.ticktacktoe\bin\debug\test.astu.dotnet.ticktacktoe.dll" id="3f1c87d7-7309-6c31-9bf2-0759b54b615f">
      <Css projectStructure="" iteration="" />
      <Execution timeOut="200" id="d079cfb0-df1f-4bae-b922-1ea70f5cc1ad" />
      <Owners>
        <Owner name="" />
      </Owners>
      <TestMethod codeBase="E:\Мои документы\ASTU\4 курс\NET программирование\MyLabs\TickTackToe\Test.ASTU.DotNet.TickTackToe\bin\Debug\Test.ASTU.DotNet.TickTackToe.dll" adapterTypeName="Microsoft.VisualStudio.TestTools.TestTypes.Unit.UnitTestAdapter, Microsoft.VisualStudio.QualityTools.Tips.UnitTest.Adapter, Version=9.0.0.0, Culture=neutral, PublicKeyToken=b03f5f7f11d50a3a" className="ASTU.DotNet.TickTackToe.FieldTest, Test.ASTU.DotNet.TickTackToe" name="TestGameEnd4" />
    </UnitTest>
    <UnitTest name="TestTurnToOccupatedCellFail" storage="e:\мои документы\astu\4 курс\net программирование\mylabs\ticktacktoe\test.astu.dotnet.ticktacktoe\bin\debug\test.astu.dotnet.ticktacktoe.dll" id="826a73c8-3d98-d569-5644-a0cea07ec4cf">
      <Css projectStructure="" iteration="" />
      <Owners>
        <Owner name="" />
      </Owners>
      <Execution id="45befb6f-890e-4e9b-8af1-7426feac3b22" />
      <TestMethod codeBase="E:\Мои документы\ASTU\4 курс\NET программирование\MyLabs\TickTackToe\Test.ASTU.DotNet.TickTackToe\bin\Debug\Test.ASTU.DotNet.TickTackToe.dll" adapterTypeName="Microsoft.VisualStudio.TestTools.TestTypes.Unit.UnitTestAdapter, Microsoft.VisualStudio.QualityTools.Tips.UnitTest.Adapter, Version=9.0.0.0, Culture=neutral, PublicKeyToken=b03f5f7f11d50a3a" className="ASTU.DotNet.TickTackToe.FieldTest, Test.ASTU.DotNet.TickTackToe" name="TestTurnToOccupatedCellFail" />
    </UnitTest>
    <UnitTest name="TestTurnWithMinXYSuccess" storage="e:\мои документы\astu\4 курс\net программирование\mylabs\ticktacktoe\test.astu.dotnet.ticktacktoe\bin\debug\test.astu.dotnet.ticktacktoe.dll" id="3ea1f732-7934-8ccf-c4a1-0b81c373bb9e">
      <Css projectStructure="" iteration="" />
      <Owners>
        <Owner name="" />
      </Owners>
      <Execution id="e8a60443-0784-45af-b3ba-6a91000f599b" />
      <TestMethod codeBase="E:\Мои документы\ASTU\4 курс\NET программирование\MyLabs\TickTackToe\Test.ASTU.DotNet.TickTackToe\bin\Debug\Test.ASTU.DotNet.TickTackToe.dll" adapterTypeName="Microsoft.VisualStudio.TestTools.TestTypes.Unit.UnitTestAdapter, Microsoft.VisualStudio.QualityTools.Tips.UnitTest.Adapter, Version=9.0.0.0, Culture=neutral, PublicKeyToken=b03f5f7f11d50a3a" className="ASTU.DotNet.TickTackToe.FieldTest, Test.ASTU.DotNet.TickTackToe" name="TestTurnWithMinXYSuccess" />
    </UnitTest>
    <UnitTest name="TestAnywayTurnToOccupatedCellFail" storage="e:\мои документы\astu\4 курс\net программирование\mylabs\ticktacktoe\test.astu.dotnet.ticktacktoe\bin\debug\test.astu.dotnet.ticktacktoe.dll" id="a3671cd1-312a-bf39-1c59-1f695804fd99">
      <Css projectStructure="" iteration="" />
      <Owners>
        <Owner name="" />
      </Owners>
      <Execution id="7fb44418-aa74-4c79-8e21-deb51230576b" />
      <TestMethod codeBase="E:\Мои документы\ASTU\4 курс\NET программирование\MyLabs\TickTackToe\Test.ASTU.DotNet.TickTackToe\bin\Debug\Test.ASTU.DotNet.TickTackToe.dll" adapterTypeName="Microsoft.VisualStudio.TestTools.TestTypes.Unit.UnitTestAdapter, Microsoft.VisualStudio.QualityTools.Tips.UnitTest.Adapter, Version=9.0.0.0, Culture=neutral, PublicKeyToken=b03f5f7f11d50a3a" className="ASTU.DotNet.TickTackToe.FieldTest, Test.ASTU.DotNet.TickTackToe" name="TestAnywayTurnToOccupatedCellFail" />
    </UnitTest>
    <UnitTest name="TestCellStateProperty" storage="e:\мои документы\astu\4 курс\net программирование\mylabs\ticktacktoe\test.astu.dotnet.ticktacktoe\bin\debug\test.astu.dotnet.ticktacktoe.dll" id="a7a4b21f-d768-ac4a-5c67-93ff9000fc85">
      <Css projectStructure="" iteration="" />
      <Owners>
        <Owner name="" />
      </Owners>
      <Execution id="6c95ceef-47f1-4153-94e5-1c960b141ca9" />
      <TestMethod codeBase="E:\Мои документы\ASTU\4 курс\NET программирование\MyLabs\TickTackToe\Test.ASTU.DotNet.TickTackToe\bin\Debug\Test.ASTU.DotNet.TickTackToe.dll" adapterTypeName="Microsoft.VisualStudio.TestTools.TestTypes.Unit.UnitTestAdapter, Microsoft.VisualStudio.QualityTools.Tips.UnitTest.Adapter, Version=9.0.0.0, Culture=neutral, PublicKeyToken=b03f5f7f11d50a3a" className="ASTU.DotNet.TickTackToe.FieldCellTest, Test.ASTU.DotNet.TickTackToe" name="TestCellStateProperty" />
    </UnitTest>
    <UnitTest name="TestFieldConstructor" storage="e:\мои документы\astu\4 курс\net программирование\mylabs\ticktacktoe\test.astu.dotnet.ticktacktoe\bin\debug\test.astu.dotnet.ticktacktoe.dll" id="57925799-8b83-0b29-4fee-3ec9eb72342d">
      <Css projectStructure="" iteration="" />
      <Owners>
        <Owner name="" />
      </Owners>
      <Execution id="ff4e2e5a-75b1-4490-8d27-2a3dc2843e92" />
      <TestMethod codeBase="E:\Мои документы\ASTU\4 курс\NET программирование\MyLabs\TickTackToe\Test.ASTU.DotNet.TickTackToe\bin\Debug\Test.ASTU.DotNet.TickTackToe.dll" adapterTypeName="Microsoft.VisualStudio.TestTools.TestTypes.Unit.UnitTestAdapter, Microsoft.VisualStudio.QualityTools.Tips.UnitTest.Adapter, Version=9.0.0.0, Culture=neutral, PublicKeyToken=b03f5f7f11d50a3a" className="ASTU.DotNet.TickTackToe.FieldTest, Test.ASTU.DotNet.TickTackToe" name="TestFieldConstructor" />
    </UnitTest>
    <UnitTest name="TestGameEnd3" storage="e:\мои документы\astu\4 курс\net программирование\mylabs\ticktacktoe\test.astu.dotnet.ticktacktoe\bin\debug\test.astu.dotnet.ticktacktoe.dll" id="b78170cb-cb19-2e68-c647-97a61376799f">
      <Css projectStructure="" iteration="" />
      <Execution timeOut="200" id="db7c8284-6650-4c49-826d-3a841319b99d" />
      <Owners>
        <Owner name="" />
      </Owners>
      <TestMethod codeBase="E:\Мои документы\ASTU\4 курс\NET программирование\MyLabs\TickTackToe\Test.ASTU.DotNet.TickTackToe\bin\Debug\Test.ASTU.DotNet.TickTackToe.dll" adapterTypeName="Microsoft.VisualStudio.TestTools.TestTypes.Unit.UnitTestAdapter, Microsoft.VisualStudio.QualityTools.Tips.UnitTest.Adapter, Version=9.0.0.0, Culture=neutral, PublicKeyToken=b03f5f7f11d50a3a" className="ASTU.DotNet.TickTackToe.FieldTest, Test.ASTU.DotNet.TickTackToe" name="TestGameEnd3" />
    </UnitTest>
    <UnitTest name="TestCellConstructor" storage="e:\мои документы\astu\4 курс\net программирование\mylabs\ticktacktoe\test.astu.dotnet.ticktacktoe\bin\debug\test.astu.dotnet.ticktacktoe.dll" id="978bdc92-099e-6551-2853-6f444453dbb5">
      <Css projectStructure="" iteration="" />
      <Owners>
        <Owner name="" />
      </Owners>
      <Execution id="dfc45e79-a940-4445-ac68-c5f541a0f83f" />
      <TestMethod codeBase="E:\Мои документы\ASTU\4 курс\NET программирование\MyLabs\TickTackToe\Test.ASTU.DotNet.TickTackToe\bin\Debug\Test.ASTU.DotNet.TickTackToe.dll" adapterTypeName="Microsoft.VisualStudio.TestTools.TestTypes.Unit.UnitTestAdapter, Microsoft.VisualStudio.QualityTools.Tips.UnitTest.Adapter, Version=9.0.0.0, Culture=neutral, PublicKeyToken=b03f5f7f11d50a3a" className="ASTU.DotNet.TickTackToe.FieldCellTest, Test.ASTU.DotNet.TickTackToe" name="TestCellConstructor" />
    </UnitTest>
    <UnitTest name="TestTurnTickSuccess" storage="e:\мои документы\astu\4 курс\net программирование\mylabs\ticktacktoe\test.astu.dotnet.ticktacktoe\bin\debug\test.astu.dotnet.ticktacktoe.dll" id="f9f5ed88-1af5-807a-27eb-bab3040cf1b5">
      <Css projectStructure="" iteration="" />
      <Owners>
        <Owner name="" />
      </Owners>
      <Execution id="1ffb4ac8-f280-4ebc-a907-dbf56bfe2168" />
      <TestMethod codeBase="E:\Мои документы\ASTU\4 курс\NET программирование\MyLabs\TickTackToe\Test.ASTU.DotNet.TickTackToe\bin\Debug\Test.ASTU.DotNet.TickTackToe.dll" adapterTypeName="Microsoft.VisualStudio.TestTools.TestTypes.Unit.UnitTestAdapter, Microsoft.VisualStudio.QualityTools.Tips.UnitTest.Adapter, Version=9.0.0.0, Culture=neutral, PublicKeyToken=b03f5f7f11d50a3a" className="ASTU.DotNet.TickTackToe.FieldTest, Test.ASTU.DotNet.TickTackToe" name="TestTurnTickSuccess" />
    </UnitTest>
  </TestDefinitions>
  <TestLists>
    <TestList name="Отсутствующие в списке результаты" id="8c84fa94-04c1-424b-9868-57a2d4851a1d" />
    <TestList name="Все загруженные результаты" id="19431567-8539-422a-85d7-44ee4e166bda" />
  </TestLists>
  <TestEntries>
    <TestEntry testId="978bdc92-099e-6551-2853-6f444453dbb5" executionId="dfc45e79-a940-4445-ac68-c5f541a0f83f" testListId="8c84fa94-04c1-424b-9868-57a2d4851a1d" />
    <TestEntry testId="e83100a5-a4ef-47dc-57af-9ddffcaff485" executionId="99397294-b3a2-4803-b3fe-b87da91cd57d" testListId="8c84fa94-04c1-424b-9868-57a2d4851a1d" />
    <TestEntry testId="a7a4b21f-d768-ac4a-5c67-93ff9000fc85" executionId="6c95ceef-47f1-4153-94e5-1c960b141ca9" testListId="8c84fa94-04c1-424b-9868-57a2d4851a1d" />
    <TestEntry testId="57925799-8b83-0b29-4fee-3ec9eb72342d" executionId="ff4e2e5a-75b1-4490-8d27-2a3dc2843e92" testListId="8c84fa94-04c1-424b-9868-57a2d4851a1d" />
    <TestEntry testId="f9f5ed88-1af5-807a-27eb-bab3040cf1b5" executionId="1ffb4ac8-f280-4ebc-a907-dbf56bfe2168" testListId="8c84fa94-04c1-424b-9868-57a2d4851a1d" />
    <TestEntry testId="75ca722b-7035-99d4-02f0-1835bfc541a1" executionId="0aff941c-886f-40a4-be6e-30969b93405b" testListId="8c84fa94-04c1-424b-9868-57a2d4851a1d" />
    <TestEntry testId="3a9f98fb-20c9-98bd-2a01-f3221be78905" executionId="b13972ae-55ad-49ef-8858-8d47dee42bf9" testListId="8c84fa94-04c1-424b-9868-57a2d4851a1d" />
    <TestEntry testId="3ea1f732-7934-8ccf-c4a1-0b81c373bb9e" executionId="e8a60443-0784-45af-b3ba-6a91000f599b" testListId="8c84fa94-04c1-424b-9868-57a2d4851a1d" />
    <TestEntry testId="fe14218f-e222-7abd-f200-c6963ae8b778" executionId="3dcd2f3c-f840-4caf-8a93-244ec6bdb487" testListId="8c84fa94-04c1-424b-9868-57a2d4851a1d" />
    <TestEntry testId="826a73c8-3d98-d569-5644-a0cea07ec4cf" executionId="45befb6f-890e-4e9b-8af1-7426feac3b22" testListId="8c84fa94-04c1-424b-9868-57a2d4851a1d" />
    <TestEntry testId="a3671cd1-312a-bf39-1c59-1f695804fd99" executionId="7fb44418-aa74-4c79-8e21-deb51230576b" testListId="8c84fa94-04c1-424b-9868-57a2d4851a1d" />
    <TestEntry testId="b7b79e5c-0d10-4d25-8371-5542b16f4fc9" executionId="69ff1bc7-81cc-4ac2-989f-7673b7a0e148" testListId="8c84fa94-04c1-424b-9868-57a2d4851a1d" />
    <TestEntry testId="1fcb3beb-beaf-dd90-0941-1615ba80900c" executionId="5ff103be-70d1-4bed-8151-c2b68d64d186" testListId="8c84fa94-04c1-424b-9868-57a2d4851a1d" />
    <TestEntry testId="ec0349d8-2fde-e48e-ca15-04e7fef66a05" executionId="cfc0f06a-35fe-45d4-a55d-8f51b55d97bf" testListId="8c84fa94-04c1-424b-9868-57a2d4851a1d" />
    <TestEntry testId="9b3c6f7b-3759-cfb8-0224-2983979d00f9" executionId="5670d485-71dc-4340-8382-4bc2acf4ef64" testListId="8c84fa94-04c1-424b-9868-57a2d4851a1d" />
    <TestEntry testId="b78170cb-cb19-2e68-c647-97a61376799f" executionId="db7c8284-6650-4c49-826d-3a841319b99d" testListId="8c84fa94-04c1-424b-9868-57a2d4851a1d" />
    <TestEntry testId="3f1c87d7-7309-6c31-9bf2-0759b54b615f" executionId="d079cfb0-df1f-4bae-b922-1ea70f5cc1ad" testListId="8c84fa94-04c1-424b-9868-57a2d4851a1d" />
    <TestEntry testId="4c2e20cf-fc51-dc86-fc85-e4086be86cb9" executionId="a2c70597-e073-405a-b5bb-5d144341db1b" testListId="8c84fa94-04c1-424b-9868-57a2d4851a1d" />
  </TestEntries>
  <Results>
    <UnitTestResult executionId="dfc45e79-a940-4445-ac68-c5f541a0f83f" testId="978bdc92-099e-6551-2853-6f444453dbb5" testName="TestCellConstructor" computerName="SEREGA-PC" duration="00:00:00.0326030" startTime="2011-02-05T13:59:41.2289716+03:00" endTime="2011-02-05T13:59:42.6017739+03:00" testType="13cdc9d9-ddb5-4fa4-a97d-d965ccfc6d4b" outcome="Passed" testListId="8c84fa94-04c1-424b-9868-57a2d4851a1d">
      <Output>
      </Output>
    </UnitTestResult>
    <UnitTestResult executionId="99397294-b3a2-4803-b3fe-b87da91cd57d" testId="e83100a5-a4ef-47dc-57af-9ddffcaff485" testName="TestCellInitConstructor" computerName="SEREGA-PC" duration="00:00:00.0008301" startTime="2011-02-05T13:59:42.6017739+03:00" endTime="2011-02-05T13:59:42.6173740+03:00" testType="13cdc9d9-ddb5-4fa4-a97d-d965ccfc6d4b" outcome="Passed" testListId="8c84fa94-04c1-424b-9868-57a2d4851a1d">
      <Output>
      </Output>
    </UnitTestResult>
    <UnitTestResult executionId="6c95ceef-47f1-4153-94e5-1c960b141ca9" testId="a7a4b21f-d768-ac4a-5c67-93ff9000fc85" testName="TestCellStateProperty" computerName="SEREGA-PC" duration="00:00:00.0005470" startTime="2011-02-05T13:59:42.6173740+03:00" endTime="2011-02-05T13:59:42.6329740+03:00" testType="13cdc9d9-ddb5-4fa4-a97d-d965ccfc6d4b" outcome="Passed" testListId="8c84fa94-04c1-424b-9868-57a2d4851a1d">
      <Output>
      </Output>
    </UnitTestResult>
    <UnitTestResult executionId="ff4e2e5a-75b1-4490-8d27-2a3dc2843e92" testId="57925799-8b83-0b29-4fee-3ec9eb72342d" testName="TestFieldConstructor" computerName="SEREGA-PC" duration="00:00:00.6323778" startTime="2011-02-05T13:59:42.6329740+03:00" endTime="2011-02-05T13:59:43.2725751+03:00" testType="13cdc9d9-ddb5-4fa4-a97d-d965ccfc6d4b" outcome="Passed" testListId="8c84fa94-04c1-424b-9868-57a2d4851a1d">
      <Output>
      </Output>
    </UnitTestResult>
    <UnitTestResult executionId="1ffb4ac8-f280-4ebc-a907-dbf56bfe2168" testId="f9f5ed88-1af5-807a-27eb-bab3040cf1b5" testName="TestTurnTickSuccess" computerName="SEREGA-PC" duration="00:00:00.0047070" startTime="2011-02-05T13:59:43.2725751+03:00" endTime="2011-02-05T13:59:43.2881751+03:00" testType="13cdc9d9-ddb5-4fa4-a97d-d965ccfc6d4b" outcome="Passed" testListId="8c84fa94-04c1-424b-9868-57a2d4851a1d">
      <Output>
      </Output>
    </UnitTestResult>
    <UnitTestResult executionId="0aff941c-886f-40a4-be6e-30969b93405b" testId="75ca722b-7035-99d4-02f0-1835bfc541a1" testName="TestTurnTackSuccess" computerName="SEREGA-PC" duration="00:00:00.0012549" startTime="2011-02-05T13:59:43.2881751+03:00" endTime="2011-02-05T13:59:43.3037752+03:00" testType="13cdc9d9-ddb5-4fa4-a97d-d965ccfc6d4b" outcome="Passed" testListId="8c84fa94-04c1-424b-9868-57a2d4851a1d">
      <Output>
      </Output>
    </UnitTestResult>
    <UnitTestResult executionId="b13972ae-55ad-49ef-8858-8d47dee42bf9" testId="3a9f98fb-20c9-98bd-2a01-f3221be78905" testName="TestTurnWithMaxXYSuccess" computerName="SEREGA-PC" duration="00:00:00.0004429" startTime="2011-02-05T13:59:43.3037752+03:00" endTime="2011-02-05T13:59:43.3193752+03:00" testType="13cdc9d9-ddb5-4fa4-a97d-d965ccfc6d4b" outcome="Passed" testListId="8c84fa94-04c1-424b-9868-57a2d4851a1d">
      <Output>
      </Output>
    </UnitTestResult>
    <UnitTestResult executionId="e8a60443-0784-45af-b3ba-6a91000f599b" testId="3ea1f732-7934-8ccf-c4a1-0b81c373bb9e" testName="TestTurnWithMinXYSuccess" computerName="SEREGA-PC" duration="00:00:00.0004380" startTime="2011-02-05T13:59:43.3193752+03:00" endTime="2011-02-05T13:59:43.3349752+03:00" testType="13cdc9d9-ddb5-4fa4-a97d-d965ccfc6d4b" outcome="Passed" testListId="8c84fa94-04c1-424b-9868-57a2d4851a1d">
      <Output>
      </Output>
    </UnitTestResult>
    <UnitTestResult executionId="3dcd2f3c-f840-4caf-8a93-244ec6bdb487" testId="fe14218f-e222-7abd-f200-c6963ae8b778" testName="TestTurnEmptyCellFail" computerName="SEREGA-PC" duration="00:00:00.1047825" startTime="2011-02-05T13:59:43.3349752+03:00" endTime="2011-02-05T13:59:43.4597754+03:00" testType="13cdc9d9-ddb5-4fa4-a97d-d965ccfc6d4b" outcome="Passed" testListId="8c84fa94-04c1-424b-9868-57a2d4851a1d">
      <Output>
      </Output>
    </UnitTestResult>
    <UnitTestResult executionId="45befb6f-890e-4e9b-8af1-7426feac3b22" testId="826a73c8-3d98-d569-5644-a0cea07ec4cf" testName="TestTurnToOccupatedCellFail" computerName="SEREGA-PC" duration="00:00:00.0163944" startTime="2011-02-05T13:59:43.4753755+03:00" endTime="2011-02-05T13:59:43.5065755+03:00" testType="13cdc9d9-ddb5-4fa4-a97d-d965ccfc6d4b" outcome="Passed" testListId="8c84fa94-04c1-424b-9868-57a2d4851a1d">
      <Output>
      </Output>
    </UnitTestResult>
    <UnitTestResult executionId="7fb44418-aa74-4c79-8e21-deb51230576b" testId="a3671cd1-312a-bf39-1c59-1f695804fd99" testName="TestAnywayTurnToOccupatedCellFail" computerName="SEREGA-PC" duration="00:00:00.0062572" startTime="2011-02-05T13:59:43.5065755+03:00" endTime="2011-02-05T13:59:43.5221755+03:00" testType="13cdc9d9-ddb5-4fa4-a97d-d965ccfc6d4b" outcome="Passed" testListId="8c84fa94-04c1-424b-9868-57a2d4851a1d">
      <Output>
      </Output>
    </UnitTestResult>
    <UnitTestResult executionId="69ff1bc7-81cc-4ac2-989f-7673b7a0e148" testId="b7b79e5c-0d10-4d25-8371-5542b16f4fc9" testName="TestTurnTwiceWithTickFail" computerName="SEREGA-PC" duration="00:00:00.0064543" startTime="2011-02-05T13:59:43.5689756+03:00" endTime="2011-02-05T13:59:43.5845757+03:00" testType="13cdc9d9-ddb5-4fa4-a97d-d965ccfc6d4b" outcome="Passed" testListId="8c84fa94-04c1-424b-9868-57a2d4851a1d">
      <Output>
      </Output>
    </UnitTestResult>
    <UnitTestResult executionId="5ff103be-70d1-4bed-8151-c2b68d64d186" testId="1fcb3beb-beaf-dd90-0941-1615ba80900c" testName="TestTurnTwiceWithTackFail" computerName="SEREGA-PC" duration="00:00:00.0066669" startTime="2011-02-05T13:59:43.5845757+03:00" endTime="2011-02-05T13:59:43.6001757+03:00" testType="13cdc9d9-ddb5-4fa4-a97d-d965ccfc6d4b" outcome="Passed" testListId="8c84fa94-04c1-424b-9868-57a2d4851a1d">
      <Output>
      </Output>
    </UnitTestResult>
    <UnitTestResult executionId="cfc0f06a-35fe-45d4-a55d-8f51b55d97bf" testId="ec0349d8-2fde-e48e-ca15-04e7fef66a05" testName="TestGameEnd1" computerName="SEREGA-PC" duration="00:00:00.0099987" startTime="2011-02-05T13:59:43.6001757+03:00" endTime="2011-02-05T13:59:43.6313757+03:00" testType="13cdc9d9-ddb5-4fa4-a97d-d965ccfc6d4b" outcome="Passed" testListId="8c84fa94-04c1-424b-9868-57a2d4851a1d">
      <Output>
      </Output>
    </UnitTestResult>
    <UnitTestResult executionId="5670d485-71dc-4340-8382-4bc2acf4ef64" testId="9b3c6f7b-3759-cfb8-0224-2983979d00f9" testName="TestGameEnd2" computerName="SEREGA-PC" duration="00:00:00.0075494" startTime="2011-02-05T13:59:43.6313757+03:00" endTime="2011-02-05T13:59:43.6469758+03:00" testType="13cdc9d9-ddb5-4fa4-a97d-d965ccfc6d4b" outcome="Passed" testListId="8c84fa94-04c1-424b-9868-57a2d4851a1d">
      <Output>
      </Output>
    </UnitTestResult>
    <UnitTestResult executionId="db7c8284-6650-4c49-826d-3a841319b99d" testId="b78170cb-cb19-2e68-c647-97a61376799f" testName="TestGameEnd3" computerName="SEREGA-PC" duration="00:00:00.0098638" startTime="2011-02-05T13:59:43.6469758+03:00" endTime="2011-02-05T13:59:43.6781758+03:00" testType="13cdc9d9-ddb5-4fa4-a97d-d965ccfc6d4b" outcome="Passed" testListId="8c84fa94-04c1-424b-9868-57a2d4851a1d">
      <Output>
      </Output>
    </UnitTestResult>
    <UnitTestResult executionId="d079cfb0-df1f-4bae-b922-1ea70f5cc1ad" testId="3f1c87d7-7309-6c31-9bf2-0759b54b615f" testName="TestGameEnd4" computerName="SEREGA-PC" duration="00:00:00.0091564" startTime="2011-02-05T13:59:43.6781758+03:00" endTime="2011-02-05T13:59:43.6937758+03:00" testType="13cdc9d9-ddb5-4fa4-a97d-d965ccfc6d4b" outcome="Passed" testListId="8c84fa94-04c1-424b-9868-57a2d4851a1d">
      <Output>
      </Output>
    </UnitTestResult>
    <UnitTestResult executionId="a2c70597-e073-405a-b5bb-5d144341db1b" testId="4c2e20cf-fc51-dc86-fc85-e4086be86cb9" testName="TestGetMarkedCells" computerName="SEREGA-PC" duration="00:00:00.0110694" startTime="2011-02-05T13:59:43.6937758+03:00" endTime="2011-02-05T13:59:43.7249759+03:00" testType="13cdc9d9-ddb5-4fa4-a97d-d965ccfc6d4b" outcome="Passed" testListId="8c84fa94-04c1-424b-9868-57a2d4851a1d">
      <Output>
      </Output>
    </UnitTestResult>
  </Results>
</TestRun>