﻿<?xml version="1.0" encoding="UTF-8"?>
<TestRun id="42493307-d99f-4567-a079-dc30fa87d719" name="Serega@SEREGA-PC 2010-12-08 16:23:30" runUser="Serega-PC\Serega" xmlns="http://microsoft.com/schemas/VisualStudio/TeamTest/2006">
  <TestRunConfiguration name="Локальный тестовый запуск" id="d174884d-6d98-4888-abe6-80fe947008fa">
    <Description>Конфигурация по умолчанию для локального тестового запуска.</Description>
    <Deployment runDeploymentRoot="I:\4 курс\NET программирование\MyLabs\TickTackToe\TestResults\Serega_SEREGA-PC 2010-12-08 16_23_30">
      <DeploymentItem filename="I:\4 курс\NET программирование\MyLabs\TickTackToe\ASTU.DotNet.TickTackToe\bin\Debug\ASTU.DotNet.TickTackToe.dll" />
    </Deployment>
    <TestTypeSpecific />
  </TestRunConfiguration>
  <ResultSummary outcome="Error">
    <Counters total="18" executed="12" passed="11" error="0" failed="0" timeout="0" aborted="1" inconclusive="0" passedButRunAborted="0" notRunnable="0" notExecuted="6" disconnected="0" warning="0" completed="0" inProgress="0" pending="0" />
    <RunInfos>
      <RunInfo computerName="SEREGA-PC" outcome="Error" timestamp="2010-12-08T16:25:17.7571118+03:00">
        <Text>Неожиданный выход из тестового хост-процесса.</Text>
      </RunInfo>
    </RunInfos>
  </ResultSummary>
  <Times creation="2010-12-08T16:23:30.8039944+03:00" queuing="2010-12-08T16:23:33.4481456+03:00" start="2010-12-08T16:23:34.3661981+03:00" finish="2010-12-08T16:25:17.7591119+03:00" />
  <TestDefinitions>
    <UnitTest name="TestTurnTwiceWithTackFail" storage="i:\4 курс\net программирование\mylabs\ticktacktoe\test.astu.dotnet.ticktacktoe\bin\debug\test.astu.dotnet.ticktacktoe.dll" id="1fcb3beb-beaf-dd90-0941-1615ba80900c">
      <Css projectStructure="" iteration="" />
      <Owners>
        <Owner name="" />
      </Owners>
      <TestMethod codeBase="I:\4 курс\NET программирование\MyLabs\TickTackToe\Test.ASTU.DotNet.TickTackToe\bin\Debug\Test.ASTU.DotNet.TickTackToe.dll" adapterTypeName="Microsoft.VisualStudio.TestTools.TestTypes.Unit.UnitTestAdapter, Microsoft.VisualStudio.QualityTools.Tips.UnitTest.Adapter, Version=9.0.0.0, Culture=neutral, PublicKeyToken=b03f5f7f11d50a3a" className="ASTU.DotNet.TickTackToe.FieldTest, Test.ASTU.DotNet.TickTackToe" name="TestTurnTwiceWithTackFail" />
    </UnitTest>
    <UnitTest name="TestGetMarkedCells" storage="i:\4 курс\net программирование\mylabs\ticktacktoe\test.astu.dotnet.ticktacktoe\bin\debug\test.astu.dotnet.ticktacktoe.dll" id="4c2e20cf-fc51-dc86-fc85-e4086be86cb9">
      <Css projectStructure="" iteration="" />
      <Execution timeOut="200" />
      <Owners>
        <Owner name="" />
      </Owners>
      <TestMethod codeBase="I:\4 курс\NET программирование\MyLabs\TickTackToe\Test.ASTU.DotNet.TickTackToe\bin\Debug\Test.ASTU.DotNet.TickTackToe.dll" adapterTypeName="Microsoft.VisualStudio.TestTools.TestTypes.Unit.UnitTestAdapter, Microsoft.VisualStudio.QualityTools.Tips.UnitTest.Adapter, Version=9.0.0.0, Culture=neutral, PublicKeyToken=b03f5f7f11d50a3a" className="ASTU.DotNet.TickTackToe.FieldTest, Test.ASTU.DotNet.TickTackToe" name="TestGetMarkedCells" />
    </UnitTest>
    <UnitTest name="TestTurnTackSuccess" storage="i:\4 курс\net программирование\mylabs\ticktacktoe\test.astu.dotnet.ticktacktoe\bin\debug\test.astu.dotnet.ticktacktoe.dll" id="75ca722b-7035-99d4-02f0-1835bfc541a1">
      <Css projectStructure="" iteration="" />
      <Owners>
        <Owner name="" />
      </Owners>
      <Execution id="f23e83e6-7dfc-4ed3-98fc-013fa33bb849" />
      <TestMethod codeBase="I:\4 курс\NET программирование\MyLabs\TickTackToe\Test.ASTU.DotNet.TickTackToe\bin\Debug\Test.ASTU.DotNet.TickTackToe.dll" adapterTypeName="Microsoft.VisualStudio.TestTools.TestTypes.Unit.UnitTestAdapter, Microsoft.VisualStudio.QualityTools.Tips.UnitTest.Adapter, Version=9.0.0.0, Culture=neutral, PublicKeyToken=b03f5f7f11d50a3a" className="ASTU.DotNet.TickTackToe.FieldTest, Test.ASTU.DotNet.TickTackToe" name="TestTurnTackSuccess" />
    </UnitTest>
    <UnitTest name="TestTurnWithMaxXYSuccess" storage="i:\4 курс\net программирование\mylabs\ticktacktoe\test.astu.dotnet.ticktacktoe\bin\debug\test.astu.dotnet.ticktacktoe.dll" id="3a9f98fb-20c9-98bd-2a01-f3221be78905">
      <Css projectStructure="" iteration="" />
      <Owners>
        <Owner name="" />
      </Owners>
      <Execution id="56ef3287-8c52-4c4f-a186-f0d12fbd6616" />
      <TestMethod codeBase="I:\4 курс\NET программирование\MyLabs\TickTackToe\Test.ASTU.DotNet.TickTackToe\bin\Debug\Test.ASTU.DotNet.TickTackToe.dll" adapterTypeName="Microsoft.VisualStudio.TestTools.TestTypes.Unit.UnitTestAdapter, Microsoft.VisualStudio.QualityTools.Tips.UnitTest.Adapter, Version=9.0.0.0, Culture=neutral, PublicKeyToken=b03f5f7f11d50a3a" className="ASTU.DotNet.TickTackToe.FieldTest, Test.ASTU.DotNet.TickTackToe" name="TestTurnWithMaxXYSuccess" />
    </UnitTest>
    <UnitTest name="TestTurnEmptyCellFail" storage="i:\4 курс\net программирование\mylabs\ticktacktoe\test.astu.dotnet.ticktacktoe\bin\debug\test.astu.dotnet.ticktacktoe.dll" id="fe14218f-e222-7abd-f200-c6963ae8b778">
      <Css projectStructure="" iteration="" />
      <Owners>
        <Owner name="" />
      </Owners>
      <Execution id="af54ab5e-34f1-417a-baf9-ffb2c0aafc2f" />
      <TestMethod codeBase="I:\4 курс\NET программирование\MyLabs\TickTackToe\Test.ASTU.DotNet.TickTackToe\bin\Debug\Test.ASTU.DotNet.TickTackToe.dll" adapterTypeName="Microsoft.VisualStudio.TestTools.TestTypes.Unit.UnitTestAdapter, Microsoft.VisualStudio.QualityTools.Tips.UnitTest.Adapter, Version=9.0.0.0, Culture=neutral, PublicKeyToken=b03f5f7f11d50a3a" className="ASTU.DotNet.TickTackToe.FieldTest, Test.ASTU.DotNet.TickTackToe" name="TestTurnEmptyCellFail" />
    </UnitTest>
    <UnitTest name="TestGameEnd1" storage="i:\4 курс\net программирование\mylabs\ticktacktoe\test.astu.dotnet.ticktacktoe\bin\debug\test.astu.dotnet.ticktacktoe.dll" id="ec0349d8-2fde-e48e-ca15-04e7fef66a05">
      <Css projectStructure="" iteration="" />
      <Execution timeOut="200" />
      <Owners>
        <Owner name="" />
      </Owners>
      <TestMethod codeBase="I:\4 курс\NET программирование\MyLabs\TickTackToe\Test.ASTU.DotNet.TickTackToe\bin\Debug\Test.ASTU.DotNet.TickTackToe.dll" adapterTypeName="Microsoft.VisualStudio.TestTools.TestTypes.Unit.UnitTestAdapter, Microsoft.VisualStudio.QualityTools.Tips.UnitTest.Adapter, Version=9.0.0.0, Culture=neutral, PublicKeyToken=b03f5f7f11d50a3a" className="ASTU.DotNet.TickTackToe.FieldTest, Test.ASTU.DotNet.TickTackToe" name="TestGameEnd1" />
    </UnitTest>
    <UnitTest name="TestTurnTwiceWithTickFail" storage="i:\4 курс\net программирование\mylabs\ticktacktoe\test.astu.dotnet.ticktacktoe\bin\debug\test.astu.dotnet.ticktacktoe.dll" id="b7b79e5c-0d10-4d25-8371-5542b16f4fc9">
      <Css projectStructure="" iteration="" />
      <Owners>
        <Owner name="" />
      </Owners>
      <Execution id="98c1c0c9-3baf-41e8-9f3f-b6aef4551794" />
      <TestMethod codeBase="I:\4 курс\NET программирование\MyLabs\TickTackToe\Test.ASTU.DotNet.TickTackToe\bin\Debug\Test.ASTU.DotNet.TickTackToe.dll" adapterTypeName="Microsoft.VisualStudio.TestTools.TestTypes.Unit.UnitTestAdapter, Microsoft.VisualStudio.QualityTools.Tips.UnitTest.Adapter, Version=9.0.0.0, Culture=neutral, PublicKeyToken=b03f5f7f11d50a3a" className="ASTU.DotNet.TickTackToe.FieldTest, Test.ASTU.DotNet.TickTackToe" name="TestTurnTwiceWithTickFail" />
    </UnitTest>
    <UnitTest name="TestGameEnd2" storage="i:\4 курс\net программирование\mylabs\ticktacktoe\test.astu.dotnet.ticktacktoe\bin\debug\test.astu.dotnet.ticktacktoe.dll" id="9b3c6f7b-3759-cfb8-0224-2983979d00f9">
      <Css projectStructure="" iteration="" />
      <Execution timeOut="200" />
      <Owners>
        <Owner name="" />
      </Owners>
      <TestMethod codeBase="I:\4 курс\NET программирование\MyLabs\TickTackToe\Test.ASTU.DotNet.TickTackToe\bin\Debug\Test.ASTU.DotNet.TickTackToe.dll" adapterTypeName="Microsoft.VisualStudio.TestTools.TestTypes.Unit.UnitTestAdapter, Microsoft.VisualStudio.QualityTools.Tips.UnitTest.Adapter, Version=9.0.0.0, Culture=neutral, PublicKeyToken=b03f5f7f11d50a3a" className="ASTU.DotNet.TickTackToe.FieldTest, Test.ASTU.DotNet.TickTackToe" name="TestGameEnd2" />
    </UnitTest>
    <UnitTest name="TestCellInitConstructor" storage="i:\4 курс\net программирование\mylabs\ticktacktoe\test.astu.dotnet.ticktacktoe\bin\debug\test.astu.dotnet.ticktacktoe.dll" id="e83100a5-a4ef-47dc-57af-9ddffcaff485">
      <Css projectStructure="" iteration="" />
      <Owners>
        <Owner name="" />
      </Owners>
      <Execution id="9658f68d-3460-4e6d-9785-c578dfb2cf87" />
      <TestMethod codeBase="I:\4 курс\NET программирование\MyLabs\TickTackToe\Test.ASTU.DotNet.TickTackToe\bin\Debug\Test.ASTU.DotNet.TickTackToe.dll" adapterTypeName="Microsoft.VisualStudio.TestTools.TestTypes.Unit.UnitTestAdapter, Microsoft.VisualStudio.QualityTools.Tips.UnitTest.Adapter, Version=9.0.0.0, Culture=neutral, PublicKeyToken=b03f5f7f11d50a3a" className="ASTU.DotNet.TickTackToe.FieldCellTest, Test.ASTU.DotNet.TickTackToe" name="TestCellInitConstructor" />
    </UnitTest>
    <UnitTest name="TestGameEnd4" storage="i:\4 курс\net программирование\mylabs\ticktacktoe\test.astu.dotnet.ticktacktoe\bin\debug\test.astu.dotnet.ticktacktoe.dll" id="3f1c87d7-7309-6c31-9bf2-0759b54b615f">
      <Css projectStructure="" iteration="" />
      <Execution timeOut="200" />
      <Owners>
        <Owner name="" />
      </Owners>
      <TestMethod codeBase="I:\4 курс\NET программирование\MyLabs\TickTackToe\Test.ASTU.DotNet.TickTackToe\bin\Debug\Test.ASTU.DotNet.TickTackToe.dll" adapterTypeName="Microsoft.VisualStudio.TestTools.TestTypes.Unit.UnitTestAdapter, Microsoft.VisualStudio.QualityTools.Tips.UnitTest.Adapter, Version=9.0.0.0, Culture=neutral, PublicKeyToken=b03f5f7f11d50a3a" className="ASTU.DotNet.TickTackToe.FieldTest, Test.ASTU.DotNet.TickTackToe" name="TestGameEnd4" />
    </UnitTest>
    <UnitTest name="TestTurnToOccupatedCellFail" storage="i:\4 курс\net программирование\mylabs\ticktacktoe\test.astu.dotnet.ticktacktoe\bin\debug\test.astu.dotnet.ticktacktoe.dll" id="826a73c8-3d98-d569-5644-a0cea07ec4cf">
      <Css projectStructure="" iteration="" />
      <Owners>
        <Owner name="" />
      </Owners>
      <Execution id="57976c20-a467-42ea-b69a-2d32f4312428" />
      <TestMethod codeBase="I:\4 курс\NET программирование\MyLabs\TickTackToe\Test.ASTU.DotNet.TickTackToe\bin\Debug\Test.ASTU.DotNet.TickTackToe.dll" adapterTypeName="Microsoft.VisualStudio.TestTools.TestTypes.Unit.UnitTestAdapter, Microsoft.VisualStudio.QualityTools.Tips.UnitTest.Adapter, Version=9.0.0.0, Culture=neutral, PublicKeyToken=b03f5f7f11d50a3a" className="ASTU.DotNet.TickTackToe.FieldTest, Test.ASTU.DotNet.TickTackToe" name="TestTurnToOccupatedCellFail" />
    </UnitTest>
    <UnitTest name="TestTurnWithMinXYSuccess" storage="i:\4 курс\net программирование\mylabs\ticktacktoe\test.astu.dotnet.ticktacktoe\bin\debug\test.astu.dotnet.ticktacktoe.dll" id="3ea1f732-7934-8ccf-c4a1-0b81c373bb9e">
      <Css projectStructure="" iteration="" />
      <Owners>
        <Owner name="" />
      </Owners>
      <Execution id="e99ab1ea-7de8-440e-8108-da452b63e2ab" />
      <TestMethod codeBase="I:\4 курс\NET программирование\MyLabs\TickTackToe\Test.ASTU.DotNet.TickTackToe\bin\Debug\Test.ASTU.DotNet.TickTackToe.dll" adapterTypeName="Microsoft.VisualStudio.TestTools.TestTypes.Unit.UnitTestAdapter, Microsoft.VisualStudio.QualityTools.Tips.UnitTest.Adapter, Version=9.0.0.0, Culture=neutral, PublicKeyToken=b03f5f7f11d50a3a" className="ASTU.DotNet.TickTackToe.FieldTest, Test.ASTU.DotNet.TickTackToe" name="TestTurnWithMinXYSuccess" />
    </UnitTest>
    <UnitTest name="TestAnywayTurnToOccupatedCellFail" storage="i:\4 курс\net программирование\mylabs\ticktacktoe\test.astu.dotnet.ticktacktoe\bin\debug\test.astu.dotnet.ticktacktoe.dll" id="a3671cd1-312a-bf39-1c59-1f695804fd99">
      <Css projectStructure="" iteration="" />
      <Owners>
        <Owner name="" />
      </Owners>
      <Execution id="fc747981-9fcc-4d9c-a027-a207208bb256" />
      <TestMethod codeBase="I:\4 курс\NET программирование\MyLabs\TickTackToe\Test.ASTU.DotNet.TickTackToe\bin\Debug\Test.ASTU.DotNet.TickTackToe.dll" adapterTypeName="Microsoft.VisualStudio.TestTools.TestTypes.Unit.UnitTestAdapter, Microsoft.VisualStudio.QualityTools.Tips.UnitTest.Adapter, Version=9.0.0.0, Culture=neutral, PublicKeyToken=b03f5f7f11d50a3a" className="ASTU.DotNet.TickTackToe.FieldTest, Test.ASTU.DotNet.TickTackToe" name="TestAnywayTurnToOccupatedCellFail" />
    </UnitTest>
    <UnitTest name="TestCellStateProperty" storage="i:\4 курс\net программирование\mylabs\ticktacktoe\test.astu.dotnet.ticktacktoe\bin\debug\test.astu.dotnet.ticktacktoe.dll" id="a7a4b21f-d768-ac4a-5c67-93ff9000fc85">
      <Css projectStructure="" iteration="" />
      <Owners>
        <Owner name="" />
      </Owners>
      <Execution id="3a9e2053-06a3-4c16-9177-33625f74607f" />
      <TestMethod codeBase="I:\4 курс\NET программирование\MyLabs\TickTackToe\Test.ASTU.DotNet.TickTackToe\bin\Debug\Test.ASTU.DotNet.TickTackToe.dll" adapterTypeName="Microsoft.VisualStudio.TestTools.TestTypes.Unit.UnitTestAdapter, Microsoft.VisualStudio.QualityTools.Tips.UnitTest.Adapter, Version=9.0.0.0, Culture=neutral, PublicKeyToken=b03f5f7f11d50a3a" className="ASTU.DotNet.TickTackToe.FieldCellTest, Test.ASTU.DotNet.TickTackToe" name="TestCellStateProperty" />
    </UnitTest>
    <UnitTest name="TestFieldConstructor" storage="i:\4 курс\net программирование\mylabs\ticktacktoe\test.astu.dotnet.ticktacktoe\bin\debug\test.astu.dotnet.ticktacktoe.dll" id="57925799-8b83-0b29-4fee-3ec9eb72342d">
      <Css projectStructure="" iteration="" />
      <Owners>
        <Owner name="" />
      </Owners>
      <Execution id="a3850739-72e1-42aa-ad44-5756e00c1133" />
      <TestMethod codeBase="I:\4 курс\NET программирование\MyLabs\TickTackToe\Test.ASTU.DotNet.TickTackToe\bin\Debug\Test.ASTU.DotNet.TickTackToe.dll" adapterTypeName="Microsoft.VisualStudio.TestTools.TestTypes.Unit.UnitTestAdapter, Microsoft.VisualStudio.QualityTools.Tips.UnitTest.Adapter, Version=9.0.0.0, Culture=neutral, PublicKeyToken=b03f5f7f11d50a3a" className="ASTU.DotNet.TickTackToe.FieldTest, Test.ASTU.DotNet.TickTackToe" name="TestFieldConstructor" />
    </UnitTest>
    <UnitTest name="TestGameEnd3" storage="i:\4 курс\net программирование\mylabs\ticktacktoe\test.astu.dotnet.ticktacktoe\bin\debug\test.astu.dotnet.ticktacktoe.dll" id="b78170cb-cb19-2e68-c647-97a61376799f">
      <Css projectStructure="" iteration="" />
      <Execution timeOut="200" />
      <Owners>
        <Owner name="" />
      </Owners>
      <TestMethod codeBase="I:\4 курс\NET программирование\MyLabs\TickTackToe\Test.ASTU.DotNet.TickTackToe\bin\Debug\Test.ASTU.DotNet.TickTackToe.dll" adapterTypeName="Microsoft.VisualStudio.TestTools.TestTypes.Unit.UnitTestAdapter, Microsoft.VisualStudio.QualityTools.Tips.UnitTest.Adapter, Version=9.0.0.0, Culture=neutral, PublicKeyToken=b03f5f7f11d50a3a" className="ASTU.DotNet.TickTackToe.FieldTest, Test.ASTU.DotNet.TickTackToe" name="TestGameEnd3" />
    </UnitTest>
    <UnitTest name="TestCellConstructor" storage="i:\4 курс\net программирование\mylabs\ticktacktoe\test.astu.dotnet.ticktacktoe\bin\debug\test.astu.dotnet.ticktacktoe.dll" id="978bdc92-099e-6551-2853-6f444453dbb5">
      <Css projectStructure="" iteration="" />
      <Owners>
        <Owner name="" />
      </Owners>
      <Execution id="c7f05e10-d586-4d36-810e-3cf43e918d91" />
      <TestMethod codeBase="I:\4 курс\NET программирование\MyLabs\TickTackToe\Test.ASTU.DotNet.TickTackToe\bin\Debug\Test.ASTU.DotNet.TickTackToe.dll" adapterTypeName="Microsoft.VisualStudio.TestTools.TestTypes.Unit.UnitTestAdapter, Microsoft.VisualStudio.QualityTools.Tips.UnitTest.Adapter, Version=9.0.0.0, Culture=neutral, PublicKeyToken=b03f5f7f11d50a3a" className="ASTU.DotNet.TickTackToe.FieldCellTest, Test.ASTU.DotNet.TickTackToe" name="TestCellConstructor" />
    </UnitTest>
    <UnitTest name="TestTurnTickSuccess" storage="i:\4 курс\net программирование\mylabs\ticktacktoe\test.astu.dotnet.ticktacktoe\bin\debug\test.astu.dotnet.ticktacktoe.dll" id="f9f5ed88-1af5-807a-27eb-bab3040cf1b5">
      <Css projectStructure="" iteration="" />
      <Owners>
        <Owner name="" />
      </Owners>
      <Execution id="7f0f68b6-b8ea-4036-bd7f-21a730ce7f9c" />
      <TestMethod codeBase="I:\4 курс\NET программирование\MyLabs\TickTackToe\Test.ASTU.DotNet.TickTackToe\bin\Debug\Test.ASTU.DotNet.TickTackToe.dll" adapterTypeName="Microsoft.VisualStudio.TestTools.TestTypes.Unit.UnitTestAdapter, Microsoft.VisualStudio.QualityTools.Tips.UnitTest.Adapter, Version=9.0.0.0, Culture=neutral, PublicKeyToken=b03f5f7f11d50a3a" className="ASTU.DotNet.TickTackToe.FieldTest, Test.ASTU.DotNet.TickTackToe" name="TestTurnTickSuccess" />
    </UnitTest>
  </TestDefinitions>
  <TestLists>
    <TestList name="Отсутствующие в списке результаты" id="8c84fa94-04c1-424b-9868-57a2d4851a1d" />
    <TestList name="Все загруженные результаты" id="19431567-8539-422a-85d7-44ee4e166bda" />
  </TestLists>
  <TestEntries>
    <TestEntry testId="978bdc92-099e-6551-2853-6f444453dbb5" executionId="c7f05e10-d586-4d36-810e-3cf43e918d91" testListId="8c84fa94-04c1-424b-9868-57a2d4851a1d" />
    <TestEntry testId="e83100a5-a4ef-47dc-57af-9ddffcaff485" executionId="9658f68d-3460-4e6d-9785-c578dfb2cf87" testListId="8c84fa94-04c1-424b-9868-57a2d4851a1d" />
    <TestEntry testId="a7a4b21f-d768-ac4a-5c67-93ff9000fc85" executionId="3a9e2053-06a3-4c16-9177-33625f74607f" testListId="8c84fa94-04c1-424b-9868-57a2d4851a1d" />
    <TestEntry testId="57925799-8b83-0b29-4fee-3ec9eb72342d" executionId="a3850739-72e1-42aa-ad44-5756e00c1133" testListId="8c84fa94-04c1-424b-9868-57a2d4851a1d" />
    <TestEntry testId="f9f5ed88-1af5-807a-27eb-bab3040cf1b5" executionId="7f0f68b6-b8ea-4036-bd7f-21a730ce7f9c" testListId="8c84fa94-04c1-424b-9868-57a2d4851a1d" />
    <TestEntry testId="75ca722b-7035-99d4-02f0-1835bfc541a1" executionId="f23e83e6-7dfc-4ed3-98fc-013fa33bb849" testListId="8c84fa94-04c1-424b-9868-57a2d4851a1d" />
    <TestEntry testId="3a9f98fb-20c9-98bd-2a01-f3221be78905" executionId="56ef3287-8c52-4c4f-a186-f0d12fbd6616" testListId="8c84fa94-04c1-424b-9868-57a2d4851a1d" />
    <TestEntry testId="3ea1f732-7934-8ccf-c4a1-0b81c373bb9e" executionId="e99ab1ea-7de8-440e-8108-da452b63e2ab" testListId="8c84fa94-04c1-424b-9868-57a2d4851a1d" />
    <TestEntry testId="fe14218f-e222-7abd-f200-c6963ae8b778" executionId="af54ab5e-34f1-417a-baf9-ffb2c0aafc2f" testListId="8c84fa94-04c1-424b-9868-57a2d4851a1d" />
    <TestEntry testId="826a73c8-3d98-d569-5644-a0cea07ec4cf" executionId="57976c20-a467-42ea-b69a-2d32f4312428" testListId="8c84fa94-04c1-424b-9868-57a2d4851a1d" />
    <TestEntry testId="a3671cd1-312a-bf39-1c59-1f695804fd99" executionId="fc747981-9fcc-4d9c-a027-a207208bb256" testListId="8c84fa94-04c1-424b-9868-57a2d4851a1d" />
    <TestEntry testId="b7b79e5c-0d10-4d25-8371-5542b16f4fc9" executionId="59df6a3f-dd78-4851-b30d-b3f0d11806de" testListId="8c84fa94-04c1-424b-9868-57a2d4851a1d" />
    <TestEntry testId="1fcb3beb-beaf-dd90-0941-1615ba80900c" executionId="59d435b0-1aa1-4ea6-9ee7-075158e99f83" testListId="8c84fa94-04c1-424b-9868-57a2d4851a1d" />
    <TestEntry testId="ec0349d8-2fde-e48e-ca15-04e7fef66a05" executionId="861bd51b-91ad-44dc-ac07-3a006fddf62f" testListId="8c84fa94-04c1-424b-9868-57a2d4851a1d" />
    <TestEntry testId="9b3c6f7b-3759-cfb8-0224-2983979d00f9" executionId="cd71db79-89ad-4339-8b12-77395a7bde20" testListId="8c84fa94-04c1-424b-9868-57a2d4851a1d" />
    <TestEntry testId="b78170cb-cb19-2e68-c647-97a61376799f" executionId="c3fbf8fb-14fd-43cc-917f-3c9e515e1b6a" testListId="8c84fa94-04c1-424b-9868-57a2d4851a1d" />
    <TestEntry testId="3f1c87d7-7309-6c31-9bf2-0759b54b615f" executionId="b17314ac-a207-4fdb-b51b-7ec049b4acdd" testListId="8c84fa94-04c1-424b-9868-57a2d4851a1d" />
    <TestEntry testId="4c2e20cf-fc51-dc86-fc85-e4086be86cb9" executionId="e0521d29-d520-479b-9dd7-0ac00cc4517d" testListId="8c84fa94-04c1-424b-9868-57a2d4851a1d" />
  </TestEntries>
  <Results>
    <UnitTestResult executionId="c7f05e10-d586-4d36-810e-3cf43e918d91" testId="978bdc92-099e-6551-2853-6f444453dbb5" testName="TestCellConstructor" computerName="SEREGA-PC" duration="00:00:00.0178933" startTime="2010-12-08T16:23:34.5242072+03:00" endTime="2010-12-08T16:23:36.1222986+03:00" testType="13cdc9d9-ddb5-4fa4-a97d-d965ccfc6d4b" outcome="Passed" testListId="8c84fa94-04c1-424b-9868-57a2d4851a1d">
      <Output>
      </Output>
    </UnitTestResult>
    <UnitTestResult executionId="9658f68d-3460-4e6d-9785-c578dfb2cf87" testId="e83100a5-a4ef-47dc-57af-9ddffcaff485" testName="TestCellInitConstructor" computerName="SEREGA-PC" duration="00:00:00.0013058" startTime="2010-12-08T16:23:36.1302990+03:00" endTime="2010-12-08T16:23:36.1412997+03:00" testType="13cdc9d9-ddb5-4fa4-a97d-d965ccfc6d4b" outcome="Passed" testListId="8c84fa94-04c1-424b-9868-57a2d4851a1d">
      <Output>
      </Output>
    </UnitTestResult>
    <UnitTestResult executionId="3a9e2053-06a3-4c16-9177-33625f74607f" testId="a7a4b21f-d768-ac4a-5c67-93ff9000fc85" testName="TestCellStateProperty" computerName="SEREGA-PC" duration="00:00:00.0005553" startTime="2010-12-08T16:23:36.1452999+03:00" endTime="2010-12-08T16:23:36.1583006+03:00" testType="13cdc9d9-ddb5-4fa4-a97d-d965ccfc6d4b" outcome="Passed" testListId="8c84fa94-04c1-424b-9868-57a2d4851a1d">
      <Output>
      </Output>
    </UnitTestResult>
    <UnitTestResult executionId="a3850739-72e1-42aa-ad44-5756e00c1133" testId="57925799-8b83-0b29-4fee-3ec9eb72342d" testName="TestFieldConstructor" computerName="SEREGA-PC" duration="00:00:00.0369135" startTime="2010-12-08T16:23:36.1633009+03:00" endTime="2010-12-08T16:23:36.2133038+03:00" testType="13cdc9d9-ddb5-4fa4-a97d-d965ccfc6d4b" outcome="Passed" testListId="8c84fa94-04c1-424b-9868-57a2d4851a1d">
      <Output>
      </Output>
    </UnitTestResult>
    <UnitTestResult executionId="7f0f68b6-b8ea-4036-bd7f-21a730ce7f9c" testId="f9f5ed88-1af5-807a-27eb-bab3040cf1b5" testName="TestTurnTickSuccess" computerName="SEREGA-PC" duration="00:00:00.0038333" startTime="2010-12-08T16:23:36.2193041+03:00" endTime="2010-12-08T16:23:36.2343050+03:00" testType="13cdc9d9-ddb5-4fa4-a97d-d965ccfc6d4b" outcome="Passed" testListId="8c84fa94-04c1-424b-9868-57a2d4851a1d">
      <Output>
      </Output>
    </UnitTestResult>
    <UnitTestResult executionId="f23e83e6-7dfc-4ed3-98fc-013fa33bb849" testId="75ca722b-7035-99d4-02f0-1835bfc541a1" testName="TestTurnTackSuccess" computerName="SEREGA-PC" duration="00:00:00.0041071" startTime="2010-12-08T16:23:36.2393053+03:00" endTime="2010-12-08T16:23:36.2523060+03:00" testType="13cdc9d9-ddb5-4fa4-a97d-d965ccfc6d4b" outcome="Passed" testListId="8c84fa94-04c1-424b-9868-57a2d4851a1d">
      <Output>
      </Output>
    </UnitTestResult>
    <UnitTestResult executionId="56ef3287-8c52-4c4f-a186-f0d12fbd6616" testId="3a9f98fb-20c9-98bd-2a01-f3221be78905" testName="TestTurnWithMaxXYSuccess" computerName="SEREGA-PC" duration="00:00:00.0012559" startTime="2010-12-08T16:23:36.2573063+03:00" endTime="2010-12-08T16:23:36.2683069+03:00" testType="13cdc9d9-ddb5-4fa4-a97d-d965ccfc6d4b" outcome="Passed" testListId="8c84fa94-04c1-424b-9868-57a2d4851a1d">
      <Output>
      </Output>
    </UnitTestResult>
    <UnitTestResult executionId="e99ab1ea-7de8-440e-8108-da452b63e2ab" testId="3ea1f732-7934-8ccf-c4a1-0b81c373bb9e" testName="TestTurnWithMinXYSuccess" computerName="SEREGA-PC" duration="00:00:00.0004468" startTime="2010-12-08T16:23:36.2733072+03:00" endTime="2010-12-08T16:23:36.2873080+03:00" testType="13cdc9d9-ddb5-4fa4-a97d-d965ccfc6d4b" outcome="Passed" testListId="8c84fa94-04c1-424b-9868-57a2d4851a1d">
      <Output>
      </Output>
    </UnitTestResult>
    <UnitTestResult executionId="af54ab5e-34f1-417a-baf9-ffb2c0aafc2f" testId="fe14218f-e222-7abd-f200-c6963ae8b778" testName="TestTurnEmptyCellFail" computerName="SEREGA-PC" duration="00:00:00.0101141" startTime="2010-12-08T16:23:36.2923083+03:00" endTime="2010-12-08T16:23:36.3183098+03:00" testType="13cdc9d9-ddb5-4fa4-a97d-d965ccfc6d4b" outcome="Passed" testListId="8c84fa94-04c1-424b-9868-57a2d4851a1d">
      <Output>
      </Output>
    </UnitTestResult>
    <UnitTestResult executionId="57976c20-a467-42ea-b69a-2d32f4312428" testId="826a73c8-3d98-d569-5644-a0cea07ec4cf" testName="TestTurnToOccupatedCellFail" computerName="SEREGA-PC" duration="00:00:00.0079830" startTime="2010-12-08T16:23:36.3233101+03:00" endTime="2010-12-08T16:23:36.3463114+03:00" testType="13cdc9d9-ddb5-4fa4-a97d-d965ccfc6d4b" outcome="Passed" testListId="8c84fa94-04c1-424b-9868-57a2d4851a1d">
      <Output>
      </Output>
    </UnitTestResult>
    <UnitTestResult executionId="fc747981-9fcc-4d9c-a027-a207208bb256" testId="a3671cd1-312a-bf39-1c59-1f695804fd99" testName="TestAnywayTurnToOccupatedCellFail" computerName="SEREGA-PC" duration="00:00:00.0070874" startTime="2010-12-08T16:23:36.3533118+03:00" endTime="2010-12-08T16:23:36.3743130+03:00" testType="13cdc9d9-ddb5-4fa4-a97d-d965ccfc6d4b" outcome="Passed" testListId="8c84fa94-04c1-424b-9868-57a2d4851a1d">
      <Output>
      </Output>
    </UnitTestResult>
    <UnitTestResult executionId="59df6a3f-dd78-4851-b30d-b3f0d11806de" testId="b7b79e5c-0d10-4d25-8371-5542b16f4fc9" testName="TestTurnTwiceWithTickFail" computerName="SEREGA-PC" duration="00:01:41.3357961" startTime="2010-12-08T16:23:36.4223157+03:00" endTime="2010-12-08T16:25:17.7581118+03:00" testType="13cdc9d9-ddb5-4fa4-a97d-d965ccfc6d4b" outcome="Aborted" testListId="8c84fa94-04c1-424b-9868-57a2d4851a1d">
    </UnitTestResult>
    <UnitTestResult executionId="59d435b0-1aa1-4ea6-9ee7-075158e99f83" testId="1fcb3beb-beaf-dd90-0941-1615ba80900c" testName="TestTurnTwiceWithTackFail" computerName="SEREGA-PC" duration="00:00:00" startTime="0001-01-01T03:00:00.0000000+03:00" endTime="0001-01-01T03:00:00.0000000+03:00" testType="13cdc9d9-ddb5-4fa4-a97d-d965ccfc6d4b" outcome="NotExecuted" testListId="8c84fa94-04c1-424b-9868-57a2d4851a1d">
    </UnitTestResult>
    <UnitTestResult executionId="861bd51b-91ad-44dc-ac07-3a006fddf62f" testId="ec0349d8-2fde-e48e-ca15-04e7fef66a05" testName="TestGameEnd1" computerName="SEREGA-PC" duration="00:00:00" startTime="0001-01-01T03:00:00.0000000+03:00" endTime="0001-01-01T03:00:00.0000000+03:00" testType="13cdc9d9-ddb5-4fa4-a97d-d965ccfc6d4b" outcome="NotExecuted" testListId="8c84fa94-04c1-424b-9868-57a2d4851a1d">
    </UnitTestResult>
    <UnitTestResult executionId="cd71db79-89ad-4339-8b12-77395a7bde20" testId="9b3c6f7b-3759-cfb8-0224-2983979d00f9" testName="TestGameEnd2" computerName="SEREGA-PC" duration="00:00:00" startTime="0001-01-01T03:00:00.0000000+03:00" endTime="0001-01-01T03:00:00.0000000+03:00" testType="13cdc9d9-ddb5-4fa4-a97d-d965ccfc6d4b" outcome="NotExecuted" testListId="8c84fa94-04c1-424b-9868-57a2d4851a1d">
    </UnitTestResult>
    <UnitTestResult executionId="c3fbf8fb-14fd-43cc-917f-3c9e515e1b6a" testId="b78170cb-cb19-2e68-c647-97a61376799f" testName="TestGameEnd3" computerName="SEREGA-PC" duration="00:00:00" startTime="0001-01-01T03:00:00.0000000+03:00" endTime="0001-01-01T03:00:00.0000000+03:00" testType="13cdc9d9-ddb5-4fa4-a97d-d965ccfc6d4b" outcome="NotExecuted" testListId="8c84fa94-04c1-424b-9868-57a2d4851a1d">
    </UnitTestResult>
    <UnitTestResult executionId="b17314ac-a207-4fdb-b51b-7ec049b4acdd" testId="3f1c87d7-7309-6c31-9bf2-0759b54b615f" testName="TestGameEnd4" computerName="SEREGA-PC" duration="00:00:00" startTime="0001-01-01T03:00:00.0000000+03:00" endTime="0001-01-01T03:00:00.0000000+03:00" testType="13cdc9d9-ddb5-4fa4-a97d-d965ccfc6d4b" outcome="NotExecuted" testListId="8c84fa94-04c1-424b-9868-57a2d4851a1d">
    </UnitTestResult>
    <UnitTestResult executionId="e0521d29-d520-479b-9dd7-0ac00cc4517d" testId="4c2e20cf-fc51-dc86-fc85-e4086be86cb9" testName="TestGetMarkedCells" computerName="SEREGA-PC" duration="00:00:00" startTime="0001-01-01T03:00:00.0000000+03:00" endTime="0001-01-01T03:00:00.0000000+03:00" testType="13cdc9d9-ddb5-4fa4-a97d-d965ccfc6d4b" outcome="NotExecuted" testListId="8c84fa94-04c1-424b-9868-57a2d4851a1d">
    </UnitTestResult>
  </Results>
</TestRun>