﻿<?xml version="1.0" encoding="UTF-8"?>
<TestRun id="86d16d08-832f-4d00-b284-3720ca979e8a" name="Serega@SEREGA-PC 2010-12-08 18:50:14" runUser="Serega-PC\Serega" xmlns="http://microsoft.com/schemas/VisualStudio/TeamTest/2006">
  <TestRunConfiguration name="Локальный тестовый запуск" id="d174884d-6d98-4888-abe6-80fe947008fa">
    <Description>Конфигурация по умолчанию для локального тестового запуска.</Description>
    <Deployment runDeploymentRoot="I:\4 курс\NET программирование\MyLabs\TickTackToe\TestResults\Serega_SEREGA-PC 2010-12-08 18_50_14">
      <DeploymentItem filename="I:\4 курс\NET программирование\MyLabs\TickTackToe\ASTU.DotNet.TickTackToe\bin\Debug\ASTU.DotNet.TickTackToe.dll" />
    </Deployment>
    <TestTypeSpecific />
  </TestRunConfiguration>
  <ResultSummary outcome="Failed">
    <Counters total="18" executed="18" passed="15" error="0" failed="3" timeout="0" aborted="0" inconclusive="0" passedButRunAborted="0" notRunnable="0" notExecuted="0" disconnected="0" warning="0" completed="0" inProgress="0" pending="0" />
  </ResultSummary>
  <Times creation="2010-12-08T18:50:14.7865534+03:00" queuing="2010-12-08T18:50:18.8437855+03:00" start="2010-12-08T18:50:19.4028174+03:00" finish="2010-12-08T18:55:16.2367954+03:00" />
  <TestDefinitions>
    <UnitTest name="TestTurnTwiceWithTackFail" storage="i:\4 курс\net программирование\mylabs\ticktacktoe\test.astu.dotnet.ticktacktoe\bin\debug\test.astu.dotnet.ticktacktoe.dll" id="1fcb3beb-beaf-dd90-0941-1615ba80900c">
      <Css projectStructure="" iteration="" />
      <Owners>
        <Owner name="" />
      </Owners>
      <Execution id="25ffc87a-b55e-4021-a085-c20849b62300" />
      <TestMethod codeBase="I:\4 курс\NET программирование\MyLabs\TickTackToe\Test.ASTU.DotNet.TickTackToe\bin\Debug\Test.ASTU.DotNet.TickTackToe.dll" adapterTypeName="Microsoft.VisualStudio.TestTools.TestTypes.Unit.UnitTestAdapter, Microsoft.VisualStudio.QualityTools.Tips.UnitTest.Adapter, Version=9.0.0.0, Culture=neutral, PublicKeyToken=b03f5f7f11d50a3a" className="ASTU.DotNet.TickTackToe.FieldTest, Test.ASTU.DotNet.TickTackToe" name="TestTurnTwiceWithTackFail" />
    </UnitTest>
    <UnitTest name="TestGetMarkedCells" storage="i:\4 курс\net программирование\mylabs\ticktacktoe\test.astu.dotnet.ticktacktoe\bin\debug\test.astu.dotnet.ticktacktoe.dll" id="4c2e20cf-fc51-dc86-fc85-e4086be86cb9">
      <Css projectStructure="" iteration="" />
      <Execution timeOut="200" id="9730bed2-855c-44d4-90ee-b0d3c9861438" />
      <Owners>
        <Owner name="" />
      </Owners>
      <TestMethod codeBase="I:\4 курс\NET программирование\MyLabs\TickTackToe\Test.ASTU.DotNet.TickTackToe\bin\Debug\Test.ASTU.DotNet.TickTackToe.dll" adapterTypeName="Microsoft.VisualStudio.TestTools.TestTypes.Unit.UnitTestAdapter, Microsoft.VisualStudio.QualityTools.Tips.UnitTest.Adapter, Version=9.0.0.0, Culture=neutral, PublicKeyToken=b03f5f7f11d50a3a" className="ASTU.DotNet.TickTackToe.FieldTest, Test.ASTU.DotNet.TickTackToe" name="TestGetMarkedCells" />
    </UnitTest>
    <UnitTest name="TestTurnTackSuccess" storage="i:\4 курс\net программирование\mylabs\ticktacktoe\test.astu.dotnet.ticktacktoe\bin\debug\test.astu.dotnet.ticktacktoe.dll" id="75ca722b-7035-99d4-02f0-1835bfc541a1">
      <Css projectStructure="" iteration="" />
      <Owners>
        <Owner name="" />
      </Owners>
      <Execution id="375acfcc-72eb-4eb2-b0a4-bc137b61255f" />
      <TestMethod codeBase="I:\4 курс\NET программирование\MyLabs\TickTackToe\Test.ASTU.DotNet.TickTackToe\bin\Debug\Test.ASTU.DotNet.TickTackToe.dll" adapterTypeName="Microsoft.VisualStudio.TestTools.TestTypes.Unit.UnitTestAdapter, Microsoft.VisualStudio.QualityTools.Tips.UnitTest.Adapter, Version=9.0.0.0, Culture=neutral, PublicKeyToken=b03f5f7f11d50a3a" className="ASTU.DotNet.TickTackToe.FieldTest, Test.ASTU.DotNet.TickTackToe" name="TestTurnTackSuccess" />
    </UnitTest>
    <UnitTest name="TestTurnWithMaxXYSuccess" storage="i:\4 курс\net программирование\mylabs\ticktacktoe\test.astu.dotnet.ticktacktoe\bin\debug\test.astu.dotnet.ticktacktoe.dll" id="3a9f98fb-20c9-98bd-2a01-f3221be78905">
      <Css projectStructure="" iteration="" />
      <Owners>
        <Owner name="" />
      </Owners>
      <Execution id="d8f4286f-1a5d-4d8b-b795-ced945253521" />
      <TestMethod codeBase="I:\4 курс\NET программирование\MyLabs\TickTackToe\Test.ASTU.DotNet.TickTackToe\bin\Debug\Test.ASTU.DotNet.TickTackToe.dll" adapterTypeName="Microsoft.VisualStudio.TestTools.TestTypes.Unit.UnitTestAdapter, Microsoft.VisualStudio.QualityTools.Tips.UnitTest.Adapter, Version=9.0.0.0, Culture=neutral, PublicKeyToken=b03f5f7f11d50a3a" className="ASTU.DotNet.TickTackToe.FieldTest, Test.ASTU.DotNet.TickTackToe" name="TestTurnWithMaxXYSuccess" />
    </UnitTest>
    <UnitTest name="TestTurnEmptyCellFail" storage="i:\4 курс\net программирование\mylabs\ticktacktoe\test.astu.dotnet.ticktacktoe\bin\debug\test.astu.dotnet.ticktacktoe.dll" id="fe14218f-e222-7abd-f200-c6963ae8b778">
      <Css projectStructure="" iteration="" />
      <Owners>
        <Owner name="" />
      </Owners>
      <Execution id="94db0ce6-ace6-454c-847c-70f452f9feb4" />
      <TestMethod codeBase="I:\4 курс\NET программирование\MyLabs\TickTackToe\Test.ASTU.DotNet.TickTackToe\bin\Debug\Test.ASTU.DotNet.TickTackToe.dll" adapterTypeName="Microsoft.VisualStudio.TestTools.TestTypes.Unit.UnitTestAdapter, Microsoft.VisualStudio.QualityTools.Tips.UnitTest.Adapter, Version=9.0.0.0, Culture=neutral, PublicKeyToken=b03f5f7f11d50a3a" className="ASTU.DotNet.TickTackToe.FieldTest, Test.ASTU.DotNet.TickTackToe" name="TestTurnEmptyCellFail" />
    </UnitTest>
    <UnitTest name="TestGameEnd1" storage="i:\4 курс\net программирование\mylabs\ticktacktoe\test.astu.dotnet.ticktacktoe\bin\debug\test.astu.dotnet.ticktacktoe.dll" id="ec0349d8-2fde-e48e-ca15-04e7fef66a05">
      <Css projectStructure="" iteration="" />
      <Execution timeOut="200" id="66692605-fd57-4cbb-9c3a-f005bb3f5afa" />
      <Owners>
        <Owner name="" />
      </Owners>
      <TestMethod codeBase="I:\4 курс\NET программирование\MyLabs\TickTackToe\Test.ASTU.DotNet.TickTackToe\bin\Debug\Test.ASTU.DotNet.TickTackToe.dll" adapterTypeName="Microsoft.VisualStudio.TestTools.TestTypes.Unit.UnitTestAdapter, Microsoft.VisualStudio.QualityTools.Tips.UnitTest.Adapter, Version=9.0.0.0, Culture=neutral, PublicKeyToken=b03f5f7f11d50a3a" className="ASTU.DotNet.TickTackToe.FieldTest, Test.ASTU.DotNet.TickTackToe" name="TestGameEnd1" />
    </UnitTest>
    <UnitTest name="TestTurnTwiceWithTickFail" storage="i:\4 курс\net программирование\mylabs\ticktacktoe\test.astu.dotnet.ticktacktoe\bin\debug\test.astu.dotnet.ticktacktoe.dll" id="b7b79e5c-0d10-4d25-8371-5542b16f4fc9">
      <Css projectStructure="" iteration="" />
      <Owners>
        <Owner name="" />
      </Owners>
      <Execution id="51b8f125-81a2-4f5d-a31b-d06159f79105" />
      <TestMethod codeBase="I:\4 курс\NET программирование\MyLabs\TickTackToe\Test.ASTU.DotNet.TickTackToe\bin\Debug\Test.ASTU.DotNet.TickTackToe.dll" adapterTypeName="Microsoft.VisualStudio.TestTools.TestTypes.Unit.UnitTestAdapter, Microsoft.VisualStudio.QualityTools.Tips.UnitTest.Adapter, Version=9.0.0.0, Culture=neutral, PublicKeyToken=b03f5f7f11d50a3a" className="ASTU.DotNet.TickTackToe.FieldTest, Test.ASTU.DotNet.TickTackToe" name="TestTurnTwiceWithTickFail" />
    </UnitTest>
    <UnitTest name="TestGameEnd2" storage="i:\4 курс\net программирование\mylabs\ticktacktoe\test.astu.dotnet.ticktacktoe\bin\debug\test.astu.dotnet.ticktacktoe.dll" id="9b3c6f7b-3759-cfb8-0224-2983979d00f9">
      <Css projectStructure="" iteration="" />
      <Execution timeOut="200" id="e0467a7e-9979-421a-b48e-3c8dc19c01fa" />
      <Owners>
        <Owner name="" />
      </Owners>
      <TestMethod codeBase="I:\4 курс\NET программирование\MyLabs\TickTackToe\Test.ASTU.DotNet.TickTackToe\bin\Debug\Test.ASTU.DotNet.TickTackToe.dll" adapterTypeName="Microsoft.VisualStudio.TestTools.TestTypes.Unit.UnitTestAdapter, Microsoft.VisualStudio.QualityTools.Tips.UnitTest.Adapter, Version=9.0.0.0, Culture=neutral, PublicKeyToken=b03f5f7f11d50a3a" className="ASTU.DotNet.TickTackToe.FieldTest, Test.ASTU.DotNet.TickTackToe" name="TestGameEnd2" />
    </UnitTest>
    <UnitTest name="TestCellInitConstructor" storage="i:\4 курс\net программирование\mylabs\ticktacktoe\test.astu.dotnet.ticktacktoe\bin\debug\test.astu.dotnet.ticktacktoe.dll" id="e83100a5-a4ef-47dc-57af-9ddffcaff485">
      <Css projectStructure="" iteration="" />
      <Owners>
        <Owner name="" />
      </Owners>
      <Execution id="09e17dfb-5681-4f17-8c7a-b38f919795a2" />
      <TestMethod codeBase="I:\4 курс\NET программирование\MyLabs\TickTackToe\Test.ASTU.DotNet.TickTackToe\bin\Debug\Test.ASTU.DotNet.TickTackToe.dll" adapterTypeName="Microsoft.VisualStudio.TestTools.TestTypes.Unit.UnitTestAdapter, Microsoft.VisualStudio.QualityTools.Tips.UnitTest.Adapter, Version=9.0.0.0, Culture=neutral, PublicKeyToken=b03f5f7f11d50a3a" className="ASTU.DotNet.TickTackToe.FieldCellTest, Test.ASTU.DotNet.TickTackToe" name="TestCellInitConstructor" />
    </UnitTest>
    <UnitTest name="TestGameEnd4" storage="i:\4 курс\net программирование\mylabs\ticktacktoe\test.astu.dotnet.ticktacktoe\bin\debug\test.astu.dotnet.ticktacktoe.dll" id="3f1c87d7-7309-6c31-9bf2-0759b54b615f">
      <Css projectStructure="" iteration="" />
      <Execution timeOut="200" id="056877d7-f596-4d30-9419-5ee901cd89f1" />
      <Owners>
        <Owner name="" />
      </Owners>
      <TestMethod codeBase="I:\4 курс\NET программирование\MyLabs\TickTackToe\Test.ASTU.DotNet.TickTackToe\bin\Debug\Test.ASTU.DotNet.TickTackToe.dll" adapterTypeName="Microsoft.VisualStudio.TestTools.TestTypes.Unit.UnitTestAdapter, Microsoft.VisualStudio.QualityTools.Tips.UnitTest.Adapter, Version=9.0.0.0, Culture=neutral, PublicKeyToken=b03f5f7f11d50a3a" className="ASTU.DotNet.TickTackToe.FieldTest, Test.ASTU.DotNet.TickTackToe" name="TestGameEnd4" />
    </UnitTest>
    <UnitTest name="TestTurnToOccupatedCellFail" storage="i:\4 курс\net программирование\mylabs\ticktacktoe\test.astu.dotnet.ticktacktoe\bin\debug\test.astu.dotnet.ticktacktoe.dll" id="826a73c8-3d98-d569-5644-a0cea07ec4cf">
      <Css projectStructure="" iteration="" />
      <Owners>
        <Owner name="" />
      </Owners>
      <Execution id="95e2b8b3-92e6-418d-9b4e-51664656484d" />
      <TestMethod codeBase="I:\4 курс\NET программирование\MyLabs\TickTackToe\Test.ASTU.DotNet.TickTackToe\bin\Debug\Test.ASTU.DotNet.TickTackToe.dll" adapterTypeName="Microsoft.VisualStudio.TestTools.TestTypes.Unit.UnitTestAdapter, Microsoft.VisualStudio.QualityTools.Tips.UnitTest.Adapter, Version=9.0.0.0, Culture=neutral, PublicKeyToken=b03f5f7f11d50a3a" className="ASTU.DotNet.TickTackToe.FieldTest, Test.ASTU.DotNet.TickTackToe" name="TestTurnToOccupatedCellFail" />
    </UnitTest>
    <UnitTest name="TestTurnWithMinXYSuccess" storage="i:\4 курс\net программирование\mylabs\ticktacktoe\test.astu.dotnet.ticktacktoe\bin\debug\test.astu.dotnet.ticktacktoe.dll" id="3ea1f732-7934-8ccf-c4a1-0b81c373bb9e">
      <Css projectStructure="" iteration="" />
      <Owners>
        <Owner name="" />
      </Owners>
      <Execution id="3d2735f0-1aae-48ba-a5bc-52b0ff224627" />
      <TestMethod codeBase="I:\4 курс\NET программирование\MyLabs\TickTackToe\Test.ASTU.DotNet.TickTackToe\bin\Debug\Test.ASTU.DotNet.TickTackToe.dll" adapterTypeName="Microsoft.VisualStudio.TestTools.TestTypes.Unit.UnitTestAdapter, Microsoft.VisualStudio.QualityTools.Tips.UnitTest.Adapter, Version=9.0.0.0, Culture=neutral, PublicKeyToken=b03f5f7f11d50a3a" className="ASTU.DotNet.TickTackToe.FieldTest, Test.ASTU.DotNet.TickTackToe" name="TestTurnWithMinXYSuccess" />
    </UnitTest>
    <UnitTest name="TestAnywayTurnToOccupatedCellFail" storage="i:\4 курс\net программирование\mylabs\ticktacktoe\test.astu.dotnet.ticktacktoe\bin\debug\test.astu.dotnet.ticktacktoe.dll" id="a3671cd1-312a-bf39-1c59-1f695804fd99">
      <Css projectStructure="" iteration="" />
      <Owners>
        <Owner name="" />
      </Owners>
      <Execution id="5d253304-c3c8-41bc-88cb-3259d5791fe0" />
      <TestMethod codeBase="I:\4 курс\NET программирование\MyLabs\TickTackToe\Test.ASTU.DotNet.TickTackToe\bin\Debug\Test.ASTU.DotNet.TickTackToe.dll" adapterTypeName="Microsoft.VisualStudio.TestTools.TestTypes.Unit.UnitTestAdapter, Microsoft.VisualStudio.QualityTools.Tips.UnitTest.Adapter, Version=9.0.0.0, Culture=neutral, PublicKeyToken=b03f5f7f11d50a3a" className="ASTU.DotNet.TickTackToe.FieldTest, Test.ASTU.DotNet.TickTackToe" name="TestAnywayTurnToOccupatedCellFail" />
    </UnitTest>
    <UnitTest name="TestCellStateProperty" storage="i:\4 курс\net программирование\mylabs\ticktacktoe\test.astu.dotnet.ticktacktoe\bin\debug\test.astu.dotnet.ticktacktoe.dll" id="a7a4b21f-d768-ac4a-5c67-93ff9000fc85">
      <Css projectStructure="" iteration="" />
      <Owners>
        <Owner name="" />
      </Owners>
      <Execution id="a4571c74-1bec-4ce0-b3c0-afe2c81df92d" />
      <TestMethod codeBase="I:\4 курс\NET программирование\MyLabs\TickTackToe\Test.ASTU.DotNet.TickTackToe\bin\Debug\Test.ASTU.DotNet.TickTackToe.dll" adapterTypeName="Microsoft.VisualStudio.TestTools.TestTypes.Unit.UnitTestAdapter, Microsoft.VisualStudio.QualityTools.Tips.UnitTest.Adapter, Version=9.0.0.0, Culture=neutral, PublicKeyToken=b03f5f7f11d50a3a" className="ASTU.DotNet.TickTackToe.FieldCellTest, Test.ASTU.DotNet.TickTackToe" name="TestCellStateProperty" />
    </UnitTest>
    <UnitTest name="TestFieldConstructor" storage="i:\4 курс\net программирование\mylabs\ticktacktoe\test.astu.dotnet.ticktacktoe\bin\debug\test.astu.dotnet.ticktacktoe.dll" id="57925799-8b83-0b29-4fee-3ec9eb72342d">
      <Css projectStructure="" iteration="" />
      <Owners>
        <Owner name="" />
      </Owners>
      <Execution id="2687f631-0319-44c4-b040-cd313b3d9109" />
      <TestMethod codeBase="I:\4 курс\NET программирование\MyLabs\TickTackToe\Test.ASTU.DotNet.TickTackToe\bin\Debug\Test.ASTU.DotNet.TickTackToe.dll" adapterTypeName="Microsoft.VisualStudio.TestTools.TestTypes.Unit.UnitTestAdapter, Microsoft.VisualStudio.QualityTools.Tips.UnitTest.Adapter, Version=9.0.0.0, Culture=neutral, PublicKeyToken=b03f5f7f11d50a3a" className="ASTU.DotNet.TickTackToe.FieldTest, Test.ASTU.DotNet.TickTackToe" name="TestFieldConstructor" />
    </UnitTest>
    <UnitTest name="TestGameEnd3" storage="i:\4 курс\net программирование\mylabs\ticktacktoe\test.astu.dotnet.ticktacktoe\bin\debug\test.astu.dotnet.ticktacktoe.dll" id="b78170cb-cb19-2e68-c647-97a61376799f">
      <Css projectStructure="" iteration="" />
      <Execution timeOut="200" id="ab8fcaf3-7b72-4601-9f8a-7c36dce85346" />
      <Owners>
        <Owner name="" />
      </Owners>
      <TestMethod codeBase="I:\4 курс\NET программирование\MyLabs\TickTackToe\Test.ASTU.DotNet.TickTackToe\bin\Debug\Test.ASTU.DotNet.TickTackToe.dll" adapterTypeName="Microsoft.VisualStudio.TestTools.TestTypes.Unit.UnitTestAdapter, Microsoft.VisualStudio.QualityTools.Tips.UnitTest.Adapter, Version=9.0.0.0, Culture=neutral, PublicKeyToken=b03f5f7f11d50a3a" className="ASTU.DotNet.TickTackToe.FieldTest, Test.ASTU.DotNet.TickTackToe" name="TestGameEnd3" />
    </UnitTest>
    <UnitTest name="TestCellConstructor" storage="i:\4 курс\net программирование\mylabs\ticktacktoe\test.astu.dotnet.ticktacktoe\bin\debug\test.astu.dotnet.ticktacktoe.dll" id="978bdc92-099e-6551-2853-6f444453dbb5">
      <Css projectStructure="" iteration="" />
      <Owners>
        <Owner name="" />
      </Owners>
      <Execution id="04ab3de4-d2c5-4985-8258-9e3361397b4e" />
      <TestMethod codeBase="I:\4 курс\NET программирование\MyLabs\TickTackToe\Test.ASTU.DotNet.TickTackToe\bin\Debug\Test.ASTU.DotNet.TickTackToe.dll" adapterTypeName="Microsoft.VisualStudio.TestTools.TestTypes.Unit.UnitTestAdapter, Microsoft.VisualStudio.QualityTools.Tips.UnitTest.Adapter, Version=9.0.0.0, Culture=neutral, PublicKeyToken=b03f5f7f11d50a3a" className="ASTU.DotNet.TickTackToe.FieldCellTest, Test.ASTU.DotNet.TickTackToe" name="TestCellConstructor" />
    </UnitTest>
    <UnitTest name="TestTurnTickSuccess" storage="i:\4 курс\net программирование\mylabs\ticktacktoe\test.astu.dotnet.ticktacktoe\bin\debug\test.astu.dotnet.ticktacktoe.dll" id="f9f5ed88-1af5-807a-27eb-bab3040cf1b5">
      <Css projectStructure="" iteration="" />
      <Owners>
        <Owner name="" />
      </Owners>
      <Execution id="10404c0f-a18c-4062-9bd6-9c516a7d99e1" />
      <TestMethod codeBase="I:\4 курс\NET программирование\MyLabs\TickTackToe\Test.ASTU.DotNet.TickTackToe\bin\Debug\Test.ASTU.DotNet.TickTackToe.dll" adapterTypeName="Microsoft.VisualStudio.TestTools.TestTypes.Unit.UnitTestAdapter, Microsoft.VisualStudio.QualityTools.Tips.UnitTest.Adapter, Version=9.0.0.0, Culture=neutral, PublicKeyToken=b03f5f7f11d50a3a" className="ASTU.DotNet.TickTackToe.FieldTest, Test.ASTU.DotNet.TickTackToe" name="TestTurnTickSuccess" />
    </UnitTest>
  </TestDefinitions>
  <TestLists>
    <TestList name="Отсутствующие в списке результаты" id="8c84fa94-04c1-424b-9868-57a2d4851a1d" />
    <TestList name="Все загруженные результаты" id="19431567-8539-422a-85d7-44ee4e166bda" />
  </TestLists>
  <TestEntries>
    <TestEntry testId="978bdc92-099e-6551-2853-6f444453dbb5" executionId="04ab3de4-d2c5-4985-8258-9e3361397b4e" testListId="8c84fa94-04c1-424b-9868-57a2d4851a1d" />
    <TestEntry testId="e83100a5-a4ef-47dc-57af-9ddffcaff485" executionId="09e17dfb-5681-4f17-8c7a-b38f919795a2" testListId="8c84fa94-04c1-424b-9868-57a2d4851a1d" />
    <TestEntry testId="a7a4b21f-d768-ac4a-5c67-93ff9000fc85" executionId="a4571c74-1bec-4ce0-b3c0-afe2c81df92d" testListId="8c84fa94-04c1-424b-9868-57a2d4851a1d" />
    <TestEntry testId="57925799-8b83-0b29-4fee-3ec9eb72342d" executionId="2687f631-0319-44c4-b040-cd313b3d9109" testListId="8c84fa94-04c1-424b-9868-57a2d4851a1d" />
    <TestEntry testId="f9f5ed88-1af5-807a-27eb-bab3040cf1b5" executionId="10404c0f-a18c-4062-9bd6-9c516a7d99e1" testListId="8c84fa94-04c1-424b-9868-57a2d4851a1d" />
    <TestEntry testId="75ca722b-7035-99d4-02f0-1835bfc541a1" executionId="375acfcc-72eb-4eb2-b0a4-bc137b61255f" testListId="8c84fa94-04c1-424b-9868-57a2d4851a1d" />
    <TestEntry testId="3a9f98fb-20c9-98bd-2a01-f3221be78905" executionId="d8f4286f-1a5d-4d8b-b795-ced945253521" testListId="8c84fa94-04c1-424b-9868-57a2d4851a1d" />
    <TestEntry testId="3ea1f732-7934-8ccf-c4a1-0b81c373bb9e" executionId="3d2735f0-1aae-48ba-a5bc-52b0ff224627" testListId="8c84fa94-04c1-424b-9868-57a2d4851a1d" />
    <TestEntry testId="fe14218f-e222-7abd-f200-c6963ae8b778" executionId="94db0ce6-ace6-454c-847c-70f452f9feb4" testListId="8c84fa94-04c1-424b-9868-57a2d4851a1d" />
    <TestEntry testId="826a73c8-3d98-d569-5644-a0cea07ec4cf" executionId="95e2b8b3-92e6-418d-9b4e-51664656484d" testListId="8c84fa94-04c1-424b-9868-57a2d4851a1d" />
    <TestEntry testId="a3671cd1-312a-bf39-1c59-1f695804fd99" executionId="5d253304-c3c8-41bc-88cb-3259d5791fe0" testListId="8c84fa94-04c1-424b-9868-57a2d4851a1d" />
    <TestEntry testId="b7b79e5c-0d10-4d25-8371-5542b16f4fc9" executionId="51b8f125-81a2-4f5d-a31b-d06159f79105" testListId="8c84fa94-04c1-424b-9868-57a2d4851a1d" />
    <TestEntry testId="1fcb3beb-beaf-dd90-0941-1615ba80900c" executionId="25ffc87a-b55e-4021-a085-c20849b62300" testListId="8c84fa94-04c1-424b-9868-57a2d4851a1d" />
    <TestEntry testId="ec0349d8-2fde-e48e-ca15-04e7fef66a05" executionId="66692605-fd57-4cbb-9c3a-f005bb3f5afa" testListId="8c84fa94-04c1-424b-9868-57a2d4851a1d" />
    <TestEntry testId="9b3c6f7b-3759-cfb8-0224-2983979d00f9" executionId="e0467a7e-9979-421a-b48e-3c8dc19c01fa" testListId="8c84fa94-04c1-424b-9868-57a2d4851a1d" />
    <TestEntry testId="b78170cb-cb19-2e68-c647-97a61376799f" executionId="ab8fcaf3-7b72-4601-9f8a-7c36dce85346" testListId="8c84fa94-04c1-424b-9868-57a2d4851a1d" />
    <TestEntry testId="3f1c87d7-7309-6c31-9bf2-0759b54b615f" executionId="056877d7-f596-4d30-9419-5ee901cd89f1" testListId="8c84fa94-04c1-424b-9868-57a2d4851a1d" />
    <TestEntry testId="4c2e20cf-fc51-dc86-fc85-e4086be86cb9" executionId="9730bed2-855c-44d4-90ee-b0d3c9861438" testListId="8c84fa94-04c1-424b-9868-57a2d4851a1d" />
  </TestEntries>
  <Results>
    <UnitTestResult executionId="04ab3de4-d2c5-4985-8258-9e3361397b4e" testId="978bdc92-099e-6551-2853-6f444453dbb5" testName="TestCellConstructor" computerName="SEREGA-PC" duration="00:00:00.0195751" startTime="2010-12-08T18:50:19.5308248+03:00" endTime="2010-12-08T18:50:21.2159211+03:00" testType="13cdc9d9-ddb5-4fa4-a97d-d965ccfc6d4b" outcome="Passed" testListId="8c84fa94-04c1-424b-9868-57a2d4851a1d">
      <Output>
      </Output>
    </UnitTestResult>
    <UnitTestResult executionId="09e17dfb-5681-4f17-8c7a-b38f919795a2" testId="e83100a5-a4ef-47dc-57af-9ddffcaff485" testName="TestCellInitConstructor" computerName="SEREGA-PC" duration="00:00:00.0018983" startTime="2010-12-08T18:50:21.2269218+03:00" endTime="2010-12-08T18:50:21.2429227+03:00" testType="13cdc9d9-ddb5-4fa4-a97d-d965ccfc6d4b" outcome="Passed" testListId="8c84fa94-04c1-424b-9868-57a2d4851a1d">
      <Output>
      </Output>
    </UnitTestResult>
    <UnitTestResult executionId="a4571c74-1bec-4ce0-b3c0-afe2c81df92d" testId="a7a4b21f-d768-ac4a-5c67-93ff9000fc85" testName="TestCellStateProperty" computerName="SEREGA-PC" duration="00:00:00.0005446" startTime="2010-12-08T18:50:21.2499231+03:00" endTime="2010-12-08T18:50:21.2619238+03:00" testType="13cdc9d9-ddb5-4fa4-a97d-d965ccfc6d4b" outcome="Passed" testListId="8c84fa94-04c1-424b-9868-57a2d4851a1d">
      <Output>
      </Output>
    </UnitTestResult>
    <UnitTestResult executionId="2687f631-0319-44c4-b040-cd313b3d9109" testId="57925799-8b83-0b29-4fee-3ec9eb72342d" testName="TestFieldConstructor" computerName="SEREGA-PC" duration="00:00:00.0677487" startTime="2010-12-08T18:50:21.2669241+03:00" endTime="2010-12-08T18:50:21.3459286+03:00" testType="13cdc9d9-ddb5-4fa4-a97d-d965ccfc6d4b" outcome="Passed" testListId="8c84fa94-04c1-424b-9868-57a2d4851a1d">
      <Output>
      </Output>
    </UnitTestResult>
    <UnitTestResult executionId="10404c0f-a18c-4062-9bd6-9c516a7d99e1" testId="f9f5ed88-1af5-807a-27eb-bab3040cf1b5" testName="TestTurnTickSuccess" computerName="SEREGA-PC" duration="00:00:00.0047842" startTime="2010-12-08T18:50:21.3539290+03:00" endTime="2010-12-08T18:50:21.3709300+03:00" testType="13cdc9d9-ddb5-4fa4-a97d-d965ccfc6d4b" outcome="Passed" testListId="8c84fa94-04c1-424b-9868-57a2d4851a1d">
      <Output>
      </Output>
    </UnitTestResult>
    <UnitTestResult executionId="375acfcc-72eb-4eb2-b0a4-bc137b61255f" testId="75ca722b-7035-99d4-02f0-1835bfc541a1" testName="TestTurnTackSuccess" computerName="SEREGA-PC" duration="00:00:00.0012417" startTime="2010-12-08T18:50:21.3759303+03:00" endTime="2010-12-08T18:50:21.3879310+03:00" testType="13cdc9d9-ddb5-4fa4-a97d-d965ccfc6d4b" outcome="Passed" testListId="8c84fa94-04c1-424b-9868-57a2d4851a1d">
      <Output>
      </Output>
    </UnitTestResult>
    <UnitTestResult executionId="d8f4286f-1a5d-4d8b-b795-ced945253521" testId="3a9f98fb-20c9-98bd-2a01-f3221be78905" testName="TestTurnWithMaxXYSuccess" computerName="SEREGA-PC" duration="00:00:00.0003480" startTime="2010-12-08T18:50:21.3939313+03:00" endTime="2010-12-08T18:50:21.4139325+03:00" testType="13cdc9d9-ddb5-4fa4-a97d-d965ccfc6d4b" outcome="Passed" testListId="8c84fa94-04c1-424b-9868-57a2d4851a1d">
      <Output>
      </Output>
    </UnitTestResult>
    <UnitTestResult executionId="3d2735f0-1aae-48ba-a5bc-52b0ff224627" testId="3ea1f732-7934-8ccf-c4a1-0b81c373bb9e" testName="TestTurnWithMinXYSuccess" computerName="SEREGA-PC" duration="00:00:00.0003725" startTime="2010-12-08T18:50:21.4209329+03:00" endTime="2010-12-08T18:50:21.4309334+03:00" testType="13cdc9d9-ddb5-4fa4-a97d-d965ccfc6d4b" outcome="Passed" testListId="8c84fa94-04c1-424b-9868-57a2d4851a1d">
      <Output>
      </Output>
    </UnitTestResult>
    <UnitTestResult executionId="94db0ce6-ace6-454c-847c-70f452f9feb4" testId="fe14218f-e222-7abd-f200-c6963ae8b778" testName="TestTurnEmptyCellFail" computerName="SEREGA-PC" duration="00:00:00.0096320" startTime="2010-12-08T18:50:21.4369338+03:00" endTime="2010-12-08T18:50:21.4609351+03:00" testType="13cdc9d9-ddb5-4fa4-a97d-d965ccfc6d4b" outcome="Passed" testListId="8c84fa94-04c1-424b-9868-57a2d4851a1d">
      <Output>
      </Output>
    </UnitTestResult>
    <UnitTestResult executionId="95e2b8b3-92e6-418d-9b4e-51664656484d" testId="826a73c8-3d98-d569-5644-a0cea07ec4cf" testName="TestTurnToOccupatedCellFail" computerName="SEREGA-PC" duration="00:00:00.0065819" startTime="2010-12-08T18:50:21.4659354+03:00" endTime="2010-12-08T18:50:21.5229387+03:00" testType="13cdc9d9-ddb5-4fa4-a97d-d965ccfc6d4b" outcome="Passed" testListId="8c84fa94-04c1-424b-9868-57a2d4851a1d">
      <Output>
      </Output>
    </UnitTestResult>
    <UnitTestResult executionId="5d253304-c3c8-41bc-88cb-3259d5791fe0" testId="a3671cd1-312a-bf39-1c59-1f695804fd99" testName="TestAnywayTurnToOccupatedCellFail" computerName="SEREGA-PC" duration="00:00:00.0075215" startTime="2010-12-08T18:50:21.5279390+03:00" endTime="2010-12-08T18:50:21.5449400+03:00" testType="13cdc9d9-ddb5-4fa4-a97d-d965ccfc6d4b" outcome="Passed" testListId="8c84fa94-04c1-424b-9868-57a2d4851a1d">
      <Output>
      </Output>
    </UnitTestResult>
    <UnitTestResult executionId="51b8f125-81a2-4f5d-a31b-d06159f79105" testId="b7b79e5c-0d10-4d25-8371-5542b16f4fc9" testName="TestTurnTwiceWithTickFail" computerName="SEREGA-PC" duration="00:00:04.1303416" startTime="2010-12-08T18:50:21.5529404+03:00" endTime="2010-12-08T18:50:25.6931772+03:00" testType="13cdc9d9-ddb5-4fa4-a97d-d965ccfc6d4b" outcome="Passed" testListId="8c84fa94-04c1-424b-9868-57a2d4851a1d">
      <Output>
      </Output>
    </UnitTestResult>
    <UnitTestResult executionId="25ffc87a-b55e-4021-a085-c20849b62300" testId="1fcb3beb-beaf-dd90-0941-1615ba80900c" testName="TestTurnTwiceWithTackFail" computerName="SEREGA-PC" duration="00:00:11.0919584" startTime="2010-12-08T18:50:25.6981775+03:00" endTime="2010-12-08T18:50:36.8018126+03:00" testType="13cdc9d9-ddb5-4fa4-a97d-d965ccfc6d4b" outcome="Passed" testListId="8c84fa94-04c1-424b-9868-57a2d4851a1d">
      <Output>
      </Output>
    </UnitTestResult>
    <UnitTestResult executionId="66692605-fd57-4cbb-9c3a-f005bb3f5afa" testId="ec0349d8-2fde-e48e-ca15-04e7fef66a05" testName="TestGameEnd1" computerName="SEREGA-PC" duration="00:00:09.6549266" startTime="2010-12-08T18:50:36.8068129+03:00" endTime="2010-12-08T18:50:46.4773660+03:00" testType="13cdc9d9-ddb5-4fa4-a97d-d965ccfc6d4b" outcome="Passed" testListId="8c84fa94-04c1-424b-9868-57a2d4851a1d">
      <Output>
      </Output>
    </UnitTestResult>
    <UnitTestResult executionId="e0467a7e-9979-421a-b48e-3c8dc19c01fa" testId="9b3c6f7b-3759-cfb8-0224-2983979d00f9" testName="TestGameEnd2" computerName="SEREGA-PC" duration="00:04:00.2872845" startTime="2010-12-08T18:50:46.4823663+03:00" endTime="2010-12-08T18:54:46.7831107+03:00" testType="13cdc9d9-ddb5-4fa4-a97d-d965ccfc6d4b" outcome="Failed" testListId="8c84fa94-04c1-424b-9868-57a2d4851a1d">
      <Output>
        <ErrorInfo>
          <Message>Ошибка в Assert.IsTrue. </Message>
          <StackTrace>   в ASTU.DotNet.TickTackToe.FieldTest.TestGameEnd2() в I:\4 курс\NET программирование\MyLabs\TickTackToe\Test.ASTU.DotNet.TickTackToe\FieldTest.cs:строка 188
</StackTrace>
        </ErrorInfo>
      </Output>
    </UnitTestResult>
    <UnitTestResult executionId="ab8fcaf3-7b72-4601-9f8a-7c36dce85346" testId="b78170cb-cb19-2e68-c647-97a61376799f" testName="TestGameEnd3" computerName="SEREGA-PC" duration="00:00:27.1112908" startTime="2010-12-08T18:54:46.7891111+03:00" endTime="2010-12-08T18:55:13.9096623+03:00" testType="13cdc9d9-ddb5-4fa4-a97d-d965ccfc6d4b" outcome="Failed" testListId="8c84fa94-04c1-424b-9868-57a2d4851a1d">
      <Output>
        <ErrorInfo>
          <Message>Ошибка в Assert.IsTrue. </Message>
          <StackTrace>   в ASTU.DotNet.TickTackToe.FieldTest.TestGameEnd3() в I:\4 курс\NET программирование\MyLabs\TickTackToe\Test.ASTU.DotNet.TickTackToe\FieldTest.cs:строка 210
</StackTrace>
        </ErrorInfo>
      </Output>
    </UnitTestResult>
    <UnitTestResult executionId="056877d7-f596-4d30-9419-5ee901cd89f1" testId="3f1c87d7-7309-6c31-9bf2-0759b54b615f" testName="TestGameEnd4" computerName="SEREGA-PC" duration="00:00:01.2306454" startTime="2010-12-08T18:55:13.9126624+03:00" endTime="2010-12-08T18:55:15.1717344+03:00" testType="13cdc9d9-ddb5-4fa4-a97d-d965ccfc6d4b" outcome="Failed" testListId="8c84fa94-04c1-424b-9868-57a2d4851a1d">
      <Output>
        <ErrorInfo>
          <Message>Ошибка в Assert.IsTrue. </Message>
          <StackTrace>   в ASTU.DotNet.TickTackToe.FieldTest.TestGameEnd4() в I:\4 курс\NET программирование\MyLabs\TickTackToe\Test.ASTU.DotNet.TickTackToe\FieldTest.cs:строка 231
</StackTrace>
        </ErrorInfo>
      </Output>
    </UnitTestResult>
    <UnitTestResult executionId="9730bed2-855c-44d4-90ee-b0d3c9861438" testId="4c2e20cf-fc51-dc86-fc85-e4086be86cb9" testName="TestGetMarkedCells" computerName="SEREGA-PC" duration="00:00:00.7263652" startTime="2010-12-08T18:55:15.1747346+03:00" endTime="2010-12-08T18:55:15.9177771+03:00" testType="13cdc9d9-ddb5-4fa4-a97d-d965ccfc6d4b" outcome="Passed" testListId="8c84fa94-04c1-424b-9868-57a2d4851a1d">
      <Output>
      </Output>
    </UnitTestResult>
  </Results>
</TestRun>