﻿<?xml version="1.0" encoding="UTF-8"?>
<TestRun id="b37e0614-c63b-4d74-ae3e-64b8150d803c" name="Serega@SEREGA-PC 2010-12-08 19:50:12" runUser="Serega-PC\Serega" xmlns="http://microsoft.com/schemas/VisualStudio/TeamTest/2006">
  <TestRunConfiguration name="Локальный тестовый запуск" id="d174884d-6d98-4888-abe6-80fe947008fa">
    <Description>Конфигурация по умолчанию для локального тестового запуска.</Description>
    <Deployment runDeploymentRoot="I:\4 курс\NET программирование\MyLabs\TickTackToe\TestResults\Serega_SEREGA-PC 2010-12-08 19_50_12">
      <DeploymentItem filename="I:\4 курс\NET программирование\MyLabs\TickTackToe\ASTU.DotNet.TickTackToe\bin\Debug\ASTU.DotNet.TickTackToe.dll" />
    </Deployment>
    <TestTypeSpecific />
  </TestRunConfiguration>
  <ResultSummary outcome="Completed">
    <Counters total="18" executed="18" passed="18" error="0" failed="0" timeout="0" aborted="0" inconclusive="0" passedButRunAborted="0" notRunnable="0" notExecuted="0" disconnected="0" warning="0" completed="0" inProgress="0" pending="0" />
  </ResultSummary>
  <Times creation="2010-12-08T19:50:12.1193091+03:00" queuing="2010-12-08T19:50:15.1834843+03:00" start="2010-12-08T19:50:15.7755182+03:00" finish="2010-12-08T19:50:20.6277957+03:00" />
  <TestDefinitions>
    <UnitTest name="TestTurnTwiceWithTackFail" storage="i:\4 курс\net программирование\mylabs\ticktacktoe\test.astu.dotnet.ticktacktoe\bin\debug\test.astu.dotnet.ticktacktoe.dll" id="1fcb3beb-beaf-dd90-0941-1615ba80900c">
      <Css projectStructure="" iteration="" />
      <Owners>
        <Owner name="" />
      </Owners>
      <Execution id="9bc7c91b-65be-45c7-8dc4-4b0a3ba9ac97" />
      <TestMethod codeBase="I:\4 курс\NET программирование\MyLabs\TickTackToe\Test.ASTU.DotNet.TickTackToe\bin\Debug\Test.ASTU.DotNet.TickTackToe.dll" adapterTypeName="Microsoft.VisualStudio.TestTools.TestTypes.Unit.UnitTestAdapter, Microsoft.VisualStudio.QualityTools.Tips.UnitTest.Adapter, Version=9.0.0.0, Culture=neutral, PublicKeyToken=b03f5f7f11d50a3a" className="ASTU.DotNet.TickTackToe.FieldTest, Test.ASTU.DotNet.TickTackToe" name="TestTurnTwiceWithTackFail" />
    </UnitTest>
    <UnitTest name="TestGetMarkedCells" storage="i:\4 курс\net программирование\mylabs\ticktacktoe\test.astu.dotnet.ticktacktoe\bin\debug\test.astu.dotnet.ticktacktoe.dll" id="4c2e20cf-fc51-dc86-fc85-e4086be86cb9">
      <Css projectStructure="" iteration="" />
      <Execution timeOut="200" id="1e2a2530-9a6e-4bc6-89df-a6dad230a25f" />
      <Owners>
        <Owner name="" />
      </Owners>
      <TestMethod codeBase="I:\4 курс\NET программирование\MyLabs\TickTackToe\Test.ASTU.DotNet.TickTackToe\bin\Debug\Test.ASTU.DotNet.TickTackToe.dll" adapterTypeName="Microsoft.VisualStudio.TestTools.TestTypes.Unit.UnitTestAdapter, Microsoft.VisualStudio.QualityTools.Tips.UnitTest.Adapter, Version=9.0.0.0, Culture=neutral, PublicKeyToken=b03f5f7f11d50a3a" className="ASTU.DotNet.TickTackToe.FieldTest, Test.ASTU.DotNet.TickTackToe" name="TestGetMarkedCells" />
    </UnitTest>
    <UnitTest name="TestTurnTackSuccess" storage="i:\4 курс\net программирование\mylabs\ticktacktoe\test.astu.dotnet.ticktacktoe\bin\debug\test.astu.dotnet.ticktacktoe.dll" id="75ca722b-7035-99d4-02f0-1835bfc541a1">
      <Css projectStructure="" iteration="" />
      <Owners>
        <Owner name="" />
      </Owners>
      <Execution id="a4d162d3-5ed3-4874-9f38-f3d491326f77" />
      <TestMethod codeBase="I:\4 курс\NET программирование\MyLabs\TickTackToe\Test.ASTU.DotNet.TickTackToe\bin\Debug\Test.ASTU.DotNet.TickTackToe.dll" adapterTypeName="Microsoft.VisualStudio.TestTools.TestTypes.Unit.UnitTestAdapter, Microsoft.VisualStudio.QualityTools.Tips.UnitTest.Adapter, Version=9.0.0.0, Culture=neutral, PublicKeyToken=b03f5f7f11d50a3a" className="ASTU.DotNet.TickTackToe.FieldTest, Test.ASTU.DotNet.TickTackToe" name="TestTurnTackSuccess" />
    </UnitTest>
    <UnitTest name="TestTurnWithMaxXYSuccess" storage="i:\4 курс\net программирование\mylabs\ticktacktoe\test.astu.dotnet.ticktacktoe\bin\debug\test.astu.dotnet.ticktacktoe.dll" id="3a9f98fb-20c9-98bd-2a01-f3221be78905">
      <Css projectStructure="" iteration="" />
      <Owners>
        <Owner name="" />
      </Owners>
      <Execution id="ce542e17-655c-4e8c-8eea-d721a853ef2b" />
      <TestMethod codeBase="I:\4 курс\NET программирование\MyLabs\TickTackToe\Test.ASTU.DotNet.TickTackToe\bin\Debug\Test.ASTU.DotNet.TickTackToe.dll" adapterTypeName="Microsoft.VisualStudio.TestTools.TestTypes.Unit.UnitTestAdapter, Microsoft.VisualStudio.QualityTools.Tips.UnitTest.Adapter, Version=9.0.0.0, Culture=neutral, PublicKeyToken=b03f5f7f11d50a3a" className="ASTU.DotNet.TickTackToe.FieldTest, Test.ASTU.DotNet.TickTackToe" name="TestTurnWithMaxXYSuccess" />
    </UnitTest>
    <UnitTest name="TestTurnEmptyCellFail" storage="i:\4 курс\net программирование\mylabs\ticktacktoe\test.astu.dotnet.ticktacktoe\bin\debug\test.astu.dotnet.ticktacktoe.dll" id="fe14218f-e222-7abd-f200-c6963ae8b778">
      <Css projectStructure="" iteration="" />
      <Owners>
        <Owner name="" />
      </Owners>
      <Execution id="28d23fb3-7947-462f-9451-a145024bc124" />
      <TestMethod codeBase="I:\4 курс\NET программирование\MyLabs\TickTackToe\Test.ASTU.DotNet.TickTackToe\bin\Debug\Test.ASTU.DotNet.TickTackToe.dll" adapterTypeName="Microsoft.VisualStudio.TestTools.TestTypes.Unit.UnitTestAdapter, Microsoft.VisualStudio.QualityTools.Tips.UnitTest.Adapter, Version=9.0.0.0, Culture=neutral, PublicKeyToken=b03f5f7f11d50a3a" className="ASTU.DotNet.TickTackToe.FieldTest, Test.ASTU.DotNet.TickTackToe" name="TestTurnEmptyCellFail" />
    </UnitTest>
    <UnitTest name="TestGameEnd1" storage="i:\4 курс\net программирование\mylabs\ticktacktoe\test.astu.dotnet.ticktacktoe\bin\debug\test.astu.dotnet.ticktacktoe.dll" id="ec0349d8-2fde-e48e-ca15-04e7fef66a05">
      <Css projectStructure="" iteration="" />
      <Execution timeOut="200" id="8d05a368-9376-4c9e-bb5f-ca4f49330313" />
      <Owners>
        <Owner name="" />
      </Owners>
      <TestMethod codeBase="I:\4 курс\NET программирование\MyLabs\TickTackToe\Test.ASTU.DotNet.TickTackToe\bin\Debug\Test.ASTU.DotNet.TickTackToe.dll" adapterTypeName="Microsoft.VisualStudio.TestTools.TestTypes.Unit.UnitTestAdapter, Microsoft.VisualStudio.QualityTools.Tips.UnitTest.Adapter, Version=9.0.0.0, Culture=neutral, PublicKeyToken=b03f5f7f11d50a3a" className="ASTU.DotNet.TickTackToe.FieldTest, Test.ASTU.DotNet.TickTackToe" name="TestGameEnd1" />
    </UnitTest>
    <UnitTest name="TestTurnTwiceWithTickFail" storage="i:\4 курс\net программирование\mylabs\ticktacktoe\test.astu.dotnet.ticktacktoe\bin\debug\test.astu.dotnet.ticktacktoe.dll" id="b7b79e5c-0d10-4d25-8371-5542b16f4fc9">
      <Css projectStructure="" iteration="" />
      <Owners>
        <Owner name="" />
      </Owners>
      <Execution id="ce1158c0-531a-424e-ad23-7975f61f0272" />
      <TestMethod codeBase="I:\4 курс\NET программирование\MyLabs\TickTackToe\Test.ASTU.DotNet.TickTackToe\bin\Debug\Test.ASTU.DotNet.TickTackToe.dll" adapterTypeName="Microsoft.VisualStudio.TestTools.TestTypes.Unit.UnitTestAdapter, Microsoft.VisualStudio.QualityTools.Tips.UnitTest.Adapter, Version=9.0.0.0, Culture=neutral, PublicKeyToken=b03f5f7f11d50a3a" className="ASTU.DotNet.TickTackToe.FieldTest, Test.ASTU.DotNet.TickTackToe" name="TestTurnTwiceWithTickFail" />
    </UnitTest>
    <UnitTest name="TestGameEnd2" storage="i:\4 курс\net программирование\mylabs\ticktacktoe\test.astu.dotnet.ticktacktoe\bin\debug\test.astu.dotnet.ticktacktoe.dll" id="9b3c6f7b-3759-cfb8-0224-2983979d00f9">
      <Css projectStructure="" iteration="" />
      <Execution timeOut="200" id="badc18fa-763d-4e80-a602-549dfaa2e21f" />
      <Owners>
        <Owner name="" />
      </Owners>
      <TestMethod codeBase="I:\4 курс\NET программирование\MyLabs\TickTackToe\Test.ASTU.DotNet.TickTackToe\bin\Debug\Test.ASTU.DotNet.TickTackToe.dll" adapterTypeName="Microsoft.VisualStudio.TestTools.TestTypes.Unit.UnitTestAdapter, Microsoft.VisualStudio.QualityTools.Tips.UnitTest.Adapter, Version=9.0.0.0, Culture=neutral, PublicKeyToken=b03f5f7f11d50a3a" className="ASTU.DotNet.TickTackToe.FieldTest, Test.ASTU.DotNet.TickTackToe" name="TestGameEnd2" />
    </UnitTest>
    <UnitTest name="TestCellInitConstructor" storage="i:\4 курс\net программирование\mylabs\ticktacktoe\test.astu.dotnet.ticktacktoe\bin\debug\test.astu.dotnet.ticktacktoe.dll" id="e83100a5-a4ef-47dc-57af-9ddffcaff485">
      <Css projectStructure="" iteration="" />
      <Owners>
        <Owner name="" />
      </Owners>
      <Execution id="3d442e29-4719-4aba-961b-8a7b9858780a" />
      <TestMethod codeBase="I:\4 курс\NET программирование\MyLabs\TickTackToe\Test.ASTU.DotNet.TickTackToe\bin\Debug\Test.ASTU.DotNet.TickTackToe.dll" adapterTypeName="Microsoft.VisualStudio.TestTools.TestTypes.Unit.UnitTestAdapter, Microsoft.VisualStudio.QualityTools.Tips.UnitTest.Adapter, Version=9.0.0.0, Culture=neutral, PublicKeyToken=b03f5f7f11d50a3a" className="ASTU.DotNet.TickTackToe.FieldCellTest, Test.ASTU.DotNet.TickTackToe" name="TestCellInitConstructor" />
    </UnitTest>
    <UnitTest name="TestGameEnd4" storage="i:\4 курс\net программирование\mylabs\ticktacktoe\test.astu.dotnet.ticktacktoe\bin\debug\test.astu.dotnet.ticktacktoe.dll" id="3f1c87d7-7309-6c31-9bf2-0759b54b615f">
      <Css projectStructure="" iteration="" />
      <Execution timeOut="200" id="7e0080a5-74ea-4d76-ae85-52b817f54ec8" />
      <Owners>
        <Owner name="" />
      </Owners>
      <TestMethod codeBase="I:\4 курс\NET программирование\MyLabs\TickTackToe\Test.ASTU.DotNet.TickTackToe\bin\Debug\Test.ASTU.DotNet.TickTackToe.dll" adapterTypeName="Microsoft.VisualStudio.TestTools.TestTypes.Unit.UnitTestAdapter, Microsoft.VisualStudio.QualityTools.Tips.UnitTest.Adapter, Version=9.0.0.0, Culture=neutral, PublicKeyToken=b03f5f7f11d50a3a" className="ASTU.DotNet.TickTackToe.FieldTest, Test.ASTU.DotNet.TickTackToe" name="TestGameEnd4" />
    </UnitTest>
    <UnitTest name="TestTurnToOccupatedCellFail" storage="i:\4 курс\net программирование\mylabs\ticktacktoe\test.astu.dotnet.ticktacktoe\bin\debug\test.astu.dotnet.ticktacktoe.dll" id="826a73c8-3d98-d569-5644-a0cea07ec4cf">
      <Css projectStructure="" iteration="" />
      <Owners>
        <Owner name="" />
      </Owners>
      <Execution id="3183dd6f-495a-4b1f-a9ae-47a26fbc8bf6" />
      <TestMethod codeBase="I:\4 курс\NET программирование\MyLabs\TickTackToe\Test.ASTU.DotNet.TickTackToe\bin\Debug\Test.ASTU.DotNet.TickTackToe.dll" adapterTypeName="Microsoft.VisualStudio.TestTools.TestTypes.Unit.UnitTestAdapter, Microsoft.VisualStudio.QualityTools.Tips.UnitTest.Adapter, Version=9.0.0.0, Culture=neutral, PublicKeyToken=b03f5f7f11d50a3a" className="ASTU.DotNet.TickTackToe.FieldTest, Test.ASTU.DotNet.TickTackToe" name="TestTurnToOccupatedCellFail" />
    </UnitTest>
    <UnitTest name="TestTurnWithMinXYSuccess" storage="i:\4 курс\net программирование\mylabs\ticktacktoe\test.astu.dotnet.ticktacktoe\bin\debug\test.astu.dotnet.ticktacktoe.dll" id="3ea1f732-7934-8ccf-c4a1-0b81c373bb9e">
      <Css projectStructure="" iteration="" />
      <Owners>
        <Owner name="" />
      </Owners>
      <Execution id="23429d16-c8c7-439a-8444-c342c26d600b" />
      <TestMethod codeBase="I:\4 курс\NET программирование\MyLabs\TickTackToe\Test.ASTU.DotNet.TickTackToe\bin\Debug\Test.ASTU.DotNet.TickTackToe.dll" adapterTypeName="Microsoft.VisualStudio.TestTools.TestTypes.Unit.UnitTestAdapter, Microsoft.VisualStudio.QualityTools.Tips.UnitTest.Adapter, Version=9.0.0.0, Culture=neutral, PublicKeyToken=b03f5f7f11d50a3a" className="ASTU.DotNet.TickTackToe.FieldTest, Test.ASTU.DotNet.TickTackToe" name="TestTurnWithMinXYSuccess" />
    </UnitTest>
    <UnitTest name="TestAnywayTurnToOccupatedCellFail" storage="i:\4 курс\net программирование\mylabs\ticktacktoe\test.astu.dotnet.ticktacktoe\bin\debug\test.astu.dotnet.ticktacktoe.dll" id="a3671cd1-312a-bf39-1c59-1f695804fd99">
      <Css projectStructure="" iteration="" />
      <Owners>
        <Owner name="" />
      </Owners>
      <Execution id="ee639d82-298e-4649-a6d6-fb7b1c3250e0" />
      <TestMethod codeBase="I:\4 курс\NET программирование\MyLabs\TickTackToe\Test.ASTU.DotNet.TickTackToe\bin\Debug\Test.ASTU.DotNet.TickTackToe.dll" adapterTypeName="Microsoft.VisualStudio.TestTools.TestTypes.Unit.UnitTestAdapter, Microsoft.VisualStudio.QualityTools.Tips.UnitTest.Adapter, Version=9.0.0.0, Culture=neutral, PublicKeyToken=b03f5f7f11d50a3a" className="ASTU.DotNet.TickTackToe.FieldTest, Test.ASTU.DotNet.TickTackToe" name="TestAnywayTurnToOccupatedCellFail" />
    </UnitTest>
    <UnitTest name="TestCellStateProperty" storage="i:\4 курс\net программирование\mylabs\ticktacktoe\test.astu.dotnet.ticktacktoe\bin\debug\test.astu.dotnet.ticktacktoe.dll" id="a7a4b21f-d768-ac4a-5c67-93ff9000fc85">
      <Css projectStructure="" iteration="" />
      <Owners>
        <Owner name="" />
      </Owners>
      <Execution id="bb577d32-1513-4d8e-b785-2a98bf07db8e" />
      <TestMethod codeBase="I:\4 курс\NET программирование\MyLabs\TickTackToe\Test.ASTU.DotNet.TickTackToe\bin\Debug\Test.ASTU.DotNet.TickTackToe.dll" adapterTypeName="Microsoft.VisualStudio.TestTools.TestTypes.Unit.UnitTestAdapter, Microsoft.VisualStudio.QualityTools.Tips.UnitTest.Adapter, Version=9.0.0.0, Culture=neutral, PublicKeyToken=b03f5f7f11d50a3a" className="ASTU.DotNet.TickTackToe.FieldCellTest, Test.ASTU.DotNet.TickTackToe" name="TestCellStateProperty" />
    </UnitTest>
    <UnitTest name="TestFieldConstructor" storage="i:\4 курс\net программирование\mylabs\ticktacktoe\test.astu.dotnet.ticktacktoe\bin\debug\test.astu.dotnet.ticktacktoe.dll" id="57925799-8b83-0b29-4fee-3ec9eb72342d">
      <Css projectStructure="" iteration="" />
      <Owners>
        <Owner name="" />
      </Owners>
      <Execution id="b85a4faa-0959-4945-ab77-eca9d6f36879" />
      <TestMethod codeBase="I:\4 курс\NET программирование\MyLabs\TickTackToe\Test.ASTU.DotNet.TickTackToe\bin\Debug\Test.ASTU.DotNet.TickTackToe.dll" adapterTypeName="Microsoft.VisualStudio.TestTools.TestTypes.Unit.UnitTestAdapter, Microsoft.VisualStudio.QualityTools.Tips.UnitTest.Adapter, Version=9.0.0.0, Culture=neutral, PublicKeyToken=b03f5f7f11d50a3a" className="ASTU.DotNet.TickTackToe.FieldTest, Test.ASTU.DotNet.TickTackToe" name="TestFieldConstructor" />
    </UnitTest>
    <UnitTest name="TestGameEnd3" storage="i:\4 курс\net программирование\mylabs\ticktacktoe\test.astu.dotnet.ticktacktoe\bin\debug\test.astu.dotnet.ticktacktoe.dll" id="b78170cb-cb19-2e68-c647-97a61376799f">
      <Css projectStructure="" iteration="" />
      <Execution timeOut="200" id="ad9ad115-610a-48ae-8597-e3502a6fec0c" />
      <Owners>
        <Owner name="" />
      </Owners>
      <TestMethod codeBase="I:\4 курс\NET программирование\MyLabs\TickTackToe\Test.ASTU.DotNet.TickTackToe\bin\Debug\Test.ASTU.DotNet.TickTackToe.dll" adapterTypeName="Microsoft.VisualStudio.TestTools.TestTypes.Unit.UnitTestAdapter, Microsoft.VisualStudio.QualityTools.Tips.UnitTest.Adapter, Version=9.0.0.0, Culture=neutral, PublicKeyToken=b03f5f7f11d50a3a" className="ASTU.DotNet.TickTackToe.FieldTest, Test.ASTU.DotNet.TickTackToe" name="TestGameEnd3" />
    </UnitTest>
    <UnitTest name="TestCellConstructor" storage="i:\4 курс\net программирование\mylabs\ticktacktoe\test.astu.dotnet.ticktacktoe\bin\debug\test.astu.dotnet.ticktacktoe.dll" id="978bdc92-099e-6551-2853-6f444453dbb5">
      <Css projectStructure="" iteration="" />
      <Owners>
        <Owner name="" />
      </Owners>
      <Execution id="cce05a56-3e58-4554-af45-bd2f7810376c" />
      <TestMethod codeBase="I:\4 курс\NET программирование\MyLabs\TickTackToe\Test.ASTU.DotNet.TickTackToe\bin\Debug\Test.ASTU.DotNet.TickTackToe.dll" adapterTypeName="Microsoft.VisualStudio.TestTools.TestTypes.Unit.UnitTestAdapter, Microsoft.VisualStudio.QualityTools.Tips.UnitTest.Adapter, Version=9.0.0.0, Culture=neutral, PublicKeyToken=b03f5f7f11d50a3a" className="ASTU.DotNet.TickTackToe.FieldCellTest, Test.ASTU.DotNet.TickTackToe" name="TestCellConstructor" />
    </UnitTest>
    <UnitTest name="TestTurnTickSuccess" storage="i:\4 курс\net программирование\mylabs\ticktacktoe\test.astu.dotnet.ticktacktoe\bin\debug\test.astu.dotnet.ticktacktoe.dll" id="f9f5ed88-1af5-807a-27eb-bab3040cf1b5">
      <Css projectStructure="" iteration="" />
      <Owners>
        <Owner name="" />
      </Owners>
      <Execution id="9eae859c-e9db-4fdf-a1e5-ff8dd3935623" />
      <TestMethod codeBase="I:\4 курс\NET программирование\MyLabs\TickTackToe\Test.ASTU.DotNet.TickTackToe\bin\Debug\Test.ASTU.DotNet.TickTackToe.dll" adapterTypeName="Microsoft.VisualStudio.TestTools.TestTypes.Unit.UnitTestAdapter, Microsoft.VisualStudio.QualityTools.Tips.UnitTest.Adapter, Version=9.0.0.0, Culture=neutral, PublicKeyToken=b03f5f7f11d50a3a" className="ASTU.DotNet.TickTackToe.FieldTest, Test.ASTU.DotNet.TickTackToe" name="TestTurnTickSuccess" />
    </UnitTest>
  </TestDefinitions>
  <TestLists>
    <TestList name="Отсутствующие в списке результаты" id="8c84fa94-04c1-424b-9868-57a2d4851a1d" />
    <TestList name="Все загруженные результаты" id="19431567-8539-422a-85d7-44ee4e166bda" />
  </TestLists>
  <TestEntries>
    <TestEntry testId="978bdc92-099e-6551-2853-6f444453dbb5" executionId="cce05a56-3e58-4554-af45-bd2f7810376c" testListId="8c84fa94-04c1-424b-9868-57a2d4851a1d" />
    <TestEntry testId="e83100a5-a4ef-47dc-57af-9ddffcaff485" executionId="3d442e29-4719-4aba-961b-8a7b9858780a" testListId="8c84fa94-04c1-424b-9868-57a2d4851a1d" />
    <TestEntry testId="a7a4b21f-d768-ac4a-5c67-93ff9000fc85" executionId="bb577d32-1513-4d8e-b785-2a98bf07db8e" testListId="8c84fa94-04c1-424b-9868-57a2d4851a1d" />
    <TestEntry testId="57925799-8b83-0b29-4fee-3ec9eb72342d" executionId="b85a4faa-0959-4945-ab77-eca9d6f36879" testListId="8c84fa94-04c1-424b-9868-57a2d4851a1d" />
    <TestEntry testId="f9f5ed88-1af5-807a-27eb-bab3040cf1b5" executionId="9eae859c-e9db-4fdf-a1e5-ff8dd3935623" testListId="8c84fa94-04c1-424b-9868-57a2d4851a1d" />
    <TestEntry testId="75ca722b-7035-99d4-02f0-1835bfc541a1" executionId="a4d162d3-5ed3-4874-9f38-f3d491326f77" testListId="8c84fa94-04c1-424b-9868-57a2d4851a1d" />
    <TestEntry testId="3a9f98fb-20c9-98bd-2a01-f3221be78905" executionId="ce542e17-655c-4e8c-8eea-d721a853ef2b" testListId="8c84fa94-04c1-424b-9868-57a2d4851a1d" />
    <TestEntry testId="3ea1f732-7934-8ccf-c4a1-0b81c373bb9e" executionId="23429d16-c8c7-439a-8444-c342c26d600b" testListId="8c84fa94-04c1-424b-9868-57a2d4851a1d" />
    <TestEntry testId="fe14218f-e222-7abd-f200-c6963ae8b778" executionId="28d23fb3-7947-462f-9451-a145024bc124" testListId="8c84fa94-04c1-424b-9868-57a2d4851a1d" />
    <TestEntry testId="826a73c8-3d98-d569-5644-a0cea07ec4cf" executionId="3183dd6f-495a-4b1f-a9ae-47a26fbc8bf6" testListId="8c84fa94-04c1-424b-9868-57a2d4851a1d" />
    <TestEntry testId="a3671cd1-312a-bf39-1c59-1f695804fd99" executionId="ee639d82-298e-4649-a6d6-fb7b1c3250e0" testListId="8c84fa94-04c1-424b-9868-57a2d4851a1d" />
    <TestEntry testId="b7b79e5c-0d10-4d25-8371-5542b16f4fc9" executionId="ce1158c0-531a-424e-ad23-7975f61f0272" testListId="8c84fa94-04c1-424b-9868-57a2d4851a1d" />
    <TestEntry testId="1fcb3beb-beaf-dd90-0941-1615ba80900c" executionId="9bc7c91b-65be-45c7-8dc4-4b0a3ba9ac97" testListId="8c84fa94-04c1-424b-9868-57a2d4851a1d" />
    <TestEntry testId="ec0349d8-2fde-e48e-ca15-04e7fef66a05" executionId="8d05a368-9376-4c9e-bb5f-ca4f49330313" testListId="8c84fa94-04c1-424b-9868-57a2d4851a1d" />
    <TestEntry testId="9b3c6f7b-3759-cfb8-0224-2983979d00f9" executionId="badc18fa-763d-4e80-a602-549dfaa2e21f" testListId="8c84fa94-04c1-424b-9868-57a2d4851a1d" />
    <TestEntry testId="b78170cb-cb19-2e68-c647-97a61376799f" executionId="ad9ad115-610a-48ae-8597-e3502a6fec0c" testListId="8c84fa94-04c1-424b-9868-57a2d4851a1d" />
    <TestEntry testId="3f1c87d7-7309-6c31-9bf2-0759b54b615f" executionId="7e0080a5-74ea-4d76-ae85-52b817f54ec8" testListId="8c84fa94-04c1-424b-9868-57a2d4851a1d" />
    <TestEntry testId="4c2e20cf-fc51-dc86-fc85-e4086be86cb9" executionId="1e2a2530-9a6e-4bc6-89df-a6dad230a25f" testListId="8c84fa94-04c1-424b-9868-57a2d4851a1d" />
  </TestEntries>
  <Results>
    <UnitTestResult executionId="cce05a56-3e58-4554-af45-bd2f7810376c" testId="978bdc92-099e-6551-2853-6f444453dbb5" testName="TestCellConstructor" computerName="SEREGA-PC" duration="00:00:00.0182580" startTime="2010-12-08T19:50:15.9065257+03:00" endTime="2010-12-08T19:50:17.4476138+03:00" testType="13cdc9d9-ddb5-4fa4-a97d-d965ccfc6d4b" outcome="Passed" testListId="8c84fa94-04c1-424b-9868-57a2d4851a1d">
      <Output>
      </Output>
    </UnitTestResult>
    <UnitTestResult executionId="3d442e29-4719-4aba-961b-8a7b9858780a" testId="e83100a5-a4ef-47dc-57af-9ddffcaff485" testName="TestCellInitConstructor" computerName="SEREGA-PC" duration="00:00:00.0008804" startTime="2010-12-08T19:50:17.4556143+03:00" endTime="2010-12-08T19:50:17.4656149+03:00" testType="13cdc9d9-ddb5-4fa4-a97d-d965ccfc6d4b" outcome="Passed" testListId="8c84fa94-04c1-424b-9868-57a2d4851a1d">
      <Output>
      </Output>
    </UnitTestResult>
    <UnitTestResult executionId="bb577d32-1513-4d8e-b785-2a98bf07db8e" testId="a7a4b21f-d768-ac4a-5c67-93ff9000fc85" testName="TestCellStateProperty" computerName="SEREGA-PC" duration="00:00:00.0005475" startTime="2010-12-08T19:50:17.4716152+03:00" endTime="2010-12-08T19:50:17.4816158+03:00" testType="13cdc9d9-ddb5-4fa4-a97d-d965ccfc6d4b" outcome="Passed" testListId="8c84fa94-04c1-424b-9868-57a2d4851a1d">
      <Output>
      </Output>
    </UnitTestResult>
    <UnitTestResult executionId="b85a4faa-0959-4945-ab77-eca9d6f36879" testId="57925799-8b83-0b29-4fee-3ec9eb72342d" testName="TestFieldConstructor" computerName="SEREGA-PC" duration="00:00:00.0259394" startTime="2010-12-08T19:50:17.4896162+03:00" endTime="2010-12-08T19:50:17.5286185+03:00" testType="13cdc9d9-ddb5-4fa4-a97d-d965ccfc6d4b" outcome="Passed" testListId="8c84fa94-04c1-424b-9868-57a2d4851a1d">
      <Output>
      </Output>
    </UnitTestResult>
    <UnitTestResult executionId="9eae859c-e9db-4fdf-a1e5-ff8dd3935623" testId="f9f5ed88-1af5-807a-27eb-bab3040cf1b5" testName="TestTurnTickSuccess" computerName="SEREGA-PC" duration="00:00:00.0054701" startTime="2010-12-08T19:50:17.5376190+03:00" endTime="2010-12-08T19:50:17.5536199+03:00" testType="13cdc9d9-ddb5-4fa4-a97d-d965ccfc6d4b" outcome="Passed" testListId="8c84fa94-04c1-424b-9868-57a2d4851a1d">
      <Output>
      </Output>
    </UnitTestResult>
    <UnitTestResult executionId="a4d162d3-5ed3-4874-9f38-f3d491326f77" testId="75ca722b-7035-99d4-02f0-1835bfc541a1" testName="TestTurnTackSuccess" computerName="SEREGA-PC" duration="00:00:00.0016201" startTime="2010-12-08T19:50:17.5576201+03:00" endTime="2010-12-08T19:50:17.5686207+03:00" testType="13cdc9d9-ddb5-4fa4-a97d-d965ccfc6d4b" outcome="Passed" testListId="8c84fa94-04c1-424b-9868-57a2d4851a1d">
      <Output>
      </Output>
    </UnitTestResult>
    <UnitTestResult executionId="ce542e17-655c-4e8c-8eea-d721a853ef2b" testId="3a9f98fb-20c9-98bd-2a01-f3221be78905" testName="TestTurnWithMaxXYSuccess" computerName="SEREGA-PC" duration="00:00:00.0011391" startTime="2010-12-08T19:50:17.5746211+03:00" endTime="2010-12-08T19:50:17.5956223+03:00" testType="13cdc9d9-ddb5-4fa4-a97d-d965ccfc6d4b" outcome="Passed" testListId="8c84fa94-04c1-424b-9868-57a2d4851a1d">
      <Output>
      </Output>
    </UnitTestResult>
    <UnitTestResult executionId="23429d16-c8c7-439a-8444-c342c26d600b" testId="3ea1f732-7934-8ccf-c4a1-0b81c373bb9e" testName="TestTurnWithMinXYSuccess" computerName="SEREGA-PC" duration="00:00:00.0003720" startTime="2010-12-08T19:50:17.6006226+03:00" endTime="2010-12-08T19:50:17.6156234+03:00" testType="13cdc9d9-ddb5-4fa4-a97d-d965ccfc6d4b" outcome="Passed" testListId="8c84fa94-04c1-424b-9868-57a2d4851a1d">
      <Output>
      </Output>
    </UnitTestResult>
    <UnitTestResult executionId="28d23fb3-7947-462f-9451-a145024bc124" testId="fe14218f-e222-7abd-f200-c6963ae8b778" testName="TestTurnEmptyCellFail" computerName="SEREGA-PC" duration="00:00:00.0109129" startTime="2010-12-08T19:50:17.6206237+03:00" endTime="2010-12-08T19:50:17.6436250+03:00" testType="13cdc9d9-ddb5-4fa4-a97d-d965ccfc6d4b" outcome="Passed" testListId="8c84fa94-04c1-424b-9868-57a2d4851a1d">
      <Output>
      </Output>
    </UnitTestResult>
    <UnitTestResult executionId="3183dd6f-495a-4b1f-a9ae-47a26fbc8bf6" testId="826a73c8-3d98-d569-5644-a0cea07ec4cf" testName="TestTurnToOccupatedCellFail" computerName="SEREGA-PC" duration="00:00:00.0067559" startTime="2010-12-08T19:50:17.6486253+03:00" endTime="2010-12-08T19:50:17.6666263+03:00" testType="13cdc9d9-ddb5-4fa4-a97d-d965ccfc6d4b" outcome="Passed" testListId="8c84fa94-04c1-424b-9868-57a2d4851a1d">
      <Output>
      </Output>
    </UnitTestResult>
    <UnitTestResult executionId="ee639d82-298e-4649-a6d6-fb7b1c3250e0" testId="a3671cd1-312a-bf39-1c59-1f695804fd99" testName="TestAnywayTurnToOccupatedCellFail" computerName="SEREGA-PC" duration="00:00:00.0074971" startTime="2010-12-08T19:50:17.6756269+03:00" endTime="2010-12-08T19:50:17.7346302+03:00" testType="13cdc9d9-ddb5-4fa4-a97d-d965ccfc6d4b" outcome="Passed" testListId="8c84fa94-04c1-424b-9868-57a2d4851a1d">
      <Output>
      </Output>
    </UnitTestResult>
    <UnitTestResult executionId="ce1158c0-531a-424e-ad23-7975f61f0272" testId="b7b79e5c-0d10-4d25-8371-5542b16f4fc9" testName="TestTurnTwiceWithTickFail" computerName="SEREGA-PC" duration="00:00:00.0069808" startTime="2010-12-08T19:50:17.7416306+03:00" endTime="2010-12-08T19:50:17.7576316+03:00" testType="13cdc9d9-ddb5-4fa4-a97d-d965ccfc6d4b" outcome="Passed" testListId="8c84fa94-04c1-424b-9868-57a2d4851a1d">
      <Output>
      </Output>
    </UnitTestResult>
    <UnitTestResult executionId="9bc7c91b-65be-45c7-8dc4-4b0a3ba9ac97" testId="1fcb3beb-beaf-dd90-0941-1615ba80900c" testName="TestTurnTwiceWithTackFail" computerName="SEREGA-PC" duration="00:00:00.0073123" startTime="2010-12-08T19:50:17.7626318+03:00" endTime="2010-12-08T19:50:17.7826330+03:00" testType="13cdc9d9-ddb5-4fa4-a97d-d965ccfc6d4b" outcome="Passed" testListId="8c84fa94-04c1-424b-9868-57a2d4851a1d">
      <Output>
      </Output>
    </UnitTestResult>
    <UnitTestResult executionId="8d05a368-9376-4c9e-bb5f-ca4f49330313" testId="ec0349d8-2fde-e48e-ca15-04e7fef66a05" testName="TestGameEnd1" computerName="SEREGA-PC" duration="00:00:00.0062118" startTime="2010-12-08T19:50:17.7886333+03:00" endTime="2010-12-08T19:50:17.8046342+03:00" testType="13cdc9d9-ddb5-4fa4-a97d-d965ccfc6d4b" outcome="Passed" testListId="8c84fa94-04c1-424b-9868-57a2d4851a1d">
      <Output>
      </Output>
    </UnitTestResult>
    <UnitTestResult executionId="badc18fa-763d-4e80-a602-549dfaa2e21f" testId="9b3c6f7b-3759-cfb8-0224-2983979d00f9" testName="TestGameEnd2" computerName="SEREGA-PC" duration="00:00:02.5002362" startTime="2010-12-08T19:50:17.8086345+03:00" endTime="2010-12-08T19:50:20.3217782+03:00" testType="13cdc9d9-ddb5-4fa4-a97d-d965ccfc6d4b" outcome="Passed" testListId="8c84fa94-04c1-424b-9868-57a2d4851a1d">
      <Output>
      </Output>
    </UnitTestResult>
    <UnitTestResult executionId="ad9ad115-610a-48ae-8597-e3502a6fec0c" testId="b78170cb-cb19-2e68-c647-97a61376799f" testName="TestGameEnd3" computerName="SEREGA-PC" duration="00:00:00.0035591" startTime="2010-12-08T19:50:20.3277786+03:00" endTime="2010-12-08T19:50:20.3427794+03:00" testType="13cdc9d9-ddb5-4fa4-a97d-d965ccfc6d4b" outcome="Passed" testListId="8c84fa94-04c1-424b-9868-57a2d4851a1d">
      <Output>
      </Output>
    </UnitTestResult>
    <UnitTestResult executionId="7e0080a5-74ea-4d76-ae85-52b817f54ec8" testId="3f1c87d7-7309-6c31-9bf2-0759b54b615f" testName="TestGameEnd4" computerName="SEREGA-PC" duration="00:00:00.0009797" startTime="2010-12-08T19:50:20.3477797+03:00" endTime="2010-12-08T19:50:20.3607804+03:00" testType="13cdc9d9-ddb5-4fa4-a97d-d965ccfc6d4b" outcome="Passed" testListId="8c84fa94-04c1-424b-9868-57a2d4851a1d">
      <Output>
      </Output>
    </UnitTestResult>
    <UnitTestResult executionId="1e2a2530-9a6e-4bc6-89df-a6dad230a25f" testId="4c2e20cf-fc51-dc86-fc85-e4086be86cb9" testName="TestGetMarkedCells" computerName="SEREGA-PC" duration="00:00:00.0037849" startTime="2010-12-08T19:50:20.3647807+03:00" endTime="2010-12-08T19:50:20.3827817+03:00" testType="13cdc9d9-ddb5-4fa4-a97d-d965ccfc6d4b" outcome="Passed" testListId="8c84fa94-04c1-424b-9868-57a2d4851a1d">
      <Output>
      </Output>
    </UnitTestResult>
  </Results>
</TestRun>