{
   "Device.ManagementServer.": {
       "Order": 2,
       "Param": "rw-n",
       "Obj": "rw-n",
       "InstantiatedObj": "rw-n",
       "CommandEvent": "rw-n"
   },
   "Device.SoftwareModules.": {
        "Order": 2,
        "Param": "----",
        "Obj": "----",
        "InstantiatedObj": "----",
        "CommandEvent": "----"
    }
}