<?xml version="1.0" encoding="UTF-8"?>
<!-- Do not edit this file with editors other than draw.io -->
<!DOCTYPE svg PUBLIC "-//W3C//DTD SVG 1.1//EN" "http://www.w3.org/Graphics/SVG/1.1/DTD/svg11.dtd">
<svg xmlns="http://www.w3.org/2000/svg" xmlns:xlink="http://www.w3.org/1999/xlink" version="1.1" width="810px" height="403px" viewBox="-0.5 -0.5 810 403" content="&lt;mxfile host=&quot;app.diagrams.net&quot; modified=&quot;2024-03-26T09:52:16.972Z&quot; agent=&quot;Mozilla/5.0 (X11; Linux x86_64; rv:123.0) Gecko/20100101 Firefox/123.0&quot; etag=&quot;5rSVHw1gP4pJZSlvOyW9&quot; scale=&quot;1&quot; border=&quot;0&quot; version=&quot;24.1.0&quot; type=&quot;device&quot;&gt;&#xA;  &lt;diagram name=&quot;Page-1&quot; id=&quot;S_5A6ErIhnY1UkQ78xTq&quot;&gt;&#xA;    &lt;mxGraphModel dx=&quot;989&quot; dy=&quot;529&quot; grid=&quot;1&quot; gridSize=&quot;10&quot; guides=&quot;1&quot; tooltips=&quot;1&quot; connect=&quot;1&quot; arrows=&quot;1&quot; fold=&quot;1&quot; page=&quot;1&quot; pageScale=&quot;1&quot; pageWidth=&quot;1200&quot; pageHeight=&quot;1600&quot; math=&quot;0&quot; shadow=&quot;0&quot;&gt;&#xA;      &lt;root&gt;&#xA;        &lt;mxCell id=&quot;0&quot; /&gt;&#xA;        &lt;mxCell id=&quot;1&quot; parent=&quot;0&quot; /&gt;&#xA;        &lt;mxCell id=&quot;hZBSTVmSVKTq3FeR_9yU-1&quot; value=&quot;gmap-mod-self&quot; style=&quot;swimlane;whiteSpace=wrap;html=1;fillColor=#dae8fc;strokeColor=#6c8ebf;strokeWidth=2;gradientColor=none;swimlaneFillColor=#DAE8FC;fillStyle=auto;&quot; parent=&quot;1&quot; vertex=&quot;1&quot;&gt;&#xA;          &lt;mxGeometry x=&quot;250&quot; y=&quot;1000&quot; width=&quot;200&quot; height=&quot;400&quot; as=&quot;geometry&quot;&gt;&#xA;            &lt;mxRectangle x=&quot;250&quot; y=&quot;290&quot; width=&quot;120&quot; height=&quot;30&quot; as=&quot;alternateBounds&quot; /&gt;&#xA;          &lt;/mxGeometry&gt;&#xA;        &lt;/mxCell&gt;&#xA;        &lt;mxCell id=&quot;hZBSTVmSVKTq3FeR_9yU-8&quot; value=&quot;&quot; style=&quot;rounded=0;whiteSpace=wrap;html=1;&quot; parent=&quot;hZBSTVmSVKTq3FeR_9yU-1&quot; vertex=&quot;1&quot;&gt;&#xA;          &lt;mxGeometry x=&quot;95&quot; y=&quot;100&quot; width=&quot;10&quot; height=&quot;15&quot; as=&quot;geometry&quot; /&gt;&#xA;        &lt;/mxCell&gt;&#xA;        &lt;mxCell id=&quot;hZBSTVmSVKTq3FeR_9yU-9&quot; value=&quot;&quot; style=&quot;rounded=0;whiteSpace=wrap;html=1;&quot; parent=&quot;hZBSTVmSVKTq3FeR_9yU-1&quot; vertex=&quot;1&quot;&gt;&#xA;          &lt;mxGeometry x=&quot;95&quot; y=&quot;190&quot; width=&quot;10&quot; height=&quot;15&quot; as=&quot;geometry&quot; /&gt;&#xA;        &lt;/mxCell&gt;&#xA;        &lt;mxCell id=&quot;hZBSTVmSVKTq3FeR_9yU-10&quot; value=&quot;&quot; style=&quot;rounded=0;whiteSpace=wrap;html=1;&quot; parent=&quot;hZBSTVmSVKTq3FeR_9yU-1&quot; vertex=&quot;1&quot;&gt;&#xA;          &lt;mxGeometry x=&quot;95&quot; y=&quot;250&quot; width=&quot;10&quot; height=&quot;15&quot; as=&quot;geometry&quot; /&gt;&#xA;        &lt;/mxCell&gt;&#xA;        &lt;mxCell id=&quot;hZBSTVmSVKTq3FeR_9yU-11&quot; value=&quot;&quot; style=&quot;rounded=0;whiteSpace=wrap;html=1;&quot; parent=&quot;hZBSTVmSVKTq3FeR_9yU-1&quot; vertex=&quot;1&quot;&gt;&#xA;          &lt;mxGeometry x=&quot;95&quot; y=&quot;310&quot; width=&quot;10&quot; height=&quot;15&quot; as=&quot;geometry&quot; /&gt;&#xA;        &lt;/mxCell&gt;&#xA;        &lt;mxCell id=&quot;hZBSTVmSVKTq3FeR_9yU-12&quot; value=&quot;&quot; style=&quot;rounded=0;whiteSpace=wrap;html=1;&quot; parent=&quot;hZBSTVmSVKTq3FeR_9yU-1&quot; vertex=&quot;1&quot;&gt;&#xA;          &lt;mxGeometry x=&quot;95&quot; y=&quot;280&quot; width=&quot;10&quot; height=&quot;15&quot; as=&quot;geometry&quot; /&gt;&#xA;        &lt;/mxCell&gt;&#xA;        &lt;mxCell id=&quot;hZBSTVmSVKTq3FeR_9yU-13&quot; value=&quot;&quot; style=&quot;rounded=0;whiteSpace=wrap;html=1;&quot; parent=&quot;hZBSTVmSVKTq3FeR_9yU-1&quot; vertex=&quot;1&quot;&gt;&#xA;          &lt;mxGeometry x=&quot;95&quot; y=&quot;220&quot; width=&quot;10&quot; height=&quot;15&quot; as=&quot;geometry&quot; /&gt;&#xA;        &lt;/mxCell&gt;&#xA;        &lt;mxCell id=&quot;hZBSTVmSVKTq3FeR_9yU-14&quot; value=&quot;&quot; style=&quot;rounded=0;whiteSpace=wrap;html=1;&quot; parent=&quot;hZBSTVmSVKTq3FeR_9yU-1&quot; vertex=&quot;1&quot;&gt;&#xA;          &lt;mxGeometry x=&quot;95&quot; y=&quot;340&quot; width=&quot;10&quot; height=&quot;15&quot; as=&quot;geometry&quot; /&gt;&#xA;        &lt;/mxCell&gt;&#xA;        &lt;mxCell id=&quot;hZBSTVmSVKTq3FeR_9yU-15&quot; value=&quot;&quot; style=&quot;rounded=0;whiteSpace=wrap;html=1;&quot; parent=&quot;hZBSTVmSVKTq3FeR_9yU-1&quot; vertex=&quot;1&quot;&gt;&#xA;          &lt;mxGeometry x=&quot;95&quot; y=&quot;370&quot; width=&quot;10&quot; height=&quot;15&quot; as=&quot;geometry&quot; /&gt;&#xA;        &lt;/mxCell&gt;&#xA;        &lt;mxCell id=&quot;hZBSTVmSVKTq3FeR_9yU-17&quot; value=&quot;&quot; style=&quot;shape=cylinder3;whiteSpace=wrap;html=1;boundedLbl=1;backgroundOutline=1;size=15;fillColor=#fff2cc;strokeColor=#d6b656;&quot; parent=&quot;1&quot; vertex=&quot;1&quot;&gt;&#xA;          &lt;mxGeometry x=&quot;490&quot; y=&quot;1010&quot; width=&quot;270&quot; height=&quot;60&quot; as=&quot;geometry&quot; /&gt;&#xA;        &lt;/mxCell&gt;&#xA;        &lt;mxCell id=&quot;hZBSTVmSVKTq3FeR_9yU-18&quot; value=&quot;&quot; style=&quot;shape=cylinder3;whiteSpace=wrap;html=1;boundedLbl=1;backgroundOutline=1;size=15;fillColor=#f5f5f5;strokeColor=#666666;fontColor=#333333;&quot; parent=&quot;1&quot; vertex=&quot;1&quot;&gt;&#xA;          &lt;mxGeometry y=&quot;1060&quot; width=&quot;190&quot; height=&quot;70&quot; as=&quot;geometry&quot; /&gt;&#xA;        &lt;/mxCell&gt;&#xA;        &lt;mxCell id=&quot;hZBSTVmSVKTq3FeR_9yU-22&quot; value=&quot;&amp;lt;b&amp;gt;Devices.Device.&amp;amp;lt;bridge&amp;amp;gt;.&amp;lt;/b&amp;gt;&quot; style=&quot;swimlane;fontStyle=0;childLayout=stackLayout;horizontal=1;startSize=30;horizontalStack=0;resizeParent=1;resizeParentMax=0;resizeLast=0;collapsible=1;marginBottom=0;whiteSpace=wrap;html=1;strokeColor=none;fillColor=none;&quot; parent=&quot;1&quot; vertex=&quot;1&quot;&gt;&#xA;          &lt;mxGeometry x=&quot;490&quot; y=&quot;1010&quot; width=&quot;270&quot; height=&quot;60&quot; as=&quot;geometry&quot; /&gt;&#xA;        &lt;/mxCell&gt;&#xA;        &lt;mxCell id=&quot;hZBSTVmSVKTq3FeR_9yU-31&quot; value=&quot;LDevice.&amp;amp;lt;port&amp;amp;gt;.Alias = &amp;amp;lt;port&amp;amp;gt;&quot; style=&quot;text;strokeColor=none;fillColor=none;align=left;verticalAlign=middle;spacingLeft=4;spacingRight=4;overflow=hidden;points=[[0,0.5],[1,0.5]];portConstraint=eastwest;rotatable=0;whiteSpace=wrap;html=1;&quot; parent=&quot;hZBSTVmSVKTq3FeR_9yU-22&quot; vertex=&quot;1&quot;&gt;&#xA;          &lt;mxGeometry y=&quot;30&quot; width=&quot;270&quot; height=&quot;30&quot; as=&quot;geometry&quot; /&gt;&#xA;        &lt;/mxCell&gt;&#xA;        &lt;mxCell id=&quot;hZBSTVmSVKTq3FeR_9yU-32&quot; value=&quot;&amp;lt;b&amp;gt;NetModel.Intf.&amp;amp;lt;bridge&amp;amp;gt;.&amp;lt;/b&amp;gt;&quot; style=&quot;swimlane;fontStyle=0;childLayout=stackLayout;horizontal=1;startSize=30;horizontalStack=0;resizeParent=1;resizeParentMax=0;resizeLast=0;collapsible=1;marginBottom=0;whiteSpace=wrap;html=1;strokeColor=none;fillColor=none;&quot; parent=&quot;1&quot; vertex=&quot;1&quot;&gt;&#xA;          &lt;mxGeometry y=&quot;1065&quot; width=&quot;190&quot; height=&quot;60&quot; as=&quot;geometry&quot;&gt;&#xA;            &lt;mxRectangle x=&quot;40&quot; y=&quot;722.5&quot; width=&quot;170&quot; height=&quot;30&quot; as=&quot;alternateBounds&quot; /&gt;&#xA;          &lt;/mxGeometry&gt;&#xA;        &lt;/mxCell&gt;&#xA;        &lt;mxCell id=&quot;hZBSTVmSVKTq3FeR_9yU-38&quot; value=&quot;&amp;lt;b&amp;gt;Query&amp;lt;/b&amp;gt; getIntfs(&amp;quot;eth_intf || ssid&amp;quot;)&quot; style=&quot;text;strokeColor=none;fillColor=none;align=right;verticalAlign=middle;spacingLeft=4;spacingRight=4;overflow=hidden;points=[[0,0.5],[1,0.5]];portConstraint=eastwest;rotatable=0;whiteSpace=wrap;html=1;&quot; parent=&quot;hZBSTVmSVKTq3FeR_9yU-32&quot; vertex=&quot;1&quot;&gt;&#xA;          &lt;mxGeometry y=&quot;30&quot; width=&quot;190&quot; height=&quot;30&quot; as=&quot;geometry&quot; /&gt;&#xA;        &lt;/mxCell&gt;&#xA;        &lt;mxCell id=&quot;hZBSTVmSVKTq3FeR_9yU-63&quot; value=&quot;&quot; style=&quot;shape=cylinder3;whiteSpace=wrap;html=1;boundedLbl=1;backgroundOutline=1;size=15;fillColor=#fff2cc;strokeColor=#d6b656;&quot; parent=&quot;1&quot; vertex=&quot;1&quot;&gt;&#xA;          &lt;mxGeometry x=&quot;490&quot; y=&quot;1090&quot; width=&quot;270&quot; height=&quot;300&quot; as=&quot;geometry&quot; /&gt;&#xA;        &lt;/mxCell&gt;&#xA;        &lt;mxCell id=&quot;hZBSTVmSVKTq3FeR_9yU-64&quot; value=&quot;&amp;lt;b&amp;gt;Devices.Device.&amp;amp;lt;port&amp;amp;gt;.&amp;lt;/b&amp;gt;&quot; style=&quot;swimlane;fontStyle=0;childLayout=stackLayout;horizontal=1;startSize=30;horizontalStack=0;resizeParent=1;resizeParentMax=0;resizeLast=0;collapsible=1;marginBottom=0;whiteSpace=wrap;html=1;strokeColor=none;fillColor=none;&quot; parent=&quot;1&quot; vertex=&quot;1&quot;&gt;&#xA;          &lt;mxGeometry x=&quot;490&quot; y=&quot;1090&quot; width=&quot;270&quot; height=&quot;300&quot; as=&quot;geometry&quot; /&gt;&#xA;        &lt;/mxCell&gt;&#xA;        &lt;mxCell id=&quot;hZBSTVmSVKTq3FeR_9yU-65&quot; value=&quot;UDevice.&amp;amp;lt;bridge&amp;amp;gt;.Alias = &amp;amp;lt;bridge&amp;amp;gt;&quot; style=&quot;text;strokeColor=none;fillColor=none;align=left;verticalAlign=middle;spacingLeft=4;spacingRight=4;overflow=hidden;points=[[0,0.5],[1,0.5]];portConstraint=eastwest;rotatable=0;whiteSpace=wrap;html=1;&quot; parent=&quot;hZBSTVmSVKTq3FeR_9yU-64&quot; vertex=&quot;1&quot;&gt;&#xA;          &lt;mxGeometry y=&quot;30&quot; width=&quot;270&quot; height=&quot;30&quot; as=&quot;geometry&quot; /&gt;&#xA;        &lt;/mxCell&gt;&#xA;        &lt;mxCell id=&quot;hZBSTVmSVKTq3FeR_9yU-66&quot; value=&quot;Tags = self lan protected mac [wifi] [vap] [eth] interface&quot; style=&quot;text;strokeColor=none;fillColor=none;align=left;verticalAlign=middle;spacingLeft=4;spacingRight=4;overflow=hidden;points=[[0,0.5],[1,0.5]];portConstraint=eastwest;rotatable=0;whiteSpace=wrap;html=1;&quot; parent=&quot;hZBSTVmSVKTq3FeR_9yU-64&quot; vertex=&quot;1&quot;&gt;&#xA;          &lt;mxGeometry y=&quot;60&quot; width=&quot;270&quot; height=&quot;30&quot; as=&quot;geometry&quot; /&gt;&#xA;        &lt;/mxCell&gt;&#xA;        &lt;mxCell id=&quot;hZBSTVmSVKTq3FeR_9yU-67&quot; value=&quot;PhysAddress&quot; style=&quot;text;strokeColor=none;fillColor=none;align=left;verticalAlign=middle;spacingLeft=4;spacingRight=4;overflow=hidden;points=[[0,0.5],[1,0.5]];portConstraint=eastwest;rotatable=0;whiteSpace=wrap;html=1;&quot; parent=&quot;hZBSTVmSVKTq3FeR_9yU-64&quot; vertex=&quot;1&quot;&gt;&#xA;          &lt;mxGeometry y=&quot;90&quot; width=&quot;270&quot; height=&quot;30&quot; as=&quot;geometry&quot; /&gt;&#xA;        &lt;/mxCell&gt;&#xA;        &lt;mxCell id=&quot;hZBSTVmSVKTq3FeR_9yU-68&quot; value=&quot;Active&quot; style=&quot;text;strokeColor=none;fillColor=none;align=left;verticalAlign=middle;spacingLeft=4;spacingRight=4;overflow=hidden;points=[[0,0.5],[1,0.5]];portConstraint=eastwest;rotatable=0;whiteSpace=wrap;html=1;&quot; parent=&quot;hZBSTVmSVKTq3FeR_9yU-64&quot; vertex=&quot;1&quot;&gt;&#xA;          &lt;mxGeometry y=&quot;120&quot; width=&quot;270&quot; height=&quot;30&quot; as=&quot;geometry&quot; /&gt;&#xA;        &lt;/mxCell&gt;&#xA;        &lt;mxCell id=&quot;hZBSTVmSVKTq3FeR_9yU-69&quot; value=&quot;&amp;lt;div&amp;gt;CurrentBitrate&amp;lt;/div&amp;gt;&quot; style=&quot;text;strokeColor=none;fillColor=none;align=left;verticalAlign=middle;spacingLeft=4;spacingRight=4;overflow=hidden;points=[[0,0.5],[1,0.5]];portConstraint=eastwest;rotatable=0;whiteSpace=wrap;html=1;&quot; parent=&quot;hZBSTVmSVKTq3FeR_9yU-64&quot; vertex=&quot;1&quot;&gt;&#xA;          &lt;mxGeometry y=&quot;150&quot; width=&quot;270&quot; height=&quot;30&quot; as=&quot;geometry&quot; /&gt;&#xA;        &lt;/mxCell&gt;&#xA;        &lt;mxCell id=&quot;hZBSTVmSVKTq3FeR_9yU-70&quot; value=&quot;MaxBitRateSupported&quot; style=&quot;text;strokeColor=none;fillColor=none;align=left;verticalAlign=middle;spacingLeft=4;spacingRight=4;overflow=hidden;points=[[0,0.5],[1,0.5]];portConstraint=eastwest;rotatable=0;whiteSpace=wrap;html=1;&quot; parent=&quot;hZBSTVmSVKTq3FeR_9yU-64&quot; vertex=&quot;1&quot;&gt;&#xA;          &lt;mxGeometry y=&quot;180&quot; width=&quot;270&quot; height=&quot;30&quot; as=&quot;geometry&quot; /&gt;&#xA;        &lt;/mxCell&gt;&#xA;        &lt;mxCell id=&quot;hZBSTVmSVKTq3FeR_9yU-71&quot; value=&quot;NetDevIndex&quot; style=&quot;text;strokeColor=none;fillColor=none;align=left;verticalAlign=middle;spacingLeft=4;spacingRight=4;overflow=hidden;points=[[0,0.5],[1,0.5]];portConstraint=eastwest;rotatable=0;whiteSpace=wrap;html=1;&quot; parent=&quot;hZBSTVmSVKTq3FeR_9yU-64&quot; vertex=&quot;1&quot;&gt;&#xA;          &lt;mxGeometry y=&quot;210&quot; width=&quot;270&quot; height=&quot;30&quot; as=&quot;geometry&quot; /&gt;&#xA;        &lt;/mxCell&gt;&#xA;        &lt;mxCell id=&quot;hZBSTVmSVKTq3FeR_9yU-72&quot; value=&quot;NetDevName&quot; style=&quot;text;strokeColor=none;fillColor=none;align=left;verticalAlign=middle;spacingLeft=4;spacingRight=4;overflow=hidden;points=[[0,0.5],[1,0.5]];portConstraint=eastwest;rotatable=0;whiteSpace=wrap;html=1;&quot; parent=&quot;hZBSTVmSVKTq3FeR_9yU-64&quot; vertex=&quot;1&quot;&gt;&#xA;          &lt;mxGeometry y=&quot;240&quot; width=&quot;270&quot; height=&quot;30&quot; as=&quot;geometry&quot; /&gt;&#xA;        &lt;/mxCell&gt;&#xA;        &lt;mxCell id=&quot;hZBSTVmSVKTq3FeR_9yU-73&quot; style=&quot;edgeStyle=orthogonalEdgeStyle;rounded=0;orthogonalLoop=1;jettySize=auto;html=1;strokeColor=#575757;endArrow=classic;endFill=1;strokeWidth=1;fontColor=#575757;startArrow=classic;startFill=1;&quot; parent=&quot;hZBSTVmSVKTq3FeR_9yU-64&quot; edge=&quot;1&quot;&gt;&#xA;          &lt;mxGeometry relative=&quot;1&quot; as=&quot;geometry&quot;&gt;&#xA;            &lt;mxPoint x=&quot;170&quot; y=&quot;-35&quot; as=&quot;sourcePoint&quot; /&gt;&#xA;            &lt;Array as=&quot;points&quot;&gt;&#xA;              &lt;mxPoint x=&quot;310&quot; y=&quot;-35&quot; /&gt;&#xA;              &lt;mxPoint x=&quot;310&quot; y=&quot;45&quot; /&gt;&#xA;            &lt;/Array&gt;&#xA;            &lt;mxPoint x=&quot;200&quot; y=&quot;45&quot; as=&quot;targetPoint&quot; /&gt;&#xA;          &lt;/mxGeometry&gt;&#xA;        &lt;/mxCell&gt;&#xA;        &lt;mxCell id=&quot;hZBSTVmSVKTq3FeR_9yU-74&quot; value=&quot;Layer1Interface&quot; style=&quot;text;strokeColor=none;fillColor=none;align=left;verticalAlign=middle;spacingLeft=4;spacingRight=4;overflow=hidden;points=[[0,0.5],[1,0.5]];portConstraint=eastwest;rotatable=0;whiteSpace=wrap;html=1;&quot; parent=&quot;hZBSTVmSVKTq3FeR_9yU-64&quot; vertex=&quot;1&quot;&gt;&#xA;          &lt;mxGeometry y=&quot;270&quot; width=&quot;270&quot; height=&quot;30&quot; as=&quot;geometry&quot; /&gt;&#xA;        &lt;/mxCell&gt;&#xA;        &lt;mxCell id=&quot;hZBSTVmSVKTq3FeR_9yU-75&quot; value=&quot;&quot; style=&quot;shape=cylinder3;whiteSpace=wrap;html=1;boundedLbl=1;backgroundOutline=1;size=15;fillColor=#f5f5f5;strokeColor=#666666;fontColor=#333333;&quot; parent=&quot;1&quot; vertex=&quot;1&quot;&gt;&#xA;          &lt;mxGeometry x=&quot;50&quot; y=&quot;1150&quot; width=&quot;140&quot; height=&quot;250&quot; as=&quot;geometry&quot; /&gt;&#xA;        &lt;/mxCell&gt;&#xA;        &lt;mxCell id=&quot;hZBSTVmSVKTq3FeR_9yU-76&quot; value=&quot;&amp;lt;b&amp;gt;NetModel.Intf.&amp;amp;lt;port&amp;amp;gt;.&amp;lt;/b&amp;gt;&quot; style=&quot;swimlane;fontStyle=0;childLayout=stackLayout;horizontal=1;startSize=30;horizontalStack=0;resizeParent=1;resizeParentMax=0;resizeLast=0;collapsible=1;marginBottom=0;whiteSpace=wrap;html=1;strokeColor=none;fillColor=none;&quot; parent=&quot;1&quot; vertex=&quot;1&quot;&gt;&#xA;          &lt;mxGeometry x=&quot;50&quot; y=&quot;1152.5&quot; width=&quot;140&quot; height=&quot;240&quot; as=&quot;geometry&quot;&gt;&#xA;            &lt;mxRectangle x=&quot;40&quot; y=&quot;722.5&quot; width=&quot;170&quot; height=&quot;30&quot; as=&quot;alternateBounds&quot; /&gt;&#xA;          &lt;/mxGeometry&gt;&#xA;        &lt;/mxCell&gt;&#xA;        &lt;mxCell id=&quot;hZBSTVmSVKTq3FeR_9yU-77&quot; value=&quot;&amp;lt;b&amp;gt;Query&amp;lt;/b&amp;gt; getParameters()&quot; style=&quot;text;strokeColor=none;fillColor=none;align=right;verticalAlign=middle;spacingLeft=4;spacingRight=4;overflow=hidden;points=[[0,0.5],[1,0.5]];portConstraint=eastwest;rotatable=0;whiteSpace=wrap;html=1;&quot; parent=&quot;hZBSTVmSVKTq3FeR_9yU-76&quot; vertex=&quot;1&quot;&gt;&#xA;          &lt;mxGeometry y=&quot;30&quot; width=&quot;140&quot; height=&quot;30&quot; as=&quot;geometry&quot; /&gt;&#xA;        &lt;/mxCell&gt;&#xA;        &lt;mxCell id=&quot;hZBSTVmSVKTq3FeR_9yU-78&quot; value=&quot;&amp;lt;div align=&amp;quot;right&amp;quot;&amp;gt;Status&amp;lt;/div&amp;gt;&quot; style=&quot;text;strokeColor=none;fillColor=none;align=right;verticalAlign=middle;spacingLeft=4;spacingRight=4;overflow=hidden;points=[[0,0.5],[1,0.5]];portConstraint=eastwest;rotatable=0;whiteSpace=wrap;html=1;&quot; parent=&quot;hZBSTVmSVKTq3FeR_9yU-76&quot; vertex=&quot;1&quot;&gt;&#xA;          &lt;mxGeometry y=&quot;60&quot; width=&quot;140&quot; height=&quot;30&quot; as=&quot;geometry&quot; /&gt;&#xA;        &lt;/mxCell&gt;&#xA;        &lt;mxCell id=&quot;hZBSTVmSVKTq3FeR_9yU-79&quot; value=&quot;CurrentBitrate&quot; style=&quot;text;strokeColor=none;fillColor=none;align=right;verticalAlign=middle;spacingLeft=4;spacingRight=4;overflow=hidden;points=[[0,0.5],[1,0.5]];portConstraint=eastwest;rotatable=0;whiteSpace=wrap;html=1;&quot; parent=&quot;hZBSTVmSVKTq3FeR_9yU-76&quot; vertex=&quot;1&quot;&gt;&#xA;          &lt;mxGeometry y=&quot;90&quot; width=&quot;140&quot; height=&quot;30&quot; as=&quot;geometry&quot; /&gt;&#xA;        &lt;/mxCell&gt;&#xA;        &lt;mxCell id=&quot;hZBSTVmSVKTq3FeR_9yU-80&quot; value=&quot;MaxBitRateEnabled&quot; style=&quot;text;strokeColor=none;fillColor=none;align=right;verticalAlign=middle;spacingLeft=4;spacingRight=4;overflow=hidden;points=[[0,0.5],[1,0.5]];portConstraint=eastwest;rotatable=0;whiteSpace=wrap;html=1;&quot; parent=&quot;hZBSTVmSVKTq3FeR_9yU-76&quot; vertex=&quot;1&quot;&gt;&#xA;          &lt;mxGeometry y=&quot;120&quot; width=&quot;140&quot; height=&quot;30&quot; as=&quot;geometry&quot; /&gt;&#xA;        &lt;/mxCell&gt;&#xA;        &lt;mxCell id=&quot;hZBSTVmSVKTq3FeR_9yU-81&quot; value=&quot;NetDevIndex&quot; style=&quot;text;strokeColor=none;fillColor=none;align=right;verticalAlign=middle;spacingLeft=4;spacingRight=4;overflow=hidden;points=[[0,0.5],[1,0.5]];portConstraint=eastwest;rotatable=0;whiteSpace=wrap;html=1;&quot; parent=&quot;hZBSTVmSVKTq3FeR_9yU-76&quot; vertex=&quot;1&quot;&gt;&#xA;          &lt;mxGeometry y=&quot;150&quot; width=&quot;140&quot; height=&quot;30&quot; as=&quot;geometry&quot; /&gt;&#xA;        &lt;/mxCell&gt;&#xA;        &lt;mxCell id=&quot;hZBSTVmSVKTq3FeR_9yU-82&quot; value=&quot;NetDevName&quot; style=&quot;text;strokeColor=none;fillColor=none;align=right;verticalAlign=middle;spacingLeft=4;spacingRight=4;overflow=hidden;points=[[0,0.5],[1,0.5]];portConstraint=eastwest;rotatable=0;whiteSpace=wrap;html=1;&quot; parent=&quot;hZBSTVmSVKTq3FeR_9yU-76&quot; vertex=&quot;1&quot;&gt;&#xA;          &lt;mxGeometry y=&quot;180&quot; width=&quot;140&quot; height=&quot;30&quot; as=&quot;geometry&quot; /&gt;&#xA;        &lt;/mxCell&gt;&#xA;        &lt;mxCell id=&quot;hZBSTVmSVKTq3FeR_9yU-83&quot; value=&quot;&amp;lt;div&amp;gt;InterfacePath&amp;lt;/div&amp;gt;&quot; style=&quot;text;strokeColor=none;fillColor=none;align=right;verticalAlign=middle;spacingLeft=4;spacingRight=4;overflow=hidden;points=[[0,0.5],[1,0.5]];portConstraint=eastwest;rotatable=0;whiteSpace=wrap;html=1;&quot; parent=&quot;hZBSTVmSVKTq3FeR_9yU-76&quot; vertex=&quot;1&quot;&gt;&#xA;          &lt;mxGeometry y=&quot;210&quot; width=&quot;140&quot; height=&quot;30&quot; as=&quot;geometry&quot; /&gt;&#xA;        &lt;/mxCell&gt;&#xA;        &lt;mxCell id=&quot;hZBSTVmSVKTq3FeR_9yU-84&quot; style=&quot;rounded=0;orthogonalLoop=1;jettySize=auto;html=1;entryX=0;entryY=0.5;entryDx=0;entryDy=0;&quot; parent=&quot;1&quot; source=&quot;hZBSTVmSVKTq3FeR_9yU-38&quot; target=&quot;hZBSTVmSVKTq3FeR_9yU-8&quot; edge=&quot;1&quot;&gt;&#xA;          &lt;mxGeometry relative=&quot;1&quot; as=&quot;geometry&quot; /&gt;&#xA;        &lt;/mxCell&gt;&#xA;        &lt;mxCell id=&quot;hZBSTVmSVKTq3FeR_9yU-85&quot; style=&quot;rounded=0;orthogonalLoop=1;jettySize=auto;html=1;entryX=0.006;entryY=0.048;entryDx=0;entryDy=0;entryPerimeter=0;&quot; parent=&quot;1&quot; source=&quot;hZBSTVmSVKTq3FeR_9yU-8&quot; target=&quot;hZBSTVmSVKTq3FeR_9yU-64&quot; edge=&quot;1&quot;&gt;&#xA;          &lt;mxGeometry relative=&quot;1&quot; as=&quot;geometry&quot; /&gt;&#xA;        &lt;/mxCell&gt;&#xA;        &lt;mxCell id=&quot;hZBSTVmSVKTq3FeR_9yU-86&quot; style=&quot;rounded=0;orthogonalLoop=1;jettySize=auto;html=1;&quot; parent=&quot;1&quot; source=&quot;hZBSTVmSVKTq3FeR_9yU-8&quot; target=&quot;hZBSTVmSVKTq3FeR_9yU-65&quot; edge=&quot;1&quot;&gt;&#xA;          &lt;mxGeometry relative=&quot;1&quot; as=&quot;geometry&quot; /&gt;&#xA;        &lt;/mxCell&gt;&#xA;        &lt;mxCell id=&quot;hZBSTVmSVKTq3FeR_9yU-87&quot; style=&quot;rounded=0;orthogonalLoop=1;jettySize=auto;html=1;entryX=0;entryY=0.5;entryDx=0;entryDy=0;&quot; parent=&quot;1&quot; source=&quot;hZBSTVmSVKTq3FeR_9yU-8&quot; target=&quot;hZBSTVmSVKTq3FeR_9yU-66&quot; edge=&quot;1&quot;&gt;&#xA;          &lt;mxGeometry relative=&quot;1&quot; as=&quot;geometry&quot; /&gt;&#xA;        &lt;/mxCell&gt;&#xA;        &lt;mxCell id=&quot;hZBSTVmSVKTq3FeR_9yU-88&quot; style=&quot;rounded=0;orthogonalLoop=1;jettySize=auto;html=1;&quot; parent=&quot;1&quot; source=&quot;hZBSTVmSVKTq3FeR_9yU-9&quot; target=&quot;hZBSTVmSVKTq3FeR_9yU-67&quot; edge=&quot;1&quot;&gt;&#xA;          &lt;mxGeometry relative=&quot;1&quot; as=&quot;geometry&quot; /&gt;&#xA;        &lt;/mxCell&gt;&#xA;        &lt;mxCell id=&quot;hZBSTVmSVKTq3FeR_9yU-89&quot; style=&quot;rounded=0;orthogonalLoop=1;jettySize=auto;html=1;&quot; parent=&quot;1&quot; source=&quot;hZBSTVmSVKTq3FeR_9yU-77&quot; target=&quot;hZBSTVmSVKTq3FeR_9yU-9&quot; edge=&quot;1&quot;&gt;&#xA;          &lt;mxGeometry relative=&quot;1&quot; as=&quot;geometry&quot; /&gt;&#xA;        &lt;/mxCell&gt;&#xA;        &lt;mxCell id=&quot;hZBSTVmSVKTq3FeR_9yU-90&quot; style=&quot;rounded=0;orthogonalLoop=1;jettySize=auto;html=1;&quot; parent=&quot;1&quot; source=&quot;hZBSTVmSVKTq3FeR_9yU-78&quot; target=&quot;hZBSTVmSVKTq3FeR_9yU-13&quot; edge=&quot;1&quot;&gt;&#xA;          &lt;mxGeometry relative=&quot;1&quot; as=&quot;geometry&quot; /&gt;&#xA;        &lt;/mxCell&gt;&#xA;        &lt;mxCell id=&quot;hZBSTVmSVKTq3FeR_9yU-91&quot; style=&quot;rounded=0;orthogonalLoop=1;jettySize=auto;html=1;&quot; parent=&quot;1&quot; source=&quot;hZBSTVmSVKTq3FeR_9yU-13&quot; target=&quot;hZBSTVmSVKTq3FeR_9yU-68&quot; edge=&quot;1&quot;&gt;&#xA;          &lt;mxGeometry relative=&quot;1&quot; as=&quot;geometry&quot; /&gt;&#xA;        &lt;/mxCell&gt;&#xA;        &lt;mxCell id=&quot;hZBSTVmSVKTq3FeR_9yU-92&quot; style=&quot;rounded=0;orthogonalLoop=1;jettySize=auto;html=1;&quot; parent=&quot;1&quot; source=&quot;hZBSTVmSVKTq3FeR_9yU-79&quot; target=&quot;hZBSTVmSVKTq3FeR_9yU-10&quot; edge=&quot;1&quot;&gt;&#xA;          &lt;mxGeometry relative=&quot;1&quot; as=&quot;geometry&quot; /&gt;&#xA;        &lt;/mxCell&gt;&#xA;        &lt;mxCell id=&quot;hZBSTVmSVKTq3FeR_9yU-93&quot; style=&quot;rounded=0;orthogonalLoop=1;jettySize=auto;html=1;&quot; parent=&quot;1&quot; source=&quot;hZBSTVmSVKTq3FeR_9yU-10&quot; target=&quot;hZBSTVmSVKTq3FeR_9yU-69&quot; edge=&quot;1&quot;&gt;&#xA;          &lt;mxGeometry relative=&quot;1&quot; as=&quot;geometry&quot; /&gt;&#xA;        &lt;/mxCell&gt;&#xA;        &lt;mxCell id=&quot;hZBSTVmSVKTq3FeR_9yU-94&quot; style=&quot;rounded=0;orthogonalLoop=1;jettySize=auto;html=1;&quot; parent=&quot;1&quot; source=&quot;hZBSTVmSVKTq3FeR_9yU-80&quot; target=&quot;hZBSTVmSVKTq3FeR_9yU-12&quot; edge=&quot;1&quot;&gt;&#xA;          &lt;mxGeometry relative=&quot;1&quot; as=&quot;geometry&quot;&gt;&#xA;            &lt;mxPoint x=&quot;230&quot; y=&quot;1240&quot; as=&quot;targetPoint&quot; /&gt;&#xA;          &lt;/mxGeometry&gt;&#xA;        &lt;/mxCell&gt;&#xA;        &lt;mxCell id=&quot;hZBSTVmSVKTq3FeR_9yU-95&quot; style=&quot;rounded=0;orthogonalLoop=1;jettySize=auto;html=1;&quot; parent=&quot;1&quot; source=&quot;hZBSTVmSVKTq3FeR_9yU-12&quot; target=&quot;hZBSTVmSVKTq3FeR_9yU-70&quot; edge=&quot;1&quot;&gt;&#xA;          &lt;mxGeometry relative=&quot;1&quot; as=&quot;geometry&quot; /&gt;&#xA;        &lt;/mxCell&gt;&#xA;        &lt;mxCell id=&quot;hZBSTVmSVKTq3FeR_9yU-96&quot; style=&quot;rounded=0;orthogonalLoop=1;jettySize=auto;html=1;&quot; parent=&quot;1&quot; source=&quot;hZBSTVmSVKTq3FeR_9yU-81&quot; target=&quot;hZBSTVmSVKTq3FeR_9yU-11&quot; edge=&quot;1&quot;&gt;&#xA;          &lt;mxGeometry relative=&quot;1&quot; as=&quot;geometry&quot; /&gt;&#xA;        &lt;/mxCell&gt;&#xA;        &lt;mxCell id=&quot;hZBSTVmSVKTq3FeR_9yU-97&quot; style=&quot;rounded=0;orthogonalLoop=1;jettySize=auto;html=1;&quot; parent=&quot;1&quot; source=&quot;hZBSTVmSVKTq3FeR_9yU-11&quot; target=&quot;hZBSTVmSVKTq3FeR_9yU-71&quot; edge=&quot;1&quot;&gt;&#xA;          &lt;mxGeometry relative=&quot;1&quot; as=&quot;geometry&quot; /&gt;&#xA;        &lt;/mxCell&gt;&#xA;        &lt;mxCell id=&quot;hZBSTVmSVKTq3FeR_9yU-98&quot; style=&quot;rounded=0;orthogonalLoop=1;jettySize=auto;html=1;entryX=0;entryY=0.5;entryDx=0;entryDy=0;&quot; parent=&quot;1&quot; source=&quot;hZBSTVmSVKTq3FeR_9yU-82&quot; target=&quot;hZBSTVmSVKTq3FeR_9yU-14&quot; edge=&quot;1&quot;&gt;&#xA;          &lt;mxGeometry relative=&quot;1&quot; as=&quot;geometry&quot; /&gt;&#xA;        &lt;/mxCell&gt;&#xA;        &lt;mxCell id=&quot;hZBSTVmSVKTq3FeR_9yU-99&quot; style=&quot;rounded=0;orthogonalLoop=1;jettySize=auto;html=1;&quot; parent=&quot;1&quot; source=&quot;hZBSTVmSVKTq3FeR_9yU-14&quot; target=&quot;hZBSTVmSVKTq3FeR_9yU-72&quot; edge=&quot;1&quot;&gt;&#xA;          &lt;mxGeometry relative=&quot;1&quot; as=&quot;geometry&quot; /&gt;&#xA;        &lt;/mxCell&gt;&#xA;        &lt;mxCell id=&quot;hZBSTVmSVKTq3FeR_9yU-100&quot; style=&quot;rounded=0;orthogonalLoop=1;jettySize=auto;html=1;&quot; parent=&quot;1&quot; source=&quot;hZBSTVmSVKTq3FeR_9yU-83&quot; target=&quot;hZBSTVmSVKTq3FeR_9yU-15&quot; edge=&quot;1&quot;&gt;&#xA;          &lt;mxGeometry relative=&quot;1&quot; as=&quot;geometry&quot; /&gt;&#xA;        &lt;/mxCell&gt;&#xA;        &lt;mxCell id=&quot;hZBSTVmSVKTq3FeR_9yU-101&quot; style=&quot;rounded=0;orthogonalLoop=1;jettySize=auto;html=1;&quot; parent=&quot;1&quot; source=&quot;hZBSTVmSVKTq3FeR_9yU-15&quot; target=&quot;hZBSTVmSVKTq3FeR_9yU-74&quot; edge=&quot;1&quot;&gt;&#xA;          &lt;mxGeometry relative=&quot;1&quot; as=&quot;geometry&quot; /&gt;&#xA;        &lt;/mxCell&gt;&#xA;        &lt;mxCell id=&quot;hZBSTVmSVKTq3FeR_9yU-102&quot; style=&quot;rounded=0;orthogonalLoop=1;jettySize=auto;html=1;entryX=0;entryY=0.5;entryDx=0;entryDy=0;&quot; parent=&quot;1&quot; source=&quot;hZBSTVmSVKTq3FeR_9yU-8&quot; target=&quot;hZBSTVmSVKTq3FeR_9yU-31&quot; edge=&quot;1&quot;&gt;&#xA;          &lt;mxGeometry relative=&quot;1&quot; as=&quot;geometry&quot; /&gt;&#xA;        &lt;/mxCell&gt;&#xA;      &lt;/root&gt;&#xA;    &lt;/mxGraphModel&gt;&#xA;  &lt;/diagram&gt;&#xA;&lt;/mxfile&gt;&#xA;"><defs/><g><g><path d="M 250 24 L 250 1 L 450 1 L 450 24" fill="#dae8fc" stroke="#6c8ebf" stroke-width="2" stroke-miterlimit="10" pointer-events="all"/><path d="M 250 24 L 250 401 L 450 401 L 450 24" fill="#dae8fc" stroke="#6c8ebf" stroke-width="2" stroke-miterlimit="10" pointer-events="all"/><path d="M 250 24 L 450 24" fill="none" stroke="#6c8ebf" stroke-width="2" stroke-miterlimit="10" pointer-events="all"/></g><g><g transform="translate(-0.5 -0.5)"><switch><foreignObject style="overflow: visible; text-align: left;" pointer-events="none" width="100%" height="100%" requiredFeatures="http://www.w3.org/TR/SVG11/feature#Extensibility"><div xmlns="http://www.w3.org/1999/xhtml" style="display: flex; align-items: unsafe center; justify-content: unsafe center; width: 198px; height: 1px; padding-top: 13px; margin-left: 251px;"><div style="box-sizing: border-box; font-size: 0px; text-align: center;" data-drawio-colors="color: rgb(0, 0, 0); "><div style="display: inline-block; font-size: 12px; font-family: Helvetica; color: rgb(0, 0, 0); line-height: 1.2; pointer-events: all; font-weight: bold; white-space: normal; overflow-wrap: normal;">gmap-mod-self</div></div></div></foreignObject><text x="350" y="16" fill="rgb(0, 0, 0)" font-family="Helvetica" font-size="12px" text-anchor="middle" font-weight="bold">gmap-mod-self</text></switch></g></g><g><rect x="345" y="101" width="10" height="15" fill="rgb(255, 255, 255)" stroke="rgb(0, 0, 0)" pointer-events="all"/></g><g><rect x="345" y="191" width="10" height="15" fill="rgb(255, 255, 255)" stroke="rgb(0, 0, 0)" pointer-events="all"/></g><g><rect x="345" y="251" width="10" height="15" fill="rgb(255, 255, 255)" stroke="rgb(0, 0, 0)" pointer-events="all"/></g><g><rect x="345" y="311" width="10" height="15" fill="rgb(255, 255, 255)" stroke="rgb(0, 0, 0)" pointer-events="all"/></g><g><rect x="345" y="281" width="10" height="15" fill="rgb(255, 255, 255)" stroke="rgb(0, 0, 0)" pointer-events="all"/></g><g><rect x="345" y="221" width="10" height="15" fill="rgb(255, 255, 255)" stroke="rgb(0, 0, 0)" pointer-events="all"/></g><g><rect x="345" y="341" width="10" height="15" fill="rgb(255, 255, 255)" stroke="rgb(0, 0, 0)" pointer-events="all"/></g><g><rect x="345" y="371" width="10" height="15" fill="rgb(255, 255, 255)" stroke="rgb(0, 0, 0)" pointer-events="all"/></g><g><path d="M 490 26 C 490 17.72 550.44 11 625 11 C 660.8 11 695.14 12.58 720.46 15.39 C 745.78 18.21 760 22.02 760 26 L 760 56 C 760 64.28 699.56 71 625 71 C 550.44 71 490 64.28 490 56 Z" fill="#fff2cc" stroke="#d6b656" stroke-miterlimit="10" pointer-events="all"/><path d="M 760 26 C 760 34.28 699.56 41 625 41 C 550.44 41 490 34.28 490 26" fill="none" stroke="#d6b656" stroke-miterlimit="10" pointer-events="all"/></g><g><path d="M 0 76 C 0 67.72 42.53 61 95 61 C 120.2 61 144.36 62.58 162.18 65.39 C 179.99 68.21 190 72.02 190 76 L 190 116 C 190 124.28 147.47 131 95 131 C 42.53 131 0 124.28 0 116 Z" fill="#f5f5f5" stroke="#666666" stroke-miterlimit="10" pointer-events="all"/><path d="M 190 76 C 190 84.28 147.47 91 95 91 C 42.53 91 0 84.28 0 76" fill="none" stroke="#666666" stroke-miterlimit="10" pointer-events="all"/></g><g><path d="M 490 41 L 490 11 L 760 11 L 760 41" fill="none" stroke="none" pointer-events="all"/></g><g><g transform="translate(-0.5 -0.5)"><switch><foreignObject style="overflow: visible; text-align: left;" pointer-events="none" width="100%" height="100%" requiredFeatures="http://www.w3.org/TR/SVG11/feature#Extensibility"><div xmlns="http://www.w3.org/1999/xhtml" style="display: flex; align-items: unsafe center; justify-content: unsafe center; width: 268px; height: 1px; padding-top: 26px; margin-left: 491px;"><div style="box-sizing: border-box; font-size: 0px; text-align: center;" data-drawio-colors="color: rgb(0, 0, 0); "><div style="display: inline-block; font-size: 12px; font-family: Helvetica; color: rgb(0, 0, 0); line-height: 1.2; pointer-events: all; white-space: normal; overflow-wrap: normal;"><b>Devices.Device.&lt;bridge&gt;.</b></div></div></div></foreignObject><text x="625" y="30" fill="rgb(0, 0, 0)" font-family="Helvetica" font-size="12px" text-anchor="middle">Devices.Device.&lt;bridge&gt;.</text></switch></g></g><g><rect x="490" y="41" width="270" height="30" fill="none" stroke="none" pointer-events="all"/></g><g><g transform="translate(-0.5 -0.5)"><switch><foreignObject style="overflow: visible; text-align: left;" pointer-events="none" width="100%" height="100%" requiredFeatures="http://www.w3.org/TR/SVG11/feature#Extensibility"><div xmlns="http://www.w3.org/1999/xhtml" style="display: flex; align-items: unsafe center; justify-content: unsafe flex-start; width: 260px; height: 1px; padding-top: 56px; margin-left: 496px;"><div style="box-sizing: border-box; font-size: 0px; text-align: left; max-height: 26px; overflow: hidden;" data-drawio-colors="color: rgb(0, 0, 0); "><div style="display: inline-block; font-size: 12px; font-family: Helvetica; color: rgb(0, 0, 0); line-height: 1.2; pointer-events: all; white-space: normal; overflow-wrap: normal;">LDevice.&lt;port&gt;.Alias = &lt;port&gt;</div></div></div></foreignObject><text x="496" y="60" fill="rgb(0, 0, 0)" font-family="Helvetica" font-size="12px">LDevice.&lt;port&gt;.Alias = &lt;port&gt;</text></switch></g></g><g><path d="M 0 96 L 0 66 L 190 66 L 190 96" fill="none" stroke="none" pointer-events="all"/></g><g><g transform="translate(-0.5 -0.5)"><switch><foreignObject style="overflow: visible; text-align: left;" pointer-events="none" width="100%" height="100%" requiredFeatures="http://www.w3.org/TR/SVG11/feature#Extensibility"><div xmlns="http://www.w3.org/1999/xhtml" style="display: flex; align-items: unsafe center; justify-content: unsafe center; width: 188px; height: 1px; padding-top: 81px; margin-left: 1px;"><div style="box-sizing: border-box; font-size: 0px; text-align: center;" data-drawio-colors="color: rgb(0, 0, 0); "><div style="display: inline-block; font-size: 12px; font-family: Helvetica; color: rgb(0, 0, 0); line-height: 1.2; pointer-events: all; white-space: normal; overflow-wrap: normal;"><b>NetModel.Intf.&lt;bridge&gt;.</b></div></div></div></foreignObject><text x="95" y="85" fill="rgb(0, 0, 0)" font-family="Helvetica" font-size="12px" text-anchor="middle">NetModel.Intf.&lt;bridge&gt;.</text></switch></g></g><g><rect x="0" y="96" width="190" height="30" fill="none" stroke="none" pointer-events="all"/></g><g><g transform="translate(-0.5 -0.5)"><switch><foreignObject style="overflow: visible; text-align: left;" pointer-events="none" width="100%" height="100%" requiredFeatures="http://www.w3.org/TR/SVG11/feature#Extensibility"><div xmlns="http://www.w3.org/1999/xhtml" style="display: flex; align-items: unsafe center; justify-content: unsafe flex-end; width: 180px; height: 1px; padding-top: 111px; margin-left: 4px;"><div style="box-sizing: border-box; font-size: 0px; text-align: right; max-height: 26px; overflow: hidden;" data-drawio-colors="color: rgb(0, 0, 0); "><div style="display: inline-block; font-size: 12px; font-family: Helvetica; color: rgb(0, 0, 0); line-height: 1.2; pointer-events: all; white-space: normal; overflow-wrap: normal;"><b>Query</b> getIntfs("eth_intf || ssid")</div></div></div></foreignObject><text x="184" y="115" fill="rgb(0, 0, 0)" font-family="Helvetica" font-size="12px" text-anchor="end">Query getIntfs("eth_intf || ss...</text></switch></g></g><g><path d="M 490 106 C 490 97.72 550.44 91 625 91 C 660.8 91 695.14 92.58 720.46 95.39 C 745.78 98.21 760 102.02 760 106 L 760 376 C 760 384.28 699.56 391 625 391 C 550.44 391 490 384.28 490 376 Z" fill="#fff2cc" stroke="#d6b656" stroke-miterlimit="10" pointer-events="all"/><path d="M 760 106 C 760 114.28 699.56 121 625 121 C 550.44 121 490 114.28 490 106" fill="none" stroke="#d6b656" stroke-miterlimit="10" pointer-events="all"/></g><g><path d="M 490 121 L 490 91 L 760 91 L 760 121" fill="none" stroke="none" pointer-events="all"/></g><g><g transform="translate(-0.5 -0.5)"><switch><foreignObject style="overflow: visible; text-align: left;" pointer-events="none" width="100%" height="100%" requiredFeatures="http://www.w3.org/TR/SVG11/feature#Extensibility"><div xmlns="http://www.w3.org/1999/xhtml" style="display: flex; align-items: unsafe center; justify-content: unsafe center; width: 268px; height: 1px; padding-top: 106px; margin-left: 491px;"><div style="box-sizing: border-box; font-size: 0px; text-align: center;" data-drawio-colors="color: rgb(0, 0, 0); "><div style="display: inline-block; font-size: 12px; font-family: Helvetica; color: rgb(0, 0, 0); line-height: 1.2; pointer-events: all; white-space: normal; overflow-wrap: normal;"><b>Devices.Device.&lt;port&gt;.</b></div></div></div></foreignObject><text x="625" y="110" fill="rgb(0, 0, 0)" font-family="Helvetica" font-size="12px" text-anchor="middle">Devices.Device.&lt;port&gt;.</text></switch></g></g><g><rect x="490" y="121" width="270" height="30" fill="none" stroke="none" pointer-events="all"/></g><g><g transform="translate(-0.5 -0.5)"><switch><foreignObject style="overflow: visible; text-align: left;" pointer-events="none" width="100%" height="100%" requiredFeatures="http://www.w3.org/TR/SVG11/feature#Extensibility"><div xmlns="http://www.w3.org/1999/xhtml" style="display: flex; align-items: unsafe center; justify-content: unsafe flex-start; width: 260px; height: 1px; padding-top: 136px; margin-left: 496px;"><div style="box-sizing: border-box; font-size: 0px; text-align: left; max-height: 26px; overflow: hidden;" data-drawio-colors="color: rgb(0, 0, 0); "><div style="display: inline-block; font-size: 12px; font-family: Helvetica; color: rgb(0, 0, 0); line-height: 1.2; pointer-events: all; white-space: normal; overflow-wrap: normal;">UDevice.&lt;bridge&gt;.Alias = &lt;bridge&gt;</div></div></div></foreignObject><text x="496" y="140" fill="rgb(0, 0, 0)" font-family="Helvetica" font-size="12px">UDevice.&lt;bridge&gt;.Alias = &lt;bridge&gt;</text></switch></g></g><g><rect x="490" y="151" width="270" height="30" fill="none" stroke="none" pointer-events="all"/></g><g><g transform="translate(-0.5 -0.5)"><switch><foreignObject style="overflow: visible; text-align: left;" pointer-events="none" width="100%" height="100%" requiredFeatures="http://www.w3.org/TR/SVG11/feature#Extensibility"><div xmlns="http://www.w3.org/1999/xhtml" style="display: flex; align-items: unsafe center; justify-content: unsafe flex-start; width: 260px; height: 1px; padding-top: 166px; margin-left: 496px;"><div style="box-sizing: border-box; font-size: 0px; text-align: left; max-height: 26px; overflow: hidden;" data-drawio-colors="color: rgb(0, 0, 0); "><div style="display: inline-block; font-size: 12px; font-family: Helvetica; color: rgb(0, 0, 0); line-height: 1.2; pointer-events: all; white-space: normal; overflow-wrap: normal;">Tags = self lan protected mac [wifi] [vap] [eth] interface</div></div></div></foreignObject><text x="496" y="170" fill="rgb(0, 0, 0)" font-family="Helvetica" font-size="12px">Tags = self lan protected mac [wifi] [vap]...</text></switch></g></g><g><rect x="490" y="181" width="270" height="30" fill="none" stroke="none" pointer-events="all"/></g><g><g transform="translate(-0.5 -0.5)"><switch><foreignObject style="overflow: visible; text-align: left;" pointer-events="none" width="100%" height="100%" requiredFeatures="http://www.w3.org/TR/SVG11/feature#Extensibility"><div xmlns="http://www.w3.org/1999/xhtml" style="display: flex; align-items: unsafe center; justify-content: unsafe flex-start; width: 260px; height: 1px; padding-top: 196px; margin-left: 496px;"><div style="box-sizing: border-box; font-size: 0px; text-align: left; max-height: 26px; overflow: hidden;" data-drawio-colors="color: rgb(0, 0, 0); "><div style="display: inline-block; font-size: 12px; font-family: Helvetica; color: rgb(0, 0, 0); line-height: 1.2; pointer-events: all; white-space: normal; overflow-wrap: normal;">PhysAddress</div></div></div></foreignObject><text x="496" y="200" fill="rgb(0, 0, 0)" font-family="Helvetica" font-size="12px">PhysAddress</text></switch></g></g><g><rect x="490" y="211" width="270" height="30" fill="none" stroke="none" pointer-events="all"/></g><g><g transform="translate(-0.5 -0.5)"><switch><foreignObject style="overflow: visible; text-align: left;" pointer-events="none" width="100%" height="100%" requiredFeatures="http://www.w3.org/TR/SVG11/feature#Extensibility"><div xmlns="http://www.w3.org/1999/xhtml" style="display: flex; align-items: unsafe center; justify-content: unsafe flex-start; width: 260px; height: 1px; padding-top: 226px; margin-left: 496px;"><div style="box-sizing: border-box; font-size: 0px; text-align: left; max-height: 26px; overflow: hidden;" data-drawio-colors="color: rgb(0, 0, 0); "><div style="display: inline-block; font-size: 12px; font-family: Helvetica; color: rgb(0, 0, 0); line-height: 1.2; pointer-events: all; white-space: normal; overflow-wrap: normal;">Active</div></div></div></foreignObject><text x="496" y="230" fill="rgb(0, 0, 0)" font-family="Helvetica" font-size="12px">Active</text></switch></g></g><g><rect x="490" y="241" width="270" height="30" fill="none" stroke="none" pointer-events="all"/></g><g><g transform="translate(-0.5 -0.5)"><switch><foreignObject style="overflow: visible; text-align: left;" pointer-events="none" width="100%" height="100%" requiredFeatures="http://www.w3.org/TR/SVG11/feature#Extensibility"><div xmlns="http://www.w3.org/1999/xhtml" style="display: flex; align-items: unsafe center; justify-content: unsafe flex-start; width: 260px; height: 1px; padding-top: 256px; margin-left: 496px;"><div style="box-sizing: border-box; font-size: 0px; text-align: left; max-height: 26px; overflow: hidden;" data-drawio-colors="color: rgb(0, 0, 0); "><div style="display: inline-block; font-size: 12px; font-family: Helvetica; color: rgb(0, 0, 0); line-height: 1.2; pointer-events: all; white-space: normal; overflow-wrap: normal;"><div>CurrentBitrate</div></div></div></div></foreignObject><text x="496" y="260" fill="rgb(0, 0, 0)" font-family="Helvetica" font-size="12px">CurrentBitrate</text></switch></g></g><g><rect x="490" y="271" width="270" height="30" fill="none" stroke="none" pointer-events="all"/></g><g><g transform="translate(-0.5 -0.5)"><switch><foreignObject style="overflow: visible; text-align: left;" pointer-events="none" width="100%" height="100%" requiredFeatures="http://www.w3.org/TR/SVG11/feature#Extensibility"><div xmlns="http://www.w3.org/1999/xhtml" style="display: flex; align-items: unsafe center; justify-content: unsafe flex-start; width: 260px; height: 1px; padding-top: 286px; margin-left: 496px;"><div style="box-sizing: border-box; font-size: 0px; text-align: left; max-height: 26px; overflow: hidden;" data-drawio-colors="color: rgb(0, 0, 0); "><div style="display: inline-block; font-size: 12px; font-family: Helvetica; color: rgb(0, 0, 0); line-height: 1.2; pointer-events: all; white-space: normal; overflow-wrap: normal;">MaxBitRateSupported</div></div></div></foreignObject><text x="496" y="290" fill="rgb(0, 0, 0)" font-family="Helvetica" font-size="12px">MaxBitRateSupported</text></switch></g></g><g><rect x="490" y="301" width="270" height="30" fill="none" stroke="none" pointer-events="all"/></g><g><g transform="translate(-0.5 -0.5)"><switch><foreignObject style="overflow: visible; text-align: left;" pointer-events="none" width="100%" height="100%" requiredFeatures="http://www.w3.org/TR/SVG11/feature#Extensibility"><div xmlns="http://www.w3.org/1999/xhtml" style="display: flex; align-items: unsafe center; justify-content: unsafe flex-start; width: 260px; height: 1px; padding-top: 316px; margin-left: 496px;"><div style="box-sizing: border-box; font-size: 0px; text-align: left; max-height: 26px; overflow: hidden;" data-drawio-colors="color: rgb(0, 0, 0); "><div style="display: inline-block; font-size: 12px; font-family: Helvetica; color: rgb(0, 0, 0); line-height: 1.2; pointer-events: all; white-space: normal; overflow-wrap: normal;">NetDevIndex</div></div></div></foreignObject><text x="496" y="320" fill="rgb(0, 0, 0)" font-family="Helvetica" font-size="12px">NetDevIndex</text></switch></g></g><g><rect x="490" y="331" width="270" height="30" fill="none" stroke="none" pointer-events="all"/></g><g><g transform="translate(-0.5 -0.5)"><switch><foreignObject style="overflow: visible; text-align: left;" pointer-events="none" width="100%" height="100%" requiredFeatures="http://www.w3.org/TR/SVG11/feature#Extensibility"><div xmlns="http://www.w3.org/1999/xhtml" style="display: flex; align-items: unsafe center; justify-content: unsafe flex-start; width: 260px; height: 1px; padding-top: 346px; margin-left: 496px;"><div style="box-sizing: border-box; font-size: 0px; text-align: left; max-height: 26px; overflow: hidden;" data-drawio-colors="color: rgb(0, 0, 0); "><div style="display: inline-block; font-size: 12px; font-family: Helvetica; color: rgb(0, 0, 0); line-height: 1.2; pointer-events: all; white-space: normal; overflow-wrap: normal;">NetDevName</div></div></div></foreignObject><text x="496" y="350" fill="rgb(0, 0, 0)" font-family="Helvetica" font-size="12px">NetDevName</text></switch></g></g><g><path d="M 666.37 56 L 799.97 56 L 799.97 136 L 696.37 136" fill="none" stroke="#575757" stroke-miterlimit="10" pointer-events="stroke"/><path d="M 661.12 56 L 668.12 52.5 L 666.37 56 L 668.12 59.5 Z" fill="#575757" stroke="#575757" stroke-miterlimit="10" pointer-events="all"/><path d="M 691.12 136 L 698.12 132.5 L 696.37 136 L 698.12 139.5 Z" fill="#575757" stroke="#575757" stroke-miterlimit="10" pointer-events="all"/></g><g><rect x="490" y="361" width="270" height="30" fill="none" stroke="none" pointer-events="all"/></g><g><g transform="translate(-0.5 -0.5)"><switch><foreignObject style="overflow: visible; text-align: left;" pointer-events="none" width="100%" height="100%" requiredFeatures="http://www.w3.org/TR/SVG11/feature#Extensibility"><div xmlns="http://www.w3.org/1999/xhtml" style="display: flex; align-items: unsafe center; justify-content: unsafe flex-start; width: 260px; height: 1px; padding-top: 376px; margin-left: 496px;"><div style="box-sizing: border-box; font-size: 0px; text-align: left; max-height: 26px; overflow: hidden;" data-drawio-colors="color: rgb(0, 0, 0); "><div style="display: inline-block; font-size: 12px; font-family: Helvetica; color: rgb(0, 0, 0); line-height: 1.2; pointer-events: all; white-space: normal; overflow-wrap: normal;">Layer1Interface</div></div></div></foreignObject><text x="496" y="380" fill="rgb(0, 0, 0)" font-family="Helvetica" font-size="12px">Layer1Interface</text></switch></g></g><g><path d="M 50 166 C 50 157.72 81.34 151 120 151 C 138.57 151 156.37 152.58 169.5 155.39 C 182.63 158.21 190 162.02 190 166 L 190 386 C 190 394.28 158.66 401 120 401 C 81.34 401 50 394.28 50 386 Z" fill="#f5f5f5" stroke="#666666" stroke-miterlimit="10" pointer-events="all"/><path d="M 190 166 C 190 174.28 158.66 181 120 181 C 81.34 181 50 174.28 50 166" fill="none" stroke="#666666" stroke-miterlimit="10" pointer-events="all"/></g><g><path d="M 50 183.5 L 50 153.5 L 190 153.5 L 190 183.5" fill="none" stroke="none" pointer-events="all"/></g><g><g transform="translate(-0.5 -0.5)"><switch><foreignObject style="overflow: visible; text-align: left;" pointer-events="none" width="100%" height="100%" requiredFeatures="http://www.w3.org/TR/SVG11/feature#Extensibility"><div xmlns="http://www.w3.org/1999/xhtml" style="display: flex; align-items: unsafe center; justify-content: unsafe center; width: 138px; height: 1px; padding-top: 168px; margin-left: 51px;"><div style="box-sizing: border-box; font-size: 0px; text-align: center;" data-drawio-colors="color: rgb(0, 0, 0); "><div style="display: inline-block; font-size: 12px; font-family: Helvetica; color: rgb(0, 0, 0); line-height: 1.2; pointer-events: all; white-space: normal; overflow-wrap: normal;"><b>NetModel.Intf.&lt;port&gt;.</b></div></div></div></foreignObject><text x="120" y="172" fill="rgb(0, 0, 0)" font-family="Helvetica" font-size="12px" text-anchor="middle">NetModel.Intf.&lt;port&gt;.</text></switch></g></g><g><rect x="50" y="183.5" width="140" height="30" fill="none" stroke="none" pointer-events="all"/></g><g><g transform="translate(-0.5 -0.5)"><switch><foreignObject style="overflow: visible; text-align: left;" pointer-events="none" width="100%" height="100%" requiredFeatures="http://www.w3.org/TR/SVG11/feature#Extensibility"><div xmlns="http://www.w3.org/1999/xhtml" style="display: flex; align-items: unsafe center; justify-content: unsafe flex-end; width: 130px; height: 1px; padding-top: 198px; margin-left: 54px;"><div style="box-sizing: border-box; font-size: 0px; text-align: right; max-height: 26px; overflow: hidden;" data-drawio-colors="color: rgb(0, 0, 0); "><div style="display: inline-block; font-size: 12px; font-family: Helvetica; color: rgb(0, 0, 0); line-height: 1.2; pointer-events: all; white-space: normal; overflow-wrap: normal;"><b>Query</b> getParameters()</div></div></div></foreignObject><text x="184" y="202" fill="rgb(0, 0, 0)" font-family="Helvetica" font-size="12px" text-anchor="end">Query getParameters()</text></switch></g></g><g><rect x="50" y="213.5" width="140" height="30" fill="none" stroke="none" pointer-events="all"/></g><g><g transform="translate(-0.5 -0.5)"><switch><foreignObject style="overflow: visible; text-align: left;" pointer-events="none" width="100%" height="100%" requiredFeatures="http://www.w3.org/TR/SVG11/feature#Extensibility"><div xmlns="http://www.w3.org/1999/xhtml" style="display: flex; align-items: unsafe center; justify-content: unsafe flex-end; width: 130px; height: 1px; padding-top: 228px; margin-left: 54px;"><div style="box-sizing: border-box; font-size: 0px; text-align: right; max-height: 26px; overflow: hidden;" data-drawio-colors="color: rgb(0, 0, 0); "><div style="display: inline-block; font-size: 12px; font-family: Helvetica; color: rgb(0, 0, 0); line-height: 1.2; pointer-events: all; white-space: normal; overflow-wrap: normal;"><div align="right">Status</div></div></div></div></foreignObject><text x="184" y="232" fill="rgb(0, 0, 0)" font-family="Helvetica" font-size="12px" text-anchor="end">Status</text></switch></g></g><g><rect x="50" y="243.5" width="140" height="30" fill="none" stroke="none" pointer-events="all"/></g><g><g transform="translate(-0.5 -0.5)"><switch><foreignObject style="overflow: visible; text-align: left;" pointer-events="none" width="100%" height="100%" requiredFeatures="http://www.w3.org/TR/SVG11/feature#Extensibility"><div xmlns="http://www.w3.org/1999/xhtml" style="display: flex; align-items: unsafe center; justify-content: unsafe flex-end; width: 130px; height: 1px; padding-top: 258px; margin-left: 54px;"><div style="box-sizing: border-box; font-size: 0px; text-align: right; max-height: 26px; overflow: hidden;" data-drawio-colors="color: rgb(0, 0, 0); "><div style="display: inline-block; font-size: 12px; font-family: Helvetica; color: rgb(0, 0, 0); line-height: 1.2; pointer-events: all; white-space: normal; overflow-wrap: normal;">CurrentBitrate</div></div></div></foreignObject><text x="184" y="262" fill="rgb(0, 0, 0)" font-family="Helvetica" font-size="12px" text-anchor="end">CurrentBitrate</text></switch></g></g><g><rect x="50" y="273.5" width="140" height="30" fill="none" stroke="none" pointer-events="all"/></g><g><g transform="translate(-0.5 -0.5)"><switch><foreignObject style="overflow: visible; text-align: left;" pointer-events="none" width="100%" height="100%" requiredFeatures="http://www.w3.org/TR/SVG11/feature#Extensibility"><div xmlns="http://www.w3.org/1999/xhtml" style="display: flex; align-items: unsafe center; justify-content: unsafe flex-end; width: 130px; height: 1px; padding-top: 288px; margin-left: 54px;"><div style="box-sizing: border-box; font-size: 0px; text-align: right; max-height: 26px; overflow: hidden;" data-drawio-colors="color: rgb(0, 0, 0); "><div style="display: inline-block; font-size: 12px; font-family: Helvetica; color: rgb(0, 0, 0); line-height: 1.2; pointer-events: all; white-space: normal; overflow-wrap: normal;">MaxBitRateEnabled</div></div></div></foreignObject><text x="184" y="292" fill="rgb(0, 0, 0)" font-family="Helvetica" font-size="12px" text-anchor="end">MaxBitRateEnabled</text></switch></g></g><g><rect x="50" y="303.5" width="140" height="30" fill="none" stroke="none" pointer-events="all"/></g><g><g transform="translate(-0.5 -0.5)"><switch><foreignObject style="overflow: visible; text-align: left;" pointer-events="none" width="100%" height="100%" requiredFeatures="http://www.w3.org/TR/SVG11/feature#Extensibility"><div xmlns="http://www.w3.org/1999/xhtml" style="display: flex; align-items: unsafe center; justify-content: unsafe flex-end; width: 130px; height: 1px; padding-top: 318px; margin-left: 54px;"><div style="box-sizing: border-box; font-size: 0px; text-align: right; max-height: 26px; overflow: hidden;" data-drawio-colors="color: rgb(0, 0, 0); "><div style="display: inline-block; font-size: 12px; font-family: Helvetica; color: rgb(0, 0, 0); line-height: 1.2; pointer-events: all; white-space: normal; overflow-wrap: normal;">NetDevIndex</div></div></div></foreignObject><text x="184" y="322" fill="rgb(0, 0, 0)" font-family="Helvetica" font-size="12px" text-anchor="end">NetDevIndex</text></switch></g></g><g><rect x="50" y="333.5" width="140" height="30" fill="none" stroke="none" pointer-events="all"/></g><g><g transform="translate(-0.5 -0.5)"><switch><foreignObject style="overflow: visible; text-align: left;" pointer-events="none" width="100%" height="100%" requiredFeatures="http://www.w3.org/TR/SVG11/feature#Extensibility"><div xmlns="http://www.w3.org/1999/xhtml" style="display: flex; align-items: unsafe center; justify-content: unsafe flex-end; width: 130px; height: 1px; padding-top: 348px; margin-left: 54px;"><div style="box-sizing: border-box; font-size: 0px; text-align: right; max-height: 26px; overflow: hidden;" data-drawio-colors="color: rgb(0, 0, 0); "><div style="display: inline-block; font-size: 12px; font-family: Helvetica; color: rgb(0, 0, 0); line-height: 1.2; pointer-events: all; white-space: normal; overflow-wrap: normal;">NetDevName</div></div></div></foreignObject><text x="184" y="352" fill="rgb(0, 0, 0)" font-family="Helvetica" font-size="12px" text-anchor="end">NetDevName</text></switch></g></g><g><rect x="50" y="363.5" width="140" height="30" fill="none" stroke="none" pointer-events="all"/></g><g><g transform="translate(-0.5 -0.5)"><switch><foreignObject style="overflow: visible; text-align: left;" pointer-events="none" width="100%" height="100%" requiredFeatures="http://www.w3.org/TR/SVG11/feature#Extensibility"><div xmlns="http://www.w3.org/1999/xhtml" style="display: flex; align-items: unsafe center; justify-content: unsafe flex-end; width: 130px; height: 1px; padding-top: 378px; margin-left: 54px;"><div style="box-sizing: border-box; font-size: 0px; text-align: right; max-height: 26px; overflow: hidden;" data-drawio-colors="color: rgb(0, 0, 0); "><div style="display: inline-block; font-size: 12px; font-family: Helvetica; color: rgb(0, 0, 0); line-height: 1.2; pointer-events: all; white-space: normal; overflow-wrap: normal;"><div>InterfacePath</div></div></div></div></foreignObject><text x="184" y="382" fill="rgb(0, 0, 0)" font-family="Helvetica" font-size="12px" text-anchor="end">InterfacePath</text></switch></g></g><g><path d="M 190 110.05 L 338.63 108.56" fill="none" stroke="rgb(0, 0, 0)" stroke-miterlimit="10" pointer-events="stroke"/><path d="M 343.88 108.51 L 336.92 112.08 L 338.63 108.56 L 336.85 105.08 Z" fill="rgb(0, 0, 0)" stroke="rgb(0, 0, 0)" stroke-miterlimit="10" pointer-events="all"/></g><g><path d="M 355 108.39 L 485.25 105.54" fill="none" stroke="rgb(0, 0, 0)" stroke-miterlimit="10" pointer-events="stroke"/><path d="M 490.5 105.42 L 483.58 109.08 L 485.25 105.54 L 483.43 102.08 Z" fill="rgb(0, 0, 0)" stroke="rgb(0, 0, 0)" stroke-miterlimit="10" pointer-events="all"/></g><g><path d="M 355 109 L 483.66 121.87" fill="none" stroke="rgb(0, 0, 0)" stroke-miterlimit="10" pointer-events="stroke"/><path d="M 488.89 122.39 L 481.57 125.17 L 483.66 121.87 L 482.27 118.21 Z" fill="rgb(0, 0, 0)" stroke="rgb(0, 0, 0)" stroke-miterlimit="10" pointer-events="all"/></g><g><path d="M 355 110.55 L 484.11 163.58" fill="none" stroke="rgb(0, 0, 0)" stroke-miterlimit="10" pointer-events="stroke"/><path d="M 488.97 165.58 L 481.16 166.15 L 484.11 163.58 L 483.82 159.68 Z" fill="rgb(0, 0, 0)" stroke="rgb(0, 0, 0)" stroke-miterlimit="10" pointer-events="all"/></g><g><path d="M 355 198.45 L 483.63 197.29" fill="none" stroke="rgb(0, 0, 0)" stroke-miterlimit="10" pointer-events="stroke"/><path d="M 488.88 197.24 L 481.91 200.8 L 483.63 197.29 L 481.85 193.8 Z" fill="rgb(0, 0, 0)" stroke="rgb(0, 0, 0)" stroke-miterlimit="10" pointer-events="all"/></g><g><path d="M 190 198.5 L 338.63 198.5" fill="none" stroke="rgb(0, 0, 0)" stroke-miterlimit="10" pointer-events="stroke"/><path d="M 343.88 198.5 L 336.88 202 L 338.63 198.5 L 336.88 195 Z" fill="rgb(0, 0, 0)" stroke="rgb(0, 0, 0)" stroke-miterlimit="10" pointer-events="all"/></g><g><path d="M 190 228.5 L 338.63 228.5" fill="none" stroke="rgb(0, 0, 0)" stroke-miterlimit="10" pointer-events="stroke"/><path d="M 343.88 228.5 L 336.88 232 L 338.63 228.5 L 336.88 225 Z" fill="rgb(0, 0, 0)" stroke="rgb(0, 0, 0)" stroke-miterlimit="10" pointer-events="all"/></g><g><path d="M 355 228.45 L 483.63 227.29" fill="none" stroke="rgb(0, 0, 0)" stroke-miterlimit="10" pointer-events="stroke"/><path d="M 488.88 227.24 L 481.91 230.8 L 483.63 227.29 L 481.85 223.8 Z" fill="rgb(0, 0, 0)" stroke="rgb(0, 0, 0)" stroke-miterlimit="10" pointer-events="all"/></g><g><path d="M 190 258.5 L 338.63 258.5" fill="none" stroke="rgb(0, 0, 0)" stroke-miterlimit="10" pointer-events="stroke"/><path d="M 343.88 258.5 L 336.88 262 L 338.63 258.5 L 336.88 255 Z" fill="rgb(0, 0, 0)" stroke="rgb(0, 0, 0)" stroke-miterlimit="10" pointer-events="all"/></g><g><path d="M 355 258.45 L 483.63 257.29" fill="none" stroke="rgb(0, 0, 0)" stroke-miterlimit="10" pointer-events="stroke"/><path d="M 488.88 257.24 L 481.91 260.8 L 483.63 257.29 L 481.85 253.8 Z" fill="rgb(0, 0, 0)" stroke="rgb(0, 0, 0)" stroke-miterlimit="10" pointer-events="all"/></g><g><path d="M 190 288.5 L 338.63 288.5" fill="none" stroke="rgb(0, 0, 0)" stroke-miterlimit="10" pointer-events="stroke"/><path d="M 343.88 288.5 L 336.88 292 L 338.63 288.5 L 336.88 285 Z" fill="rgb(0, 0, 0)" stroke="rgb(0, 0, 0)" stroke-miterlimit="10" pointer-events="all"/></g><g><path d="M 355 288.45 L 483.63 287.29" fill="none" stroke="rgb(0, 0, 0)" stroke-miterlimit="10" pointer-events="stroke"/><path d="M 488.88 287.24 L 481.91 290.8 L 483.63 287.29 L 481.85 283.8 Z" fill="rgb(0, 0, 0)" stroke="rgb(0, 0, 0)" stroke-miterlimit="10" pointer-events="all"/></g><g><path d="M 190 318.5 L 338.63 318.5" fill="none" stroke="rgb(0, 0, 0)" stroke-miterlimit="10" pointer-events="stroke"/><path d="M 343.88 318.5 L 336.88 322 L 338.63 318.5 L 336.88 315 Z" fill="rgb(0, 0, 0)" stroke="rgb(0, 0, 0)" stroke-miterlimit="10" pointer-events="all"/></g><g><path d="M 355 318.45 L 483.63 317.29" fill="none" stroke="rgb(0, 0, 0)" stroke-miterlimit="10" pointer-events="stroke"/><path d="M 488.88 317.24 L 481.91 320.8 L 483.63 317.29 L 481.85 313.8 Z" fill="rgb(0, 0, 0)" stroke="rgb(0, 0, 0)" stroke-miterlimit="10" pointer-events="all"/></g><g><path d="M 190 348.5 L 338.63 348.5" fill="none" stroke="rgb(0, 0, 0)" stroke-miterlimit="10" pointer-events="stroke"/><path d="M 343.88 348.5 L 336.88 352 L 338.63 348.5 L 336.88 345 Z" fill="rgb(0, 0, 0)" stroke="rgb(0, 0, 0)" stroke-miterlimit="10" pointer-events="all"/></g><g><path d="M 355 348.45 L 483.63 347.29" fill="none" stroke="rgb(0, 0, 0)" stroke-miterlimit="10" pointer-events="stroke"/><path d="M 488.88 347.24 L 481.91 350.8 L 483.63 347.29 L 481.85 343.8 Z" fill="rgb(0, 0, 0)" stroke="rgb(0, 0, 0)" stroke-miterlimit="10" pointer-events="all"/></g><g><path d="M 190 378.5 L 338.63 378.5" fill="none" stroke="rgb(0, 0, 0)" stroke-miterlimit="10" pointer-events="stroke"/><path d="M 343.88 378.5 L 336.88 382 L 338.63 378.5 L 336.88 375 Z" fill="rgb(0, 0, 0)" stroke="rgb(0, 0, 0)" stroke-miterlimit="10" pointer-events="all"/></g><g><path d="M 355 378.45 L 483.63 377.29" fill="none" stroke="rgb(0, 0, 0)" stroke-miterlimit="10" pointer-events="stroke"/><path d="M 488.88 377.24 L 481.91 380.8 L 483.63 377.29 L 481.85 373.8 Z" fill="rgb(0, 0, 0)" stroke="rgb(0, 0, 0)" stroke-miterlimit="10" pointer-events="all"/></g><g><path d="M 355 106.62 L 484.04 58.24" fill="none" stroke="rgb(0, 0, 0)" stroke-miterlimit="10" pointer-events="stroke"/><path d="M 488.95 56.39 L 483.63 62.13 L 484.04 58.24 L 481.17 55.57 Z" fill="rgb(0, 0, 0)" stroke="rgb(0, 0, 0)" stroke-miterlimit="10" pointer-events="all"/></g></g><switch><g requiredFeatures="http://www.w3.org/TR/SVG11/feature#Extensibility"/><a transform="translate(0,-5)" xlink:href="https://www.drawio.com/doc/faq/svg-export-text-problems" target="_blank"><text text-anchor="middle" font-size="10px" x="50%" y="100%">Text is not SVG - cannot display</text></a></switch></svg>