Сборка системы / System assembly    sudo dnf groupinstall "KDE Plasma Workspaces"

./build_firstrib_rootfs.sh fedora default amd64 f_00_fedora_gui                        / regular build without build logging
./build_firstrib_rootfs.sh fedora default amd64 f_00_fedora_gui 2>&1 | tee build.log   / build with build logging
-----------------------
./FRmake_initrd.sh latest   / Building initrd.gz

./FRextract_kernel.sh      / kernel extraction
-----------------------
упаковка ядра /   kernel packaging

mksquashfs modules-6.5.0-0.rc6 00modules_6.5.0-0.rc6.sfs  -comp xz -b 512k -noappend
-----------------------
упаковка прошивки / firmware packaging

mksquashfs firmware_6.5.0-0.rc6 01firmware_6.5.0-0.rc6.sfs  -comp xz -b 512k -noappend

mksquashfs firmware_6.4.7_arch1-1 01firmware_6.4.7_arch1-1.sfs  -comp xz -b 512k -noappend
-----------------------
Очистка Системы 
открыть новый терминал

./mount_chroot.sh 07firstrib_rootfs

sudo dnf clean all 

./umount_chroot.sh 07firstrib_rootfs 
----------------------
упаковка системы /  packing system

mksquashfs 07firstrib_rootfs 07KL_fedora_xfce.sfs  -comp xz -b 512k -noappend

mksquashfs firstrib_rootfs 07KL_fedora_gnome.sfs  -comp xz -b 512k -noappend 

mksquashfs firstrib_rootfs 07KL_fedora_lxde.sfs  -comp xz -b 512k -noappend   -  LXDE

mksquashfs 07firstrib_rootfs 07KL_klv_Bspwm_1.6.sfs  -comp xz -b 512k -noappend     - BSPWM  / 49205 = 49577 
---------------------------------------------------------------------------------------


mksquashfs 07firstrib_rootfs 07KL_klv_spectrwm_1.0.sfs  -noappend -comp xz -b 512k 


---------------------------------------------------------------------------------------

mksquashfs 07firstrib_rootfs 07KL_klv_sway_CE_1.0.sfs  -noappend -comp xz -b 512k 


---------------------------------------------------------------------------------------
mksquashfs KL_gtkdialogGTK3filemnt64_Bspwm 12KL_gtkdialogGTK3filemnt64_Bspwm.sfs  -comp xz -b 512k 
-----------------------------------------------------------------------------------------------------------------
сжатие roskedge

mksquashfs 07firstrib_rootfs 07KL_klv_Bspwm_1.6.sfs  -b 1048576 -comp xz -Xdict-size 100% -noappend    +++++++++///////

-----------------------
упаковка ISO / ISO packaging   FEDORA-KLF-Rawhide

mkisofs -b boot/isolinux/isolinux.bin -c boot/isolinux/boot.cat -D -l -R -v -V "KLF-Rawhide-CE" -no-emul-boot -boot-load-size 4 -boot-info-table -o "/root/Downloads/KLF-Rawhide-CE-1.3.iso" KLF-Rawhide-CE 

isohybrid KLF-Rawhide-CE-1.3.iso  
                                           ==========================
                                           
mkisofs -b boot/isolinux/isolinux.bin -c boot/isolinux/boot.cat -D -l -R -v -V "KLV-BspwmCE" -no-emul-boot -boot-load-size 4 -boot-info-table -o "/root/Downloads/KLV-BspwmCE-1.5.iso" KLV-BspwmCE 

isohybrid KLV-BspwmCE-1.5.iso                                           
                                          ===========================
                                          
                                          
                                            
mkisofs -b boot/isolinux/isolinux.bin -c boot/isolinux/boot.cat -D -l -R -v -V "KLV-AwesomeCE" -no-emul-boot -boot-load-size 4 -boot-info-table -o "/root/Downloads/KLV-AwesomeCE-1.0.iso" KLV-AwesomeCE 

isohybrid KLV-AwesomeCE-1.0.iso                                                                                    
 
                                          ===========================
mkisofs -b boot/isolinux/isolinux.bin -c boot/isolinux/boot.cat -D -l -R -v -V "Manjaro-LXDE" -no-emul-boot -boot-load-size 4 -boot-info-table -o "/root/Downloads/Manjaro-LXDE-1.1.iso" Manjaro-LXDE 

isohybrid Manjaro-LXDE-1.1.iso 
 
 =======================================================================
 
mkisofs -b boot/isolinux/isolinux.bin -c boot/isolinux/boot.cat -D -l -R -v -V "KLV-Airedale" -no-emul-boot -boot-load-size 4 -boot-info-table -o "/root/Downloads/KLV-Airedale-sr15.iso" KLV-Airedale

isohybrid KLV-Airedale-sr15.iso  
 
 
 =======================================================================
                                            
mkisofs -b boot/isolinux/isolinux.bin -c boot/isolinux/boot.cat -D -l -R -v -V "KLA-Manjaro-Openbox-CE" -no-emul-boot -boot-load-size 4 -boot-info-table -o "/root/Downloads/KLA-Manjaro-Openbox-CE-1.1.iso" KLA-Manjaro-Openbox-CE 

isohybrid KLA-Manjaro-Openbox-CE-1.1.iso  

mksquashfs 07firstrib_rootfs 07KLA-Manjaro.sfs -noappend -comp xz -b 512k
 
mksquashfs KLA-Manjaro-Openbox 10KLA-Manjaro-Openbox.sfs -noappend -comp xz -b 512k
                                 
xbps-install Su squashfs-tools /  mkisofs  /// xbps-install Su syslinux cdrtools - для упаковки в ISO   
                                       
-------------------------------------------==========================
Эти инструкции предназначены для систем на базе Void Linux. Void Linux оказывается одной из, если не самой эффективной операционной системой Linux, доступной в настоящее время.
Здесь описаны следующие шаги:
1. создайте rootfs
2. очистите rootfs, затем сквошьте его до 07rootfs.sfs
3. смонтируйте несжатый файл ./mount_chroot.sh firstrib_rootfs с помощью утилиты mount_chroot.sh

КОД: ВЫБРАТЬ ВСЕ

./mount_chroot.sh firstrib_rootfs
./umount_chroot.sh firstrib_rootfs

4.используя xbps-install -y linux,pacman -S linux -y , / получаем пустое ядро Linux (позже мы сможем рассмотреть, как вместо этого использовать огромное ядро.)
5. используя скрипт сборки initrd, создайте файл initrd.img, который равен initrd.gz и может быть переименован в него.
6. используя скрипт извлечения ядра, создайте vmlinuz

./FRmake_initrd.sh latest   / Building initrd.gz

./FRextract_kernel.sh      / kernel extraction
-----------------------
упаковка ядра /   kernel packaging

mksquashfs modules-6.5.0-0.rc6 00modules_6.5.0-0.rc6.sfs  -comp xz -b 512k -noappend

mksquashfs modules2024_10_02_181708 00modules_6.11.1.sfs  -comp xz -b 512k -noappend
-----------------------
упаковка прошивки / firmware packaging

mksquashfs firmware_6.5.0-0.rc6 01firmware_6.5.0-0.rc6.sfs  -comp xz -b 512k -noappend

mksquashfs firmware_6.4.7_arch1-1 01firmware_6.4.7_arch1-1.sfs  -comp xz -b 512k -noappend

mksquashfs firmware-6.11.1 01firmware-6.11.1.sfs -comp xz -b 512k -noappend
------------------------------------
Удолить ядро
 
sudo dnf remove kernel* 

установить ядро 

sudo dnf install kernel*

Обновление ядра

sudo dnf upgrade 'kernel*'

Проверить установлено ли ядро 

cat /proc/version

Подключение репозеториев
sudo dnf copr enable @kernel-vanilla/mainline-wo-mergew
sudo dnf copr enable @kernel-vanilla/mainline -y
sudo dnf copr enable @kernel-vanilla/next -y

sudo dnf config-manager --set-enabled kernel-vanilla-mainline
sudo dnf update
For the stable kernel branch:
sudo dnf update

sudo dnf config-manager --set-enabled kernel-vanilla-stable

Отключение экспериментальных репозиториев
sudo dnf copr disable @kernel-vanilla/mainline-wo-mergew


удалить ненужные  ядра

sudo dnf --setopt=protected_packages= remove $(rpm -q kernel-core | grep -v $(uname -r))

sudo dnf --setopt=protected_packages= remove $(rpm -q kernel-core | grep -v $(Linux archlinux 5.15.94 -r))



linux-6.4.11.arch2-1-x86_64 

linux-firmware-whence-20230804.7be2766d-2  linux-firmware-20230804.7be2766d-2

printf "%s\n%s\n" y y | pacman -Scc







