/* XPM */
static char *stick_pressed[] = {
/* columns rows colors chars-per-pixel */
"24 24 117 2 ",
"   c #477D49",
".  c #487C4B",
"X  c #4B7F4D",
"o  c #4C7D4E",
"O  c #556E56",
"+  c #556F56",
"@  c #5C655D",
"#  c #5C665D",
"$  c #507352",
"%  c #507452",
"&  c #507552",
"*  c #626262",
"=  c gray40",
"-  c #3A8B3E",
";  c #388D3C",
":  c #388E3C",
">  c #398E3D",
",  c #3A8C3E",
"<  c #3A8F3E",
"1  c #3A903E",
"2  c #3E8742",
"3  c #3C8E40",
"4  c #3D8F41",
"5  c #3F9143",
"6  c #448147",
"7  c #409244",
"8  c #419344",
"9  c #449749",
"0  c #449848",
"q  c #459848",
"w  c #4F9953",
"e  c #509953",
"r  c #569F5A",
"t  c #669B69",
"y  c #79837A",
"u  c #709572",
"i  c #769077",
"p  c #63A166",
"a  c #60AD64",
"s  c #61AE65",
"d  c #62AF65",
"f  c #62AF66",
"g  c #63AF67",
"h  c #67A56A",
"j  c #63B066",
"k  c #6EAC71",
"l  c #73AD76",
"z  c #7AAF7C",
"x  c #6EB871",
"c  c #6EB872",
"v  c #75BD77",
"b  c #74BD78",
"n  c #75BD78",
"m  c #7DC480",
"M  c #7DC481",
"N  c #7EC581",
"B  c #838383",
"V  c #89938A",
"C  c #939393",
"Z  c #919891",
"A  c #9D9D9D",
"S  c #8BA48C",
"D  c #8CA68D",
"F  c #86AB88",
"G  c #85B887",
"H  c #8DB18E",
"J  c #98BD9A",
"K  c #ACACAC",
"L  c #AFAFAF",
"P  c #A9B2A9",
"I  c #ACB6AD",
"U  c #AFB7AF",
"Y  c #B6B6B6",
"T  c gray72",
"R  c #80C683",
"E  c #80C783",
"W  c #81C784",
"Q  c #84C887",
"!  c #84C987",
"~  c #8DCC90",
"^  c #8ECD91",
"/  c #9FC5A1",
"(  c #A8CDAA",
")  c #A9CDAA",
"_  c #AFC9B0",
"`  c #B3CEB4",
"'  c #B9D4BA",
"]  c #B6DFB8",
"[  c #B7DFB9",
"{  c #BBE1BD",
"}  c #BCE1BD",
"|  c #BCE1BE",
" . c #CFD9CF",
".. c #D7D7D7",
"X. c #D5DFD6",
"o. c gray90",
"O. c #E0EBE1",
"+. c #E4EDE4",
"@. c #E5EFE5",
"#. c #E5EFE6",
"$. c gray91",
"%. c gray92",
"&. c #EFEFEF",
"*. c #E3F2E4",
"=. c #E3F3E4",
"-. c #E4F3E4",
";. c #E4F3E5",
":. c #E7F4E8",
">. c #E8F5E8",
",. c #F3F3F3",
"<. c #F8F8F8",
"1. c #F8FCF8",
"2. c #F9FCF9",
"3. c #FAFDFA",
"4. c gray99",
"5. c #FCFEFC",
"6. c white",
/* pixels */
"4.4.4.4.4.4.4.@.( k r 8 8 r k ) #.4.4.4.4.4.4.4.",
"<.<.<.<.<.+.G < : : : : : : : : > l O.<.<.<.<.<.",
",.,.,.,.' 7 : : : : : : : : : : : : 4 _ ,.,.,.,.",
"&.&.&./ < : : : : : : : : : : : : : : > F &.&.&.",
"%.%.` < : : : : q s b M M b s 9 : : : : > D %.%.",
"$.X.7 : : : < g R W W W W W W E f 1 : : : , U $.",
"o.z : : : < x W ! [ -.3.3.-.[ ! W c 1 : : : X ..",
" .< : : : j W ^ >.6.6.6.6.6.6.:.^ W d : : : ; V ",
"J : : : q R ! >.6.6.6.6.6.6.6.6.:.! E q : : : & ",
"h : : : s W [ 6.6.5.{ ~ ^ } 5.6.6.] W s : : : 6 ",
"w : : : n W ;.6.6.} W W W W } 6.6.=.W v : : : 2 ",
"5 : : : N W 2.6.6.~ W W W W ~ 6.6.2.W m : : : , ",
"5 : : : m W 2.6.6.^ W W W W ^ 6.6.1.W m : : : - ",
"e : : : n W ;.6.6.} W W W W | 6.6.=.W v : : : 2 ",
"p : : : s W [ 6.6.5.} ^ ^ } 5.6.6.] W a : : : 6 ",
"H : : : 9 E ! :.6.6.6.6.6.6.6.6.:.Q E 0 : : : $ ",
"I > : : : f W ^ :.6.6.6.6.6.6.:.^ W s : : : > # ",
"T t : : : 1 x W Q ] =.2.2.*.] Q W x < : : : . * ",
"Y P 3 : : : 1 d E W W W W W W E s < : : : - @ B ",
"Y Y S ; : : : : q s v N N v a 0 : : : : > + = L ",
"Y Y Y u > : : : : : : : : : : : : : : > & * A Y ",
"Y Y Y Y i , : : : : : : : : : : : : - O * C Y Y ",
"Y Y Y Y Y Z o > : : : : : : : : >   @ = A Y Y Y ",
"Y Y Y Y Y Y K y & 6 2 , , 2 6 % # * B L Y Y Y Y "
};
