#define max_toggled_width 9
#define max_toggled_height 9
static char max_toggled_bits[] = {
  0xFF, 0x01, 0x07, 0x01, 0x77, 0x01, 0x43, 0x01, 0x5B, 0x01, 0x1B, 0x01, 
  0xC3, 0x01, 0xFF, 0x01, 0xFF, 0x01, };
