#define close_hover_width 9
#define close_hover_height 9
static char close_hover_bits[] = {
  0xFF, 0x01, 0x7D, 0x01, 0xBB, 0x01, 0xFF, 0x01, 0xEF, 0x01, 0xFF, 0x01, 
  0xBB, 0x01, 0x7D, 0x01, 0xFF, 0x01, };
