#define close_width 10
#define close_height 10
static char close_bits[] = {
  0x00, 0x00, 0x00, 0x00, 0x84, 0x00, 0x48, 0x00, 0x10, 0x00, 0x20, 0x00, 
  0x48, 0x00, 0x84, 0x00, 0x00, 0x00, 0x00, 0x00, };
