#define max_disabled_width 10
#define max_disabled_height 10
static char max_disabled_bits[] = {
  0x00, 0x00, 0x00, 0x00, 0x00, 0x00, 0x38, 0x00, 0x44, 0x00, 0x44, 0x00, 
  0x44, 0x00, 0x38, 0x00, 0x00, 0x00, 0x00, 0x00, };
