#define desk_pressed_width 9
#define desk_pressed_height 9
static char desk_pressed_bits[] = {
  0xFF, 0x01, 0x39, 0x01, 0x39, 0x01, 0xFF, 0x01, 0xFF, 0x01, 0xFF, 0x01, 
  0x39, 0x01, 0x39, 0x01, 0xFF, 0x01, };
