#define max_disabled_width 9
#define max_disabled_height 9
static char max_disabled_bits[] = {
  0xFF, 0x01, 0xFF, 0x01, 0xC7, 0x01, 0xBB, 0x01, 0xBB, 0x01, 0xBB, 0x01, 
  0xC7, 0x01, 0xFF, 0x01, 0xFF, 0x01, };
