#define desk_toggled_hover_width 9
#define desk_toggled_hover_height 9
static char desk_toggled_hover_bits[] = {
  0xFF, 0x01, 0xFF, 0x01, 0xFF, 0x01, 0xC7, 0x01, 0xC7, 0x01, 0xC7, 0x01, 
  0xFF, 0x01, 0xFF, 0x01, 0xFF, 0x01, };
