module gitlab.com/socialspecters.io/go-specters

go 1.22

require (
	berty.tech/go-orbit-db v1.22.1
	github.com/ipfs/boxo v0.18.0
	github.com/ipfs/go-log/v2 v2.5.1
	github.com/ipfs/kubo v0.27.0
	github.com/libp2p/go-libp2p v0.33.0
	github.com/multiformats/go-multiaddr v0.12.2
	github.com/namsral/flag v1.7.4-pre
	github.com/stretchr/testify v1.8.4
	go.uber.org/zap v1.27.0
)

require (
	bazil.org/fuse v0.0.0-20200117225306-7b5117fecadc // indirect
	berty.tech/go-ipfs-log v1.10.2 // indirect
	github.com/AndreasBriese/bbloom v0.0.0-20190825152654-46b345b51c96 // indirect
	github.com/Jorropo/jsync v1.0.1 // indirect
	github.com/alecthomas/units v0.0.0-20231202071711-9a357b53e9c9 // indirect
	github.com/alexbrainman/goissue34681 v0.0.0-20191006012335-3fc7a47baff5 // indirect
	github.com/benbjohnson/clock v1.3.5 // indirect
	github.com/beorn7/perks v1.0.1 // indirect
	github.com/blang/semver/v4 v4.0.0 // indirect
	github.com/btcsuite/btcd v0.22.1 // indirect
	github.com/cenkalti/backoff/v4 v4.2.1 // indirect
	github.com/ceramicnetwork/go-dag-jose v0.1.0 // indirect
	github.com/cespare/xxhash v1.1.0 // indirect
	github.com/cespare/xxhash/v2 v2.2.0 // indirect
	github.com/containerd/cgroups v1.1.0 // indirect
	github.com/coreos/go-systemd/v22 v22.5.0 // indirect
	github.com/crackcomm/go-gitignore v0.0.0-20231225121904-e25f5bc08668 // indirect
	github.com/cskr/pubsub v1.0.2 // indirect
	github.com/davecgh/go-spew v1.1.1 // indirect
	github.com/davidlazar/go-crypto v0.0.0-20200604182044-b73af7476f6c // indirect
	github.com/decred/dcrd/dcrec/secp256k1/v4 v4.2.0 // indirect
	github.com/dgraph-io/badger v1.6.2 // indirect
	github.com/dgraph-io/ristretto v0.0.3 // indirect
	github.com/docker/go-units v0.5.0 // indirect
	github.com/dustin/go-humanize v1.0.1 // indirect
	github.com/elastic/gosigar v0.14.2 // indirect
	github.com/facebookgo/atomicfile v0.0.0-20151019160806-2de1f203e7d5 // indirect
	github.com/flynn/noise v1.1.0 // indirect
	github.com/francoispqt/gojay v1.2.13 // indirect
	github.com/fsnotify/fsnotify v1.6.0 // indirect
	github.com/gabriel-vasile/mimetype v1.4.3 // indirect
	github.com/go-logr/logr v1.4.1 // indirect
	github.com/go-logr/stdr v1.2.2 // indirect
	github.com/go-task/slim-sprig v0.0.0-20230315185526-52ccab3ef572 // indirect
	github.com/godbus/dbus/v5 v5.1.0 // indirect
	github.com/gogo/protobuf v1.3.2 // indirect
	github.com/golang/protobuf v1.5.3 // indirect
	github.com/golang/snappy v0.0.4 // indirect
	github.com/google/gopacket v1.1.19 // indirect
	github.com/google/pprof v0.0.0-20240207164012-fb44976bdcd5 // indirect
	github.com/google/uuid v1.5.0 // indirect
	github.com/gorilla/websocket v1.5.1 // indirect
	github.com/grpc-ecosystem/grpc-gateway/v2 v2.19.0 // indirect
	github.com/hashicorp/errwrap v1.1.0 // indirect
	github.com/hashicorp/go-multierror v1.1.1 // indirect
	github.com/hashicorp/golang-lru v1.0.2 // indirect
	github.com/hashicorp/golang-lru/v2 v2.0.7 // indirect
	github.com/huin/goupnp v1.3.0 // indirect
	github.com/ipfs-shipyard/nopfs v0.0.12 // indirect
	github.com/ipfs-shipyard/nopfs/ipfs v0.13.2-0.20231027223058-cde3b5ba964c // indirect
	github.com/ipfs/bbloom v0.0.4 // indirect
	github.com/ipfs/go-bitfield v1.1.0 // indirect
	github.com/ipfs/go-block-format v0.2.0 // indirect
	github.com/ipfs/go-cid v0.4.1 // indirect
	github.com/ipfs/go-cidutil v0.1.0 // indirect
	github.com/ipfs/go-datastore v0.6.0 // indirect
	github.com/ipfs/go-ds-badger v0.3.0 // indirect
	github.com/ipfs/go-ds-flatfs v0.5.1 // indirect
	github.com/ipfs/go-ds-leveldb v0.5.0 // indirect
	github.com/ipfs/go-ds-measure v0.2.0 // indirect
	github.com/ipfs/go-fs-lock v0.0.7 // indirect
	github.com/ipfs/go-ipfs-delay v0.0.1 // indirect
	github.com/ipfs/go-ipfs-ds-help v1.1.0 // indirect
	github.com/ipfs/go-ipfs-pq v0.0.3 // indirect
	github.com/ipfs/go-ipfs-redirects-file v0.1.1 // indirect
	github.com/ipfs/go-ipfs-util v0.0.3 // indirect
	github.com/ipfs/go-ipld-cbor v0.1.0 // indirect
	github.com/ipfs/go-ipld-format v0.6.0 // indirect
	github.com/ipfs/go-ipld-git v0.1.1 // indirect
	github.com/ipfs/go-ipld-legacy v0.2.1 // indirect
	github.com/ipfs/go-libipfs v0.6.2 // indirect
	github.com/ipfs/go-log v1.0.5 // indirect
	github.com/ipfs/go-metrics-interface v0.0.1 // indirect
	github.com/ipfs/go-peertaskqueue v0.8.1 // indirect
	github.com/ipfs/go-unixfsnode v1.9.0 // indirect
	github.com/ipld/go-car/v2 v2.13.1 // indirect
	github.com/ipld/go-codec-dagpb v1.6.0 // indirect
	github.com/ipld/go-ipld-prime v0.21.0 // indirect
	github.com/jackpal/go-nat-pmp v1.0.2 // indirect
	github.com/jbenet/go-temp-err-catcher v0.1.0 // indirect
	github.com/jbenet/goprocess v0.1.4 // indirect
	github.com/klauspost/compress v1.17.6 // indirect
	github.com/klauspost/cpuid/v2 v2.2.7 // indirect
	github.com/koron/go-ssdp v0.0.4 // indirect
	github.com/libp2p/go-buffer-pool v0.1.0 // indirect
	github.com/libp2p/go-cidranger v1.1.0 // indirect
	github.com/libp2p/go-doh-resolver v0.4.0 // indirect
	github.com/libp2p/go-flow-metrics v0.1.0 // indirect
	github.com/libp2p/go-libp2p-asn-util v0.4.1 // indirect
	github.com/libp2p/go-libp2p-kad-dht v0.24.4 // indirect
	github.com/libp2p/go-libp2p-kbucket v0.6.3 // indirect
	github.com/libp2p/go-libp2p-pubsub v0.10.0 // indirect
	github.com/libp2p/go-libp2p-pubsub-router v0.6.0 // indirect
	github.com/libp2p/go-libp2p-record v0.2.0 // indirect
	github.com/libp2p/go-libp2p-routing-helpers v0.7.3 // indirect
	github.com/libp2p/go-libp2p-xor v0.1.0 // indirect
	github.com/libp2p/go-msgio v0.3.0 // indirect
	github.com/libp2p/go-nat v0.2.0 // indirect
	github.com/libp2p/go-netroute v0.2.1 // indirect
	github.com/libp2p/go-reuseport v0.4.0 // indirect
	github.com/libp2p/go-yamux/v4 v4.0.1 // indirect
	github.com/libp2p/zeroconf/v2 v2.2.0 // indirect
	github.com/marten-seemann/tcp v0.0.0-20210406111302-dfbc87cc63fd // indirect
	github.com/mattn/go-isatty v0.0.20 // indirect
	github.com/miekg/dns v1.1.58 // indirect
	github.com/mikioh/tcpinfo v0.0.0-20190314235526-30a79bb1804b // indirect
	github.com/mikioh/tcpopt v0.0.0-20190314235656-172688c1accc // indirect
	github.com/minio/sha256-simd v1.0.1 // indirect
	github.com/mitchellh/go-homedir v1.1.0 // indirect
	github.com/mr-tron/base58 v1.2.0 // indirect
	github.com/multiformats/go-base32 v0.1.0 // indirect
	github.com/multiformats/go-base36 v0.2.0 // indirect
	github.com/multiformats/go-multiaddr-dns v0.3.1 // indirect
	github.com/multiformats/go-multiaddr-fmt v0.1.0 // indirect
	github.com/multiformats/go-multibase v0.2.0 // indirect
	github.com/multiformats/go-multicodec v0.9.0 // indirect
	github.com/multiformats/go-multihash v0.2.3 // indirect
	github.com/multiformats/go-multistream v0.5.0 // indirect
	github.com/multiformats/go-varint v0.0.7 // indirect
	github.com/onsi/ginkgo/v2 v2.15.0 // indirect
	github.com/opencontainers/runtime-spec v1.2.0 // indirect
	github.com/opentracing/opentracing-go v1.2.0 // indirect
	github.com/openzipkin/zipkin-go v0.4.2 // indirect
	github.com/pbnjay/memory v0.0.0-20210728143218-7b4eea64cf58 // indirect
	github.com/petar/GoLLRB v0.0.0-20210522233825-ae3b015fd3e9 // indirect
	github.com/pion/datachannel v1.5.5 // indirect
	github.com/pion/dtls/v2 v2.2.8 // indirect
	github.com/pion/ice/v2 v2.3.11 // indirect
	github.com/pion/interceptor v0.1.25 // indirect
	github.com/pion/logging v0.2.2 // indirect
	github.com/pion/mdns v0.0.9 // indirect
	github.com/pion/randutil v0.1.0 // indirect
	github.com/pion/rtcp v1.2.13 // indirect
	github.com/pion/rtp v1.8.3 // indirect
	github.com/pion/sctp v1.8.9 // indirect
	github.com/pion/sdp/v3 v3.0.6 // indirect
	github.com/pion/srtp/v2 v2.0.18 // indirect
	github.com/pion/stun v0.6.1 // indirect
	github.com/pion/transport/v2 v2.2.4 // indirect
	github.com/pion/turn/v2 v2.1.4 // indirect
	github.com/pion/webrtc/v3 v3.2.23 // indirect
	github.com/pkg/errors v0.9.1 // indirect
	github.com/pmezard/go-difflib v1.0.0 // indirect
	github.com/polydawn/refmt v0.89.0 // indirect
	github.com/prometheus/client_golang v1.18.0 // indirect
	github.com/prometheus/client_model v0.6.0 // indirect
	github.com/prometheus/common v0.47.0 // indirect
	github.com/prometheus/procfs v0.12.0 // indirect
	github.com/quic-go/qpack v0.4.0 // indirect
	github.com/quic-go/quic-go v0.41.0 // indirect
	github.com/quic-go/webtransport-go v0.6.0 // indirect
	github.com/raulk/go-watchdog v1.3.0 // indirect
	github.com/samber/lo v1.39.0 // indirect
	github.com/spaolacci/murmur3 v1.1.0 // indirect
	github.com/syndtr/goleveldb v1.0.1-0.20210819022825-2ae1ddf74ef7 // indirect
	github.com/ucarion/urlpath v0.0.0-20200424170820-7ccc79b76bbb // indirect
	github.com/whyrusleeping/base32 v0.0.0-20170828182744-c30ac30633cc // indirect
	github.com/whyrusleeping/cbor v0.0.0-20171005072247-63513f603b11 // indirect
	github.com/whyrusleeping/cbor-gen v0.0.0-20240109153615-66e95c3e8a87 // indirect
	github.com/whyrusleeping/chunker v0.0.0-20181014151217-fe64bd25879f // indirect
	github.com/whyrusleeping/go-keyspace v0.0.0-20160322163242-5b898ac5add1 // indirect
	github.com/whyrusleeping/multiaddr-filter v0.0.0-20160516205228-e903e4adabd7 // indirect
	go.opencensus.io v0.24.0 // indirect
	go.opentelemetry.io/otel v1.22.0 // indirect
	go.opentelemetry.io/otel/exporters/otlp/otlptrace v1.21.0 // indirect
	go.opentelemetry.io/otel/exporters/otlp/otlptrace/otlptracegrpc v1.21.0 // indirect
	go.opentelemetry.io/otel/exporters/otlp/otlptrace/otlptracehttp v1.21.0 // indirect
	go.opentelemetry.io/otel/exporters/stdout/stdouttrace v1.21.0 // indirect
	go.opentelemetry.io/otel/exporters/zipkin v1.21.0 // indirect
	go.opentelemetry.io/otel/metric v1.22.0 // indirect
	go.opentelemetry.io/otel/sdk v1.21.0 // indirect
	go.opentelemetry.io/otel/trace v1.22.0 // indirect
	go.opentelemetry.io/proto/otlp v1.0.0 // indirect
	go.uber.org/dig v1.17.1 // indirect
	go.uber.org/fx v1.20.1 // indirect
	go.uber.org/mock v0.4.0 // indirect
	go.uber.org/multierr v1.11.0 // indirect
	go4.org v0.0.0-20230225012048-214862532bf5 // indirect
	golang.org/x/crypto v0.19.0 // indirect
	golang.org/x/exp v0.0.0-20240213143201-ec583247a57a // indirect
	golang.org/x/mod v0.15.0 // indirect
	golang.org/x/net v0.21.0 // indirect
	golang.org/x/sync v0.6.0 // indirect
	golang.org/x/sys v0.17.0 // indirect
	golang.org/x/text v0.14.0 // indirect
	golang.org/x/tools v0.18.0 // indirect
	golang.org/x/xerrors v0.0.0-20231012003039-104605ab7028 // indirect
	gonum.org/v1/gonum v0.14.0 // indirect
	google.golang.org/genproto/googleapis/api v0.0.0-20240108191215-35c7eff3a6b1 // indirect
	google.golang.org/genproto/googleapis/rpc v0.0.0-20240108191215-35c7eff3a6b1 // indirect
	google.golang.org/grpc v1.60.1 // indirect
	google.golang.org/protobuf v1.32.0 // indirect
	gopkg.in/square/go-jose.v2 v2.6.0 // indirect
	gopkg.in/yaml.v3 v3.0.1 // indirect
	lukechampine.com/blake3 v1.2.1 // indirect
)
