[gd_scene load_steps=6 format=3 uid="uid://beskpe441ym2i"]

[ext_resource type="Script" path="res://_scripts/BulletController.cs" id="1_p4udv"]
[ext_resource type="Texture2D" uid="uid://baphufsa44skg" path="res://assets/orange_lbl.png" id="2_nfguw"]

[sub_resource type="CapsuleShape3D" id="CapsuleShape3D_37qnd"]

[sub_resource type="StandardMaterial3D" id="StandardMaterial3D_ly8l4"]
albedo_texture = ExtResource("2_nfguw")

[sub_resource type="CapsuleMesh" id="CapsuleMesh_kexp1"]

[node name="Bullet" type="Area3D"]
script = ExtResource("1_p4udv")

[node name="CollisionShape3D" type="CollisionShape3D" parent="."]
transform = Transform3D(0.2, 0, 0, 0, -8.74228e-09, -0.2, 0, 0.2, -8.74228e-09, 0, 0, 0)
shape = SubResource("CapsuleShape3D_37qnd")

[node name="MeshInstance3D" type="MeshInstance3D" parent="."]
transform = Transform3D(0.2, 0, 0, 0, -8.74228e-09, -0.2, 0, 0.2, -8.74228e-09, 0, 0, 0)
material_override = SubResource("StandardMaterial3D_ly8l4")
mesh = SubResource("CapsuleMesh_kexp1")
