-----BEGIN PGP SIGNATURE-----
Version: GnuPG v2

iF4EABEIAAYFAlYGb5EACgkQNPa42FI0o0jFZgD8CeanvRXLSUnj3eWdmUl7vN6b
Cugk+x1p3gaNKJTncmsA/2+ikfP+GNg1wM99yNi099jcmFeM4gnVEjItj7+pkfcx
=CRZz
-----END PGP SIGNATURE-----
