USER_ID,ITEM_ID,EVENT_TYPE,EVENT_VALUE,TIMESTAMP
1,1,rating,9,1561176379
1,2,rating,10,1561176392
1,3,rating,10,1561176398
1,4,rating,9,1561176401
1,5,rating,1,1561176405
1,6,rating,10,1561176409
1,7,rating,3,1561176413
1,8,rating,4,1561176520
1,9,rating,2,1561176627
1,10,rating,2,1561176734
1,11,rating,2,1561176841
1,12,rating,4,1561176948
1,13,rating,7,1561177055
1,14,rating,8,1561177162
1,15,rating,5,1561177269
1,16,rating,5,1561177376
1,17,rating,2,1561177483
1,18,rating,2,1561177590
1,19,rating,1,1561177697
1,20,rating,1,1561177804
1,21,rating,1,1561177911
1,22,rating,1,1561178018
1,23,rating,4,1561178125
1,24,rating,4,1561178232
1,25,rating,4,1561178339
1,26,rating,5,1561178446
1,27,rating,4,1561178553
1,28,rating,8,1561178660
1,29,rating,3,1561178767
1,30,rating,8,1561178874
1,31,rating,1,1561178981
1,32,rating,3,1561179088
1,33,rating,1,1561179195
1,34,rating,1,1561179302
1,35,rating,1,1561179409
1,36,rating,1,1561179516
1,37,rating,2,1561179623
1,38,rating,3,1561179730
1,39,rating,3,1561179837
1,40,rating,3,1561179944
1,41,rating,2,1561180051
1,42,rating,2,1561180158
1,43,rating,3,1561180265
1,44,rating,2,1561180372
1,45,rating,5,1561180479
1,46,rating,2,1561180586
1,47,rating,3,1561180693
1,48,rating,3,1561180800
1,49,rating,3,1561180907
1,50,rating,4,1561181014
1,51,rating,9,1561181121
1,52,rating,1,1561181228
1,53,rating,1,1561181335
1,54,rating,7,1561181442
1,55,rating,1,1561181549
1,56,rating,1,1561181656
1,57,rating,2,1561181763
1,58,rating,1,1561181870
1,59,rating,1,1561181977
1,60,rating,1,1561182084
1,61,rating,1,1561182191
1,62,rating,9,1561182298
1,63,rating,1,1561182405
1,64,rating,1,1561182512
1,65,rating,1,1561182619
1,66,rating,1,1561182726
1,67,rating,1,1561182833
1,68,rating,1,1561182940
1,69,rating,1,1561183047
1,70,rating,1,1561183154
1,71,rating,1,1561183261
1,72,rating,1,1561183368
1,73,rating,6,1561183475
1,74,rating,1,1561183582
1,75,rating,1,1561183689
1,76,rating,1,1561183796
1,77,rating,4,1561183903
1,78,rating,2,1561184010
1,79,rating,7,1561184117
1,80,rating,4,1561184224
1,81,rating,4,1561184331
1,82,rating,5,1561184438
1,83,rating,1,1561184545
1,84,rating,9,1561184652
2,1,rating,5,1561184759
2,2,rating,9,1561184866
2,3,rating,9,1561184973
2,4,rating,9,1561185080
2,5,rating,1,1561185187
2,6,rating,5,1561185294
2,7,rating,1,1561185401
2,8,rating,1,1561185508
2,9,rating,9,1561185615
2,10,rating,9,1561185722
2,11,rating,9,1561185829
2,12,rating,9,1561185936
2,13,rating,1,1561186043
2,14,rating,7,1561186150
2,15,rating,1,1561186257
2,16,rating,1,1561186364
2,17,rating,9,1561186471
2,18,rating,1,1561186578
2,19,rating,1,1561186685
2,20,rating,1,1561186792
2,21,rating,9,1561186899
2,22,rating,1,1561187006
2,23,rating,1,1561187113
2,24,rating,9,1561187220
2,25,rating,9,1561187327
2,26,rating,9,1561187434
2,27,rating,1,1561187541
2,28,rating,4,1561187648
2,29,rating,9,1561187755
2,30,rating,7,1561187862
2,31,rating,1,1561187969
2,32,rating,9,1561188076
2,33,rating,9,1561188183
2,34,rating,9,1561188290
2,35,rating,9,1561188397
2,36,rating,1,1561188504
2,37,rating,1,1561188611
2,38,rating,9,1561188718
2,39,rating,1,1561188825
2,40,rating,9,1561188932
2,41,rating,9,1561189039
2,42,rating,1,1561189146
2,43,rating,1,1561189253
2,44,rating,9,1561189360
2,45,rating,9,1561189467
2,46,rating,1,1561189574
2,47,rating,1,1561189681
2,48,rating,1,1561189788
2,49,rating,1,1561189895
2,50,rating,9,1561190002
2,51,rating,1,1561190109
2,52,rating,9,1561190216
2,53,rating,9,1561190323
2,54,rating,9,1561190430
2,55,rating,9,1561190537
2,56,rating,1,1561190644
2,57,rating,9,1561190751
2,58,rating,9,1561190858
2,59,rating,9,1561190965
2,60,rating,9,1561191072
2,61,rating,9,1561191179
2,62,rating,9,1561191286
2,63,rating,5,1561191393
2,64,rating,9,1561191500
2,65,rating,1,1561191607
2,66,rating,9,1561191714
2,67,rating,9,1561191821
2,68,rating,9,1561191928
2,69,rating,9,1561192035
2,70,rating,9,1561192142
2,71,rating,9,1561192249
2,72,rating,7,1561192356
2,73,rating,7,1561192463
2,74,rating,9,1561192570
2,75,rating,9,1561192677
2,76,rating,1,1561192784
2,77,rating,9,1561192891
2,78,rating,1,1561192998
2,79,rating,9,1561193105
2,80,rating,1,1561193212
2,81,rating,1,1561193319
2,82,rating,1,1561193426
2,83,rating,9,1561193533
2,84,rating,9,1561193640
3,1,rating,7,1561193747
3,2,rating,7,1561193854
3,3,rating,7,1561193961
3,4,rating,5,1561194068
3,5,rating,8,1561194175
3,6,rating,7,1561194282
3,7,rating,9,1561194389
3,8,rating,9,1561194496
3,9,rating,5,1561194603
3,10,rating,5,1561194710
3,11,rating,5,1561194817
3,12,rating,5,1561194924
3,13,rating,8,1561195031
3,14,rating,2,1561195138
3,15,rating,9,1561195245
3,16,rating,9,1561195352
3,17,rating,5,1561195459
3,18,rating,9,1561195566
3,19,rating,9,1561195673
3,20,rating,9,1561195780
3,21,rating,5,1561195887
3,22,rating,8,1561195994
3,23,rating,8,1561196101
3,24,rating,5,1561196208
3,25,rating,5,1561196315
3,26,rating,5,1561196422
3,27,rating,8,1561196529
3,28,rating,2,1561196636
3,29,rating,5,1561196743
3,30,rating,2,1561196850
3,31,rating,9,1561196957
3,32,rating,5,1561197064
3,33,rating,5,1561197171
3,34,rating,5,1561197278
3,35,rating,5,1561197385
3,36,rating,8,1561197492
3,37,rating,8,1561197599
3,38,rating,5,1561197706
3,39,rating,9,1561197813
3,40,rating,5,1561197920
3,41,rating,5,1561198027
3,42,rating,9,1561198134
3,43,rating,8,1561198241
3,44,rating,5,1561198348
3,45,rating,5,1561198455
3,46,rating,9,1561198562
3,47,rating,8,1561198669
3,48,rating,9,1561198776
3,49,rating,9,1561198883
3,50,rating,5,1561198990
3,51,rating,9,1561199097
3,52,rating,5,1561199204
3,53,rating,5,1561199311
3,54,rating,5,1561199418
3,55,rating,5,1561199525
3,56,rating,8,1561199632
3,57,rating,5,1561199739
3,58,rating,5,1561199846
3,59,rating,5,1561199953
3,60,rating,5,1561200060
3,61,rating,5,1561200167
3,62,rating,5,1561200274
3,63,rating,7,1561200381
3,64,rating,5,1561200488
3,65,rating,9,1561200595
3,66,rating,5,1561200702
3,67,rating,5,1561200809
3,68,rating,5,1561200916
3,69,rating,5,1561201023
3,70,rating,5,1561201130
3,71,rating,5,1561201237
3,72,rating,2,1561201344
3,73,rating,2,1561201451
3,74,rating,5,1561201558
3,75,rating,5,1561201665
3,76,rating,8,1561201772
3,77,rating,5,1561201879
3,78,rating,8,1561201986
3,79,rating,5,1561202093
3,80,rating,9,1561202200
3,81,rating,8,1561202307
3,82,rating,8,1561202414
3,83,rating,5,1561202521
3,84,rating,5,1561202628
4,1,rating,1,1561202735
4,2,rating,9,1561202842
4,3,rating,9,1561202949
4,4,rating,9,1561203056
4,5,rating,1,1561203163
4,6,rating,1,1561203270
4,7,rating,5,1561203377
4,8,rating,5,1561203484
4,9,rating,9,1561203591
4,10,rating,9,1561203698
4,11,rating,9,1561203805
4,12,rating,9,1561203912
4,13,rating,1,1561204019
4,14,rating,6,1561204126
4,15,rating,5,1561204233
4,16,rating,5,1561204340
4,17,rating,9,1561204447
4,18,rating,5,1561204554
4,19,rating,5,1561204661
4,20,rating,5,1561204768
4,21,rating,9,1561204875
4,22,rating,1,1561204982
4,23,rating,1,1561205089
4,24,rating,9,1561205196
4,25,rating,9,1561205303
4,26,rating,9,1561205410
4,27,rating,1,1561205517
4,28,rating,4,1561205624
4,29,rating,9,1561205731
4,30,rating,6,1561205838
4,31,rating,5,1561205945
4,32,rating,9,1561206052
4,33,rating,9,1561206159
4,34,rating,9,1561206266
4,35,rating,9,1561206373
4,36,rating,1,1561206480
4,37,rating,1,1561206587
4,38,rating,9,1561206694
4,39,rating,5,1561206801
4,40,rating,9,1561206908
4,41,rating,9,1561207015
4,42,rating,5,1561207122
4,43,rating,1,1561207229
4,44,rating,9,1561207336
4,45,rating,9,1561207443
4,46,rating,5,1561207550
4,47,rating,1,1561207657
4,48,rating,5,1561207764
4,49,rating,5,1561207871
4,50,rating,9,1561207978
4,51,rating,5,1561208085
4,52,rating,9,1561208192
4,53,rating,9,1561208299
4,54,rating,9,1561208406
4,55,rating,9,1561208513
4,56,rating,1,1561208620
4,57,rating,9,1561208727
4,58,rating,9,1561208834
4,59,rating,9,1561208941
4,60,rating,9,1561209048
4,61,rating,9,1561209155
4,62,rating,9,1561209262
4,63,rating,1,1561209369
4,64,rating,9,1561209476
4,65,rating,5,1561209583
4,66,rating,9,1561209690
4,67,rating,9,1561209797
4,68,rating,9,1561209904
4,69,rating,9,1561210011
4,70,rating,9,1561210118
4,71,rating,9,1561210225
4,72,rating,6,1561210332
4,73,rating,6,1561210439
4,74,rating,9,1561210546
4,75,rating,9,1561210653
4,76,rating,1,1561210760
4,77,rating,9,1561210867
4,78,rating,1,1561210974
4,79,rating,9,1561211081
4,80,rating,5,1561211188
4,81,rating,1,1561211295
4,82,rating,1,1561211402
4,83,rating,9,1561211509
4,84,rating,9,1561211616
5,1,rating,6,1561211723
5,2,rating,7,1561211830
5,3,rating,7,1561211937
5,4,rating,6,1561212044
5,5,rating,5,1561212151
5,6,rating,6,1561212258
5,7,rating,6,1561212365
5,8,rating,6,1561212472
5,9,rating,6,1561212579
5,10,rating,6,1561212686
5,11,rating,6,1561212793
5,12,rating,6,1561212900
5,13,rating,5,1561213007
5,14,rating,5,1561213114
5,15,rating,6,1561213221
5,16,rating,6,1561213328
5,17,rating,6,1561213435
5,18,rating,6,1561213542
5,19,rating,6,1561213649
5,20,rating,6,1561213756
5,21,rating,6,1561213863
5,22,rating,5,1561213970
5,23,rating,5,1561214077
5,24,rating,6,1561214184
5,25,rating,6,1561214291
5,26,rating,6,1561214398
5,27,rating,5,1561214505
5,28,rating,5,1561214612
5,29,rating,6,1561214719
5,30,rating,5,1561214826
5,31,rating,6,1561214933
5,32,rating,6,1561215040
5,33,rating,6,1561215147
5,34,rating,6,1561215254
5,35,rating,6,1561215361
5,36,rating,5,1561215468
5,37,rating,5,1561215575
5,38,rating,6,1561215682
5,39,rating,6,1561215789
5,40,rating,6,1561215896
5,41,rating,6,1561216003
5,42,rating,6,1561216110
5,43,rating,5,1561216217
5,44,rating,6,1561216324
5,45,rating,6,1561216431
5,46,rating,6,1561216538
5,47,rating,5,1561216645
5,48,rating,6,1561216752
5,49,rating,6,1561216859
5,50,rating,6,1561216966
5,51,rating,6,1561217073
5,52,rating,6,1561217180
5,53,rating,6,1561217287
5,54,rating,6,1561217394
5,55,rating,6,1561217501
5,56,rating,5,1561217608
5,57,rating,6,1561217715
5,58,rating,6,1561217822
5,59,rating,6,1561217929
5,60,rating,6,1561218036
5,61,rating,6,1561218143
5,62,rating,6,1561218250
5,63,rating,6,1561218357
5,64,rating,6,1561218464
5,65,rating,6,1561218571
5,66,rating,6,1561218678
5,67,rating,6,1561218785
5,68,rating,6,1561218892
5,69,rating,6,1561218999
5,70,rating,6,1561219106
5,71,rating,6,1561219213
5,72,rating,5,1561219320
5,73,rating,5,1561219427
5,74,rating,6,1561219534
5,75,rating,6,1561219641
5,76,rating,5,1561219748
5,77,rating,6,1561219855
5,78,rating,5,1561219962
5,79,rating,6,1561220069
5,80,rating,6,1561220176
5,81,rating,5,1561220283
5,82,rating,5,1561220390
5,83,rating,6,1561220497
5,84,rating,6,1561220604
6,1,rating,5,1561220711
6,2,rating,5,1561220818
6,3,rating,5,1561220925
6,4,rating,5,1561221032
6,5,rating,5,1561221139
6,6,rating,5,1561221246
6,7,rating,5,1561221353
6,8,rating,5,1561221460
6,9,rating,5,1561221567
6,10,rating,5,1561221674
6,11,rating,5,1561221781
6,12,rating,5,1561221888
6,13,rating,5,1561221995
6,14,rating,5,1561222102
6,15,rating,5,1561222209
6,16,rating,5,1561222316
6,17,rating,5,1561222423
6,18,rating,5,1561222530
6,19,rating,5,1561222637
6,20,rating,5,1561222744
6,21,rating,5,1561222851
6,22,rating,5,1561222958
6,23,rating,5,1561223065
6,24,rating,5,1561223172
6,25,rating,5,1561223279
6,26,rating,5,1561223386
6,27,rating,5,1561223493
6,28,rating,5,1561223600
6,29,rating,5,1561223707
6,30,rating,5,1561223814
6,31,rating,5,1561223921
6,32,rating,5,1561224028
6,33,rating,5,1561224135
6,34,rating,5,1561224242
6,35,rating,5,1561224349
6,36,rating,5,1561224456
6,37,rating,5,1561224563
6,38,rating,5,1561224670
6,39,rating,5,1561224777
6,40,rating,5,1561224884
6,41,rating,5,1561224991
6,42,rating,5,1561225098
6,43,rating,5,1561225205
6,44,rating,5,1561225312
6,45,rating,5,1561225419
6,46,rating,5,1561225526
6,47,rating,5,1561225633
6,48,rating,5,1561225740
6,49,rating,5,1561225847
6,50,rating,5,1561225954
6,51,rating,5,1561226061
6,52,rating,5,1561226168
6,53,rating,5,1561226275
6,54,rating,5,1561226382
6,55,rating,5,1561226489
6,56,rating,5,1561226596
6,57,rating,5,1561226703
6,58,rating,5,1561226810
6,59,rating,5,1561226917
6,60,rating,5,1561227024
6,61,rating,5,1561227131
6,62,rating,5,1561227238
6,63,rating,5,1561227345
6,64,rating,5,1561227452
6,65,rating,5,1561227559
6,66,rating,5,1561227666
6,67,rating,5,1561227773
6,68,rating,5,1561227880
6,69,rating,5,1561227987
6,70,rating,5,1561228094
6,71,rating,5,1561228201
6,72,rating,5,1561228308
6,73,rating,5,1561228415
6,74,rating,5,1561228522
6,75,rating,5,1561228629
6,76,rating,5,1561228736
6,77,rating,5,1561228843
6,78,rating,5,1561228950
6,79,rating,5,1561229057
6,80,rating,5,1561229164
6,81,rating,5,1561229271
6,82,rating,5,1561229378
6,83,rating,5,1561229485
6,84,rating,5,1561229592
7,1,rating,1,1561229699
7,2,rating,1,1561229806
7,3,rating,1,1561229913
7,4,rating,9,1561230020
7,5,rating,9,1561230127
7,6,rating,1,1561230234
7,7,rating,9,1561230341
7,8,rating,9,1561230448
7,9,rating,9,1561230555
7,10,rating,9,1561230662
7,11,rating,9,1561230769
7,12,rating,9,1561230876
7,13,rating,9,1561230983
7,14,rating,1,1561231090
7,15,rating,9,1561231197
7,16,rating,9,1561231304
7,17,rating,9,1561231411
7,18,rating,9,1561231518
7,19,rating,9,1561231625
7,20,rating,9,1561231732
7,21,rating,9,1561231839
7,22,rating,9,1561231946
7,23,rating,9,1561232053
7,24,rating,9,1561232160
7,25,rating,9,1561232267
7,26,rating,9,1561232374
7,27,rating,9,1561232481
7,28,rating,1,1561232588
7,29,rating,9,1561232695
7,30,rating,1,1561232802
7,31,rating,9,1561232909
7,32,rating,9,1561233016
7,33,rating,9,1561233123
7,34,rating,9,1561233230
7,35,rating,9,1561233337
7,36,rating,9,1561233444
7,37,rating,9,1561233551
7,38,rating,9,1561233658
7,39,rating,9,1561233765
7,40,rating,9,1561233872
7,41,rating,9,1561233979
7,42,rating,9,1561234086
7,43,rating,9,1561234193
7,44,rating,9,1561234300
7,45,rating,9,1561234407
7,46,rating,9,1561234514
7,47,rating,9,1561234621
7,48,rating,9,1561234728
7,49,rating,9,1561234835
7,50,rating,9,1561234942
7,51,rating,9,1561235049
7,52,rating,9,1561235156
7,53,rating,9,1561235263
7,54,rating,9,1561235370
7,55,rating,9,1561235477
7,56,rating,9,1561235584
7,57,rating,9,1561235691
7,58,rating,9,1561235798
7,59,rating,9,1561235905
7,60,rating,9,1561236012
7,61,rating,9,1561236119
7,62,rating,9,1561236226
7,63,rating,1,1561236333
7,64,rating,9,1561236440
7,65,rating,9,1561236547
7,66,rating,9,1561236654
7,67,rating,9,1561236761
7,68,rating,9,1561236868
7,69,rating,9,1561236975
7,70,rating,9,1561237082
7,71,rating,9,1561237189
7,72,rating,1,1561237296
7,73,rating,1,1561237403
7,74,rating,9,1561237510
7,75,rating,9,1561237617
7,76,rating,9,1561237724
7,77,rating,9,1561237831
7,78,rating,9,1561237938
7,79,rating,9,1561238045
7,80,rating,9,1561238152
7,81,rating,9,1561238259
7,82,rating,9,1561238366
7,83,rating,9,1561238473
7,84,rating,9,1561238580
8,1,rating,1,1561238687
8,2,rating,6,1561238794
8,3,rating,6,1561238901
8,4,rating,9,1561239008
8,5,rating,1,1561239115
8,6,rating,1,1561239222
8,7,rating,9,1561239329
8,8,rating,9,1561239436
8,9,rating,9,1561239543
8,10,rating,9,1561239650
8,11,rating,9,1561239757
8,12,rating,9,1561239864
8,13,rating,1,1561239971
8,14,rating,9,1561240078
8,15,rating,9,1561240185
8,16,rating,9,1561240292
8,17,rating,9,1561240399
8,18,rating,9,1561240506
8,19,rating,9,1561240613
8,20,rating,9,1561240720
8,21,rating,9,1561240827
8,22,rating,1,1561240934
8,23,rating,1,1561241041
8,24,rating,9,1561241148
8,25,rating,9,1561241255
8,26,rating,9,1561241362
8,27,rating,1,1561241469
8,28,rating,5,1561241576
8,29,rating,9,1561241683
8,30,rating,9,1561241790
8,31,rating,9,1561241897
8,32,rating,9,1561242004
8,33,rating,9,1561242111
8,34,rating,9,1561242218
8,35,rating,9,1561242325
8,36,rating,1,1561242432
8,37,rating,1,1561242539
8,38,rating,9,1561242646
8,39,rating,9,1561242753
8,40,rating,9,1561242860
8,41,rating,9,1561242967
8,42,rating,9,1561243074
8,43,rating,1,1561243181
8,44,rating,9,1561243288
8,45,rating,9,1561243395
8,46,rating,9,1561243502
8,47,rating,1,1561243609
8,48,rating,9,1561243716
8,49,rating,9,1561243823
8,50,rating,9,1561243930
8,51,rating,9,1561244037
8,52,rating,9,1561244144
8,53,rating,9,1561244251
8,54,rating,9,1561244358
8,55,rating,9,1561244465
8,56,rating,1,1561244572
8,57,rating,9,1561244679
8,58,rating,9,1561244786
8,59,rating,9,1561244893
8,60,rating,9,1561245000
8,61,rating,9,1561245107
8,62,rating,9,1561245214
8,63,rating,1,1561245321
8,64,rating,9,1561245428
8,65,rating,9,1561245535
8,66,rating,9,1561245642
8,67,rating,9,1561245749
8,68,rating,9,1561245856
8,69,rating,9,1561245963
8,70,rating,9,1561246070
8,71,rating,9,1561246177
8,72,rating,9,1561246284
8,73,rating,9,1561246391
8,74,rating,9,1561246498
8,75,rating,9,1561246605
8,76,rating,1,1561246712
8,77,rating,9,1561246819
8,78,rating,1,1561246926
8,79,rating,9,1561247033
8,80,rating,9,1561247140
8,81,rating,1,1561247247
8,82,rating,1,1561247354
8,83,rating,9,1561247461
8,84,rating,9,1561247568
9,1,rating,9,1561247675
9,2,rating,1,1561247782
9,3,rating,1,1561247889
9,4,rating,9,1561247996
9,5,rating,1,1561248103
9,6,rating,9,1561248210
9,7,rating,1,1561248317
9,8,rating,1,1561248424
9,9,rating,9,1561248531
9,10,rating,9,1561248638
9,11,rating,9,1561248745
9,12,rating,9,1561248852
9,13,rating,1,1561248959
9,14,rating,1,1561249066
9,15,rating,1,1561249173
9,16,rating,1,1561249280
9,17,rating,9,1561249387
9,18,rating,1,1561249494
9,19,rating,1,1561249601
9,20,rating,1,1561249708
9,21,rating,9,1561249815
9,22,rating,1,1561249922
9,23,rating,1,1561250029
9,24,rating,9,1561250136
9,25,rating,9,1561250243
9,26,rating,9,1561250350
9,27,rating,1,1561250457
9,28,rating,1,1561250564
9,29,rating,9,1561250671
9,30,rating,1,1561250778
9,31,rating,1,1561250885
9,32,rating,9,1561250992
9,33,rating,9,1561251099
9,34,rating,9,1561251206
9,35,rating,9,1561251313
9,36,rating,1,1561251420
9,37,rating,1,1561251527
9,38,rating,9,1561251634
9,39,rating,1,1561251741
9,40,rating,9,1561251848
9,41,rating,9,1561251955
9,42,rating,1,1561252062
9,43,rating,1,1561252169
9,44,rating,9,1561252276
9,45,rating,9,1561252383
9,46,rating,1,1561252490
9,47,rating,1,1561252597
9,48,rating,1,1561252704
9,49,rating,1,1561252811
9,50,rating,9,1561252918
9,51,rating,1,1561253025
9,52,rating,9,1561253132
9,53,rating,9,1561253239
9,54,rating,9,1561253346
9,55,rating,9,1561253453
9,56,rating,1,1561253560
9,57,rating,9,1561253667
9,58,rating,9,1561253774
9,59,rating,9,1561253881
9,60,rating,9,1561253988
9,61,rating,9,1561254095
9,62,rating,9,1561254202
9,63,rating,9,1561254309
9,64,rating,9,1561254416
9,65,rating,1,1561254523
9,66,rating,9,1561254630
9,67,rating,9,1561254737
9,68,rating,9,1561254844
9,69,rating,9,1561254951
9,70,rating,9,1561255058
9,71,rating,9,1561255165
9,72,rating,1,1561255272
9,73,rating,1,1561255379
9,74,rating,9,1561255486
9,75,rating,9,1561255593
9,76,rating,1,1561255700
9,77,rating,9,1561255807
9,78,rating,1,1561255914
9,79,rating,9,1561256021
9,80,rating,1,1561256128
9,81,rating,1,1561256235
9,82,rating,1,1561256342
9,83,rating,9,1561256449
9,84,rating,9,1561256556
10,1,rating,9,1561256663
10,2,rating,8,1561256770
10,3,rating,8,1561256877
10,4,rating,9,1561256984
10,5,rating,6,1561257091
10,6,rating,9,1561257198
10,7,rating,9,1561257305
10,8,rating,9,1561257412
10,9,rating,9,1561257519
10,10,rating,9,1561257626
10,11,rating,9,1561257733
10,12,rating,9,1561257840
10,13,rating,6,1561257947
10,14,rating,1,1561258054
10,15,rating,9,1561258161
10,16,rating,9,1561258268
10,17,rating,9,1561258375
10,18,rating,9,1561258482
10,19,rating,9,1561258589
10,20,rating,9,1561258696
10,21,rating,9,1561258803
10,22,rating,6,1561258910
10,23,rating,6,1561259017
10,24,rating,9,1561259124
10,25,rating,9,1561259231
10,26,rating,9,1561259338
10,27,rating,6,1561259445
10,28,rating,1,1561259552
10,29,rating,9,1561259659
10,30,rating,1,1561259766
10,31,rating,9,1561259873
10,32,rating,9,1561259980
10,33,rating,9,1561260087
10,34,rating,9,1561260194
10,35,rating,9,1561260301
10,36,rating,6,1561260408
10,37,rating,6,1561260515
10,38,rating,9,1561260622
10,39,rating,9,1561260729
10,40,rating,9,1561260836
10,41,rating,9,1561260943
10,42,rating,9,1561261050
10,43,rating,6,1561261157
10,44,rating,9,1561261264
10,45,rating,9,1561261371
10,46,rating,9,1561261478
10,47,rating,6,1561261585
10,48,rating,9,1561261692
10,49,rating,9,1561261799
10,50,rating,9,1561261906
10,51,rating,9,1561262013
10,52,rating,9,1561262120
10,53,rating,9,1561262227
10,54,rating,9,1561262334
10,55,rating,9,1561262441
10,56,rating,6,1561262548
10,57,rating,9,1561262655
10,58,rating,9,1561262762
10,59,rating,9,1561262869
10,60,rating,9,1561262976
10,61,rating,9,1561263083
10,62,rating,9,1561263190
10,63,rating,9,1561263297
10,64,rating,9,1561263404
10,65,rating,9,1561263511
10,66,rating,9,1561263618
10,67,rating,9,1561263725
10,68,rating,9,1561263832
10,69,rating,9,1561263939
10,70,rating,9,1561264046
10,71,rating,9,1561264153
10,72,rating,1,1561264260
10,73,rating,1,1561264367
10,74,rating,9,1561264474
10,75,rating,9,1561264581
10,76,rating,6,1561264688
10,77,rating,9,1561264795
10,78,rating,6,1561264902
10,79,rating,9,1561265009
10,80,rating,9,1561265116
10,81,rating,6,1561265223
10,82,rating,6,1561265330
10,83,rating,9,1561265437
10,84,rating,9,1561265544
11,1,rating,2,1561265651
11,2,rating,1,1561265758
11,3,rating,1,1561265865
11,4,rating,2,1561265972
11,5,rating,3,1561266079
11,6,rating,2,1561266186
11,7,rating,2,1561266293
11,8,rating,2,1561266400
11,9,rating,2,1561266507
11,10,rating,2,1561266614
11,11,rating,2,1561266721
11,12,rating,2,1561266828
11,13,rating,3,1561266935
11,14,rating,1,1561267042
11,15,rating,2,1561267149
11,16,rating,2,1561267256
11,17,rating,2,1561267363
11,18,rating,2,1561267470
11,19,rating,2,1561267577
11,20,rating,2,1561267684
11,21,rating,2,1561267791
11,22,rating,3,1561267898
11,23,rating,3,1561268005
11,24,rating,2,1561268112
11,25,rating,2,1561268219
11,26,rating,2,1561268326
11,27,rating,3,1561268433
11,28,rating,1,1561268540
11,29,rating,2,1561268647
11,30,rating,1,1561268754
11,31,rating,2,1561268861
11,32,rating,2,1561268968
11,33,rating,2,1561269075
11,34,rating,2,1561269182
11,35,rating,2,1561269289
11,36,rating,3,1561269396
11,37,rating,3,1561269503
11,38,rating,2,1561269610
11,39,rating,2,1561269717
11,40,rating,2,1561269824
11,41,rating,2,1561269931
11,42,rating,2,1561270038
11,43,rating,3,1561270145
11,44,rating,2,1561270252
11,45,rating,2,1561270359
11,46,rating,2,1561270466
11,47,rating,3,1561270573
11,48,rating,2,1561270680
11,49,rating,2,1561270787
11,50,rating,2,1561270894
11,51,rating,2,1561271001
11,52,rating,2,1561271108
11,53,rating,2,1561271215
11,54,rating,2,1561271322
11,55,rating,2,1561271429
11,56,rating,3,1561271536
11,57,rating,2,1561271643
11,58,rating,2,1561271750
11,59,rating,2,1561271857
11,60,rating,2,1561271964
11,61,rating,2,1561272071
11,62,rating,2,1561272178
11,63,rating,2,1561272285
11,64,rating,2,1561272392
11,65,rating,2,1561272499
11,66,rating,2,1561272606
11,67,rating,2,1561272713
11,68,rating,2,1561272820
11,69,rating,2,1561272927
11,70,rating,2,1561273034
11,71,rating,2,1561273141
11,72,rating,1,1561273248
11,73,rating,1,1561273355
11,74,rating,2,1561273462
11,75,rating,2,1561273569
11,76,rating,3,1561273676
11,77,rating,2,1561273783
11,78,rating,3,1561273890
11,79,rating,2,1561273997
11,80,rating,2,1561274104
11,81,rating,3,1561274211
11,82,rating,3,1561274318
11,83,rating,2,1561274425
11,84,rating,2,1561274532
12,1,rating,3,1561274639
12,2,rating,7,1561274746
12,3,rating,7,1561274853
12,4,rating,5,1561274960
12,5,rating,8,1561275067
12,6,rating,3,1561275174
12,7,rating,3,1561275281
12,8,rating,3,1561275388
12,9,rating,5,1561275495
12,10,rating,5,1561275602
12,11,rating,5,1561275709
12,12,rating,5,1561275816
12,13,rating,8,1561275923
12,14,rating,7,1561276030
12,15,rating,3,1561276137
12,16,rating,3,1561276244
12,17,rating,5,1561276351
12,18,rating,3,1561276458
12,19,rating,3,1561276565
12,20,rating,3,1561276672
12,21,rating,5,1561276779
12,22,rating,8,1561276886
12,23,rating,8,1561276993
12,24,rating,5,1561277100
12,25,rating,5,1561277207
12,26,rating,5,1561277314
12,27,rating,8,1561277421
12,28,rating,2,1561277528
12,29,rating,5,1561277635
12,30,rating,7,1561277742
12,31,rating,3,1561277849
12,32,rating,5,1561277956
12,33,rating,5,1561278063
12,34,rating,5,1561278170
12,35,rating,5,1561278277
12,36,rating,8,1561278384
12,37,rating,8,1561278491
12,38,rating,5,1561278598
12,39,rating,3,1561278705
12,40,rating,5,1561278812
12,41,rating,5,1561278919
12,42,rating,3,1561279026
12,43,rating,8,1561279133
12,44,rating,5,1561279240
12,45,rating,5,1561279347
12,46,rating,3,1561279454
12,47,rating,8,1561279561
12,48,rating,3,1561279668
12,49,rating,3,1561279775
12,50,rating,5,1561279882
12,51,rating,3,1561279989
12,52,rating,5,1561280096
12,53,rating,5,1561280203
12,54,rating,5,1561280310
12,55,rating,5,1561280417
12,56,rating,8,1561280524
12,57,rating,5,1561280631
12,58,rating,5,1561280738
12,59,rating,5,1561280845
12,60,rating,5,1561280952
12,61,rating,5,1561281059
12,62,rating,5,1561281166
12,63,rating,3,1561281273
12,64,rating,5,1561281380
12,65,rating,3,1561281487
12,66,rating,5,1561281594
12,67,rating,5,1561281701
12,68,rating,5,1561281808
12,69,rating,5,1561281915
12,70,rating,5,1561282022
12,71,rating,5,1561282129
12,72,rating,7,1561282236
12,73,rating,7,1561282343
12,74,rating,5,1561282450
12,75,rating,5,1561282557
12,76,rating,8,1561282664
12,77,rating,5,1561282771
12,78,rating,8,1561282878
12,79,rating,5,1561282985
12,80,rating,3,1561283092
12,81,rating,8,1561283199
12,82,rating,8,1561283306
12,83,rating,5,1561283413
12,84,rating,5,1561283520
13,1,rating,5,1561283693
13,2,rating,2,1561283866
13,3,rating,6,1561284039
13,4,rating,9,1561284212
13,5,rating,1,1561284385
13,6,rating,9,1561284558
13,7,rating,7,1561284731
13,8,rating,5,1561284904
13,9,rating,4,1561285077
13,10,rating,4,1561285250
13,11,rating,8,1561285423
13,12,rating,1,1561285596
13,13,rating,9,1561285769
13,14,rating,7,1561285942
13,15,rating,2,1561286115
13,16,rating,7,1561286288
13,17,rating,8,1561286461
13,18,rating,4,1561286634
13,19,rating,1,1561286807
13,20,rating,3,1561286980
13,21,rating,7,1561287153
13,22,rating,2,1561287326
13,23,rating,9,1561287499
13,24,rating,3,1561287672
13,25,rating,4,1561287845
13,26,rating,5,1561288018
13,27,rating,3,1561288191
13,28,rating,2,1561288364
13,29,rating,5,1561288537
13,30,rating,2,1561288710
13,31,rating,1,1561288883
13,32,rating,2,1561289056
13,33,rating,9,1561289229
13,34,rating,1,1561289402
13,35,rating,2,1561289575
13,36,rating,2,1561289748
13,37,rating,6,1561289921
13,38,rating,8,1561290094
13,39,rating,7,1561290267
13,40,rating,2,1561290440
13,41,rating,3,1561290613
13,42,rating,1,1561290786
13,43,rating,9,1561290959
13,44,rating,3,1561291132
13,45,rating,8,1561291305
13,46,rating,6,1561291478
13,47,rating,5,1561291651
13,48,rating,4,1561291824
13,49,rating,3,1561291997
13,50,rating,9,1561292170
13,51,rating,4,1561292343
13,52,rating,5,1561292516
13,53,rating,3,1561292689
13,54,rating,1,1561292862
13,55,rating,6,1561293035
13,56,rating,9,1561293208
13,57,rating,4,1561293381
13,58,rating,8,1561293554
13,59,rating,4,1561293727
13,60,rating,2,1561293900
13,61,rating,8,1561294073
13,62,rating,6,1561294246
13,63,rating,7,1561294419
13,64,rating,9,1561294592
13,65,rating,9,1561294765
13,66,rating,7,1561294938
13,67,rating,4,1561295111
13,68,rating,2,1561295284
13,69,rating,6,1561295457
13,70,rating,7,1561295630
13,71,rating,8,1561295803
13,72,rating,1,1561295976
13,73,rating,9,1561296149
13,74,rating,3,1561296322
13,75,rating,8,1561296495
13,76,rating,7,1561296668
13,77,rating,5,1561296841
13,78,rating,1,1561297014
13,79,rating,7,1561297187
13,80,rating,2,1561297360
13,81,rating,3,1561297533
13,82,rating,3,1561297706
13,83,rating,8,1561297879
13,84,rating,7,1561298052
14,1,rating,5,1561298225
14,2,rating,5,1561298398
14,3,rating,7,1561298571
14,4,rating,2,1561298744
14,5,rating,9,1561298917
14,6,rating,8,1561299090
14,7,rating,4,1561299263
14,8,rating,6,1561299436
14,9,rating,7,1561299609
14,10,rating,4,1561299782
14,11,rating,1,1561299955
14,12,rating,5,1561300128
14,13,rating,6,1561300301
14,14,rating,1,1561300474
14,15,rating,2,1561300647
14,16,rating,9,1561300820
14,17,rating,9,1561300993
14,18,rating,4,1561301166
14,19,rating,5,1561301339
14,20,rating,2,1561301512
14,21,rating,1,1561301685
14,22,rating,8,1561301858
14,23,rating,8,1561302031
14,24,rating,3,1561302204
14,25,rating,1,1561302377
14,26,rating,5,1561302550
14,27,rating,7,1561302723
14,28,rating,6,1561302896
14,29,rating,3,1561303069
14,30,rating,6,1561303242
14,31,rating,9,1561303415
14,32,rating,6,1561303588
14,33,rating,3,1561303761
14,34,rating,6,1561303934
14,35,rating,5,1561304107
14,36,rating,1,1561304280
14,37,rating,5,1561304453
14,38,rating,2,1561304626
14,39,rating,9,1561304799
14,40,rating,8,1561304972
14,41,rating,5,1561305145
14,42,rating,8,1561305318
14,43,rating,9,1561305491
14,44,rating,1,1561305664
14,45,rating,8,1561305837
14,46,rating,2,1561306010
14,47,rating,6,1561306183
14,48,rating,7,1561306356
14,49,rating,6,1561306529
14,50,rating,3,1561306702
14,51,rating,8,1561306875
14,52,rating,1,1561307048
14,53,rating,8,1561307221
14,54,rating,1,1561307394
14,55,rating,7,1561307567
14,56,rating,8,1561307740
14,57,rating,3,1561307913
14,58,rating,6,1561308086
14,59,rating,3,1561308259
14,60,rating,4,1561308432
14,61,rating,4,1561308605
14,62,rating,9,1561308778
14,63,rating,7,1561308951
14,64,rating,9,1561309124
14,65,rating,9,1561309297
14,66,rating,7,1561309470
14,67,rating,3,1561309643
14,68,rating,3,1561309816
14,69,rating,6,1561309989
14,70,rating,3,1561310162
14,71,rating,6,1561310335
14,72,rating,3,1561310508
14,73,rating,2,1561310681
14,74,rating,4,1561310854
14,75,rating,9,1561311027
14,76,rating,4,1561311200
14,77,rating,4,1561311373
14,78,rating,8,1561311546
14,79,rating,8,1561311719
14,80,rating,6,1561311892
14,81,rating,2,1561312065
14,82,rating,3,1561312238
14,83,rating,8,1561312411
14,84,rating,2,1561312584
15,1,rating,9,1561312757
15,2,rating,6,1561312930
15,3,rating,3,1561313103
15,4,rating,3,1561313276
15,5,rating,9,1561313449
15,6,rating,7,1561313622
15,7,rating,6,1561313795
15,8,rating,2,1561313968
15,9,rating,5,1561314141
15,10,rating,8,1561314314
15,11,rating,1,1561314487
15,12,rating,4,1561314660
15,13,rating,5,1561314833
15,14,rating,6,1561315006
15,15,rating,3,1561315179
15,16,rating,5,1561315352
15,17,rating,9,1561315525
15,18,rating,2,1561315698
15,19,rating,6,1561315871
15,20,rating,2,1561316044
15,21,rating,8,1561316217
15,22,rating,6,1561316390
15,23,rating,9,1561316563
15,24,rating,2,1561316736
15,25,rating,1,1561316909
15,26,rating,2,1561317082
15,27,rating,8,1561317255
15,28,rating,7,1561317428
15,29,rating,3,1561317601
15,30,rating,2,1561317774
15,31,rating,6,1561317947
15,32,rating,3,1561318120
15,33,rating,9,1561318293
15,34,rating,7,1561318466
15,35,rating,9,1561318639
15,36,rating,6,1561318812
15,37,rating,8,1561318985
15,38,rating,5,1561319158
15,39,rating,9,1561319331
15,40,rating,9,1561319504
15,41,rating,7,1561319677
15,42,rating,4,1561319850
15,43,rating,6,1561320023
15,44,rating,8,1561320196
15,45,rating,5,1561320369
15,46,rating,4,1561320542
15,47,rating,9,1561320715
15,48,rating,8,1561320888
15,49,rating,3,1561321061
15,50,rating,7,1561321234
15,51,rating,4,1561321407
15,52,rating,6,1561321580
15,53,rating,1,1561321753
15,54,rating,5,1561321926
15,55,rating,3,1561322099
15,56,rating,4,1561322272
15,57,rating,5,1561322445
15,58,rating,6,1561322618
15,59,rating,6,1561322791
15,60,rating,9,1561322964
15,61,rating,3,1561323137
15,62,rating,8,1561323310
15,63,rating,5,1561323483
15,64,rating,6,1561323656
15,65,rating,5,1561323829
15,66,rating,1,1561324002
15,67,rating,8,1561324175
15,68,rating,2,1561324348
15,69,rating,9,1561324521
15,70,rating,9,1561324694
15,71,rating,3,1561324867
15,72,rating,9,1561325040
15,73,rating,7,1561325213
15,74,rating,1,1561325386
15,75,rating,3,1561325559
15,76,rating,8,1561325732
15,77,rating,4,1561325905
15,78,rating,1,1561326078
15,79,rating,5,1561326251
15,80,rating,7,1561326424
15,81,rating,8,1561326597
15,82,rating,4,1561326770
15,83,rating,4,1561326943
15,84,rating,4,1561327116
16,1,rating,5,1561327289
16,2,rating,3,1561327462
16,3,rating,4,1561327635
16,4,rating,2,1561327808
16,5,rating,3,1561327981
16,6,rating,2,1561328154
16,7,rating,5,1561328327
16,8,rating,2,1561328500
16,9,rating,7,1561328673
16,10,rating,1,1561328846
16,11,rating,3,1561329019
16,12,rating,8,1561329192
16,13,rating,6,1561329365
16,14,rating,2,1561329538
16,15,rating,6,1561329711
16,16,rating,8,1561329884
16,17,rating,4,1561330057
16,18,rating,1,1561330230
16,19,rating,9,1561330403
16,20,rating,1,1561330576
16,21,rating,2,1561330749
16,22,rating,6,1561330922
16,23,rating,5,1561331095
16,24,rating,6,1561331268
16,25,rating,5,1561331441
16,26,rating,1,1561331614
16,27,rating,2,1561331787
16,28,rating,4,1561331960
16,29,rating,2,1561332133
16,30,rating,3,1561332306
16,31,rating,4,1561332479
16,32,rating,5,1561332652
16,33,rating,6,1561332825
16,34,rating,7,1561332998
16,35,rating,6,1561333171
16,36,rating,3,1561333344
16,37,rating,3,1561333517
16,38,rating,7,1561333690
16,39,rating,3,1561333863
16,40,rating,3,1561334036
16,41,rating,8,1561334209
16,42,rating,4,1561334382
16,43,rating,3,1561334555
16,44,rating,9,1561334728
16,45,rating,7,1561334901
16,46,rating,7,1561335074
16,47,rating,8,1561335247
16,48,rating,9,1561335420
16,49,rating,7,1561335593
16,50,rating,2,1561335766
16,51,rating,2,1561335939
16,52,rating,3,1561336112
16,53,rating,3,1561336285
16,54,rating,4,1561336458
16,55,rating,8,1561336631
16,56,rating,4,1561336804
16,57,rating,9,1561336977
16,58,rating,8,1561337150
16,59,rating,8,1561337323
16,60,rating,6,1561337496
16,61,rating,4,1561337669
16,62,rating,5,1561337842
16,63,rating,6,1561338015
16,64,rating,3,1561338188
16,65,rating,2,1561338361
16,66,rating,4,1561338534
16,67,rating,2,1561338707
16,68,rating,9,1561338880
16,69,rating,1,1561339053
16,70,rating,2,1561339226
16,71,rating,7,1561339399
16,72,rating,4,1561339572
16,73,rating,2,1561339745
16,74,rating,6,1561339918
16,75,rating,1,1561340091
16,76,rating,4,1561340264
16,77,rating,4,1561340437
16,78,rating,6,1561340610
16,79,rating,7,1561340783
16,80,rating,5,1561340956
16,81,rating,6,1561341129
16,82,rating,6,1561341302
16,83,rating,4,1561341475
16,84,rating,2,1561341648
17,1,rating,4,1561341821
17,2,rating,5,1561341994
17,3,rating,9,1561342167
17,4,rating,7,1561342340
17,5,rating,3,1561342513
17,6,rating,1,1561342686
17,7,rating,1,1561342859
17,8,rating,6,1561343032
17,9,rating,2,1561343205
17,10,rating,8,1561343378
17,11,rating,8,1561343551
17,12,rating,9,1561343724
17,13,rating,8,1561343897
17,14,rating,6,1561344070
17,15,rating,9,1561344243
17,16,rating,9,1561344416
17,17,rating,6,1561344589
17,18,rating,4,1561344762
17,19,rating,8,1561344935
17,20,rating,2,1561345108
17,21,rating,4,1561345281
17,22,rating,1,1561345454
17,23,rating,2,1561345627
17,24,rating,7,1561345800
17,25,rating,1,1561345973
17,26,rating,1,1561346146
17,27,rating,6,1561346319
17,28,rating,4,1561346492
17,29,rating,8,1561346665
17,30,rating,8,1561346838
17,31,rating,1,1561347011
17,32,rating,4,1561347184
17,33,rating,9,1561347357
17,34,rating,4,1561347530
17,35,rating,8,1561347703
17,36,rating,5,1561347876
17,37,rating,4,1561348049
17,38,rating,7,1561348222
17,39,rating,4,1561348395
17,40,rating,6,1561348568
17,41,rating,5,1561348741
17,42,rating,1,1561348914
17,43,rating,7,1561349087
17,44,rating,7,1561349260
17,45,rating,7,1561349433
17,46,rating,7,1561349606
17,47,rating,7,1561349779
17,48,rating,8,1561349952
17,49,rating,8,1561350125
17,50,rating,9,1561350298
17,51,rating,2,1561350471
17,52,rating,9,1561350644
17,53,rating,3,1561350817
17,54,rating,6,1561350990
17,55,rating,9,1561351163
17,56,rating,2,1561351336
17,57,rating,7,1561351509
17,58,rating,9,1561351682
17,59,rating,2,1561351855
17,60,rating,7,1561352028
17,61,rating,8,1561352201
17,62,rating,6,1561352374
17,63,rating,6,1561352547
17,64,rating,9,1561352720
17,65,rating,6,1561352893
17,66,rating,8,1561353066
17,67,rating,6,1561353239
17,68,rating,2,1561353412
17,69,rating,6,1561353585
17,70,rating,2,1561353758
17,71,rating,6,1561353931
17,72,rating,6,1561354104
17,73,rating,4,1561354277
17,74,rating,9,1561354450
17,75,rating,8,1561354623
17,76,rating,9,1561354796
17,77,rating,4,1561354969
17,78,rating,4,1561355142
17,79,rating,4,1561355315
17,80,rating,9,1561355488
17,81,rating,5,1561355661
17,82,rating,7,1561355834
17,83,rating,3,1561356007
17,84,rating,1,1561356180
18,1,rating,9,1561356353
18,2,rating,3,1561356526
18,3,rating,2,1561356699
18,4,rating,8,1561356872
18,5,rating,1,1561357045
18,6,rating,4,1561357218
18,7,rating,5,1561357391
18,8,rating,3,1561357564
18,9,rating,5,1561357737
18,10,rating,9,1561357910
18,11,rating,6,1561358083
18,12,rating,2,1561358256
18,13,rating,4,1561358429
18,14,rating,2,1561358602
18,15,rating,3,1561358775
18,16,rating,6,1561358948
18,17,rating,8,1561359121
18,18,rating,3,1561359294
18,19,rating,1,1561359467
18,20,rating,7,1561359640
18,21,rating,9,1561359813
18,22,rating,1,1561359986
18,23,rating,5,1561360159
18,24,rating,8,1561360332
18,25,rating,2,1561360505
18,26,rating,1,1561360678
18,27,rating,9,1561360851
18,28,rating,9,1561361024
18,29,rating,7,1561361197
18,30,rating,5,1561361370
18,31,rating,9,1561361543
18,32,rating,5,1561361716
18,33,rating,9,1561361889
18,34,rating,5,1561362062
18,35,rating,2,1561362235
18,36,rating,8,1561362408
18,37,rating,5,1561362581
18,38,rating,4,1561362754
18,39,rating,2,1561362927
18,40,rating,9,1561363100
18,41,rating,6,1561363273
18,42,rating,1,1561363446
18,43,rating,8,1561363619
18,44,rating,8,1561363792
18,45,rating,3,1561363965
18,46,rating,1,1561364138
18,47,rating,5,1561364311
18,48,rating,3,1561364484
18,49,rating,8,1561364657
18,50,rating,7,1561364830
18,51,rating,1,1561365003
18,52,rating,7,1561365176
18,53,rating,3,1561365349
18,54,rating,4,1561365522
18,55,rating,7,1561365695
18,56,rating,8,1561365868
18,57,rating,9,1561366041
18,58,rating,9,1561366214
18,59,rating,7,1561366387
18,60,rating,3,1561366560
18,61,rating,8,1561366733
18,62,rating,6,1561366906
18,63,rating,6,1561367079
18,64,rating,6,1561367252
18,65,rating,7,1561367425
18,66,rating,8,1561367598
18,67,rating,9,1561367771
18,68,rating,8,1561367944
18,69,rating,5,1561368117
18,70,rating,6,1561368290
18,71,rating,3,1561368463
18,72,rating,1,1561368636
18,73,rating,5,1561368809
18,74,rating,6,1561368982
18,75,rating,9,1561369155
18,76,rating,9,1561369328
18,77,rating,1,1561369501
18,78,rating,8,1561369674
18,79,rating,7,1561369847
18,80,rating,6,1561370020
18,81,rating,9,1561370193
18,82,rating,4,1561370366
18,83,rating,9,1561370539
18,84,rating,1,1561370712
19,1,rating,5,1561370885
19,2,rating,2,1561371058
19,3,rating,6,1561371231
19,4,rating,8,1561371404
19,5,rating,3,1561371577
19,6,rating,7,1561371750
19,7,rating,7,1561371923
19,8,rating,2,1561372096
19,9,rating,3,1561372269
19,10,rating,2,1561372442
19,11,rating,4,1561372615
19,12,rating,3,1561372788
19,13,rating,4,1561372961
19,14,rating,4,1561373134
19,15,rating,1,1561373307
19,16,rating,2,1561373480
19,17,rating,8,1561373653
19,18,rating,3,1561373826
19,19,rating,8,1561373999
19,20,rating,8,1561374172
19,21,rating,1,1561374345
19,22,rating,6,1561374518
19,23,rating,2,1561374691
19,24,rating,2,1561374864
19,25,rating,1,1561375037
19,26,rating,9,1561375210
19,27,rating,8,1561375383
19,28,rating,3,1561375556
19,29,rating,8,1561375729
19,30,rating,8,1561375902
19,31,rating,9,1561376075
19,32,rating,9,1561376248
19,33,rating,1,1561376421
19,34,rating,5,1561376594
19,35,rating,8,1561376767
19,36,rating,9,1561376940
19,37,rating,7,1561377113
19,38,rating,3,1561377286
19,39,rating,9,1561377459
19,40,rating,3,1561377632
19,41,rating,9,1561377805
19,42,rating,9,1561377978
19,43,rating,6,1561378151
19,44,rating,5,1561378324
19,45,rating,6,1561378497
19,46,rating,7,1561378670
19,47,rating,5,1561378843
19,48,rating,6,1561379016
19,49,rating,6,1561379189
19,50,rating,3,1561379362
19,51,rating,2,1561379535
19,52,rating,6,1561379708
19,53,rating,4,1561379881
19,54,rating,6,1561380054
19,55,rating,9,1561380227
19,56,rating,3,1561380400
19,57,rating,8,1561380573
19,58,rating,6,1561380746
19,59,rating,8,1561380919
19,60,rating,2,1561381092
19,61,rating,3,1561381265
19,62,rating,6,1561381438
19,63,rating,9,1561381611
19,64,rating,4,1561381784
19,65,rating,1,1561381957
19,66,rating,1,1561382130
19,67,rating,3,1561382303
19,68,rating,4,1561382476
19,69,rating,8,1561382649
19,70,rating,4,1561382822
19,71,rating,5,1561382995
19,72,rating,7,1561383168
19,73,rating,3,1561383341
19,74,rating,4,1561383514
19,75,rating,4,1561383687
19,76,rating,2,1561383860
19,77,rating,6,1561384033
19,78,rating,5,1561384206
19,79,rating,3,1561384379
19,80,rating,5,1561384552
19,81,rating,5,1561384725
19,82,rating,3,1561384898
19,83,rating,8,1561385071
19,84,rating,1,1561385244
20,1,rating,7,1561385417
20,2,rating,9,1561385590
20,3,rating,6,1561385763
20,4,rating,2,1561385936
20,5,rating,1,1561386109
20,6,rating,8,1561386282
20,7,rating,8,1561386455
20,8,rating,4,1561386628
20,9,rating,3,1561386801
20,10,rating,7,1561386974
20,11,rating,3,1561387147
20,12,rating,3,1561387320
20,13,rating,3,1561387493
20,14,rating,3,1561387666
20,15,rating,5,1561387839
20,16,rating,2,1561388012
20,17,rating,5,1561388185
20,18,rating,1,1561388358
20,19,rating,8,1561388531
20,20,rating,9,1561388704
20,21,rating,8,1561388877
20,22,rating,8,1561389050
20,23,rating,2,1561389223
20,24,rating,2,1561389396
20,25,rating,8,1561389569
20,26,rating,8,1561389742
20,27,rating,7,1561389915
20,28,rating,7,1561390088
20,29,rating,8,1561390261
20,30,rating,7,1561390434
20,31,rating,6,1561390607
20,32,rating,8,1561390780
20,33,rating,4,1561390953
20,34,rating,3,1561391126
20,35,rating,2,1561391299
20,36,rating,6,1561391472
20,37,rating,8,1561391645
20,38,rating,4,1561391818
20,39,rating,7,1561391991
20,40,rating,6,1561392164
20,41,rating,1,1561392337
20,42,rating,6,1561392510
20,43,rating,9,1561392683
20,44,rating,6,1561392856
20,45,rating,9,1561393029
20,46,rating,3,1561393202
20,47,rating,9,1561393375
20,48,rating,7,1561393548
20,49,rating,7,1561393721
20,50,rating,7,1561393894
20,51,rating,1,1561394067
20,52,rating,7,1561394240
20,53,rating,5,1561394413
20,54,rating,4,1561394586
20,55,rating,1,1561394759
20,56,rating,8,1561394932
20,57,rating,5,1561395105
20,58,rating,2,1561395278
20,59,rating,3,1561395451
20,60,rating,9,1561395624
20,61,rating,9,1561395797
20,62,rating,5,1561395970
20,63,rating,5,1561396143
20,64,rating,5,1561396316
20,65,rating,7,1561396489
20,66,rating,7,1561396662
20,67,rating,1,1561396835
20,68,rating,9,1561397008
20,69,rating,6,1561397181
20,70,rating,5,1561397354
20,71,rating,4,1561397527
20,72,rating,3,1561397700
20,73,rating,4,1561397873
20,74,rating,5,1561398046
20,75,rating,3,1561398219
20,76,rating,9,1561398392
20,77,rating,7,1561398565
20,78,rating,7,1561398738
20,79,rating,1,1561398911
20,80,rating,2,1561399084
20,81,rating,1,1561399257
20,82,rating,9,1561399430
20,83,rating,6,1561399603
20,84,rating,5,1561399776
21,1,rating,9,1561399949
21,2,rating,8,1561400122
21,3,rating,6,1561400295
21,4,rating,9,1561400468
21,5,rating,9,1561400641
21,6,rating,2,1561400814
21,7,rating,6,1561400987
21,8,rating,9,1561401160
21,9,rating,5,1561401333
21,10,rating,2,1561401506
21,11,rating,6,1561401679
21,12,rating,1,1561401852
21,13,rating,4,1561402025
21,14,rating,3,1561402198
21,15,rating,5,1561402371
21,16,rating,1,1561402544
21,17,rating,1,1561402717
21,18,rating,3,1561402890
21,19,rating,4,1561403063
21,20,rating,2,1561403236
21,21,rating,5,1561403409
21,22,rating,3,1561403582
21,23,rating,7,1561403755
21,24,rating,4,1561403928
21,25,rating,7,1561404101
21,26,rating,2,1561404274
21,27,rating,3,1561404447
21,28,rating,8,1561404620
21,29,rating,2,1561404793
21,30,rating,2,1561404966
21,31,rating,8,1561405139
21,32,rating,9,1561405312
21,33,rating,6,1561405485
21,34,rating,1,1561405658
21,35,rating,8,1561405831
21,36,rating,5,1561406004
21,37,rating,3,1561406177
21,38,rating,3,1561406350
21,39,rating,8,1561406523
21,40,rating,4,1561406696
21,41,rating,5,1561406869
21,42,rating,9,1561407042
21,43,rating,7,1561407215
21,44,rating,5,1561407388
21,45,rating,7,1561407561
21,46,rating,7,1561407734
21,47,rating,6,1561407907
21,48,rating,2,1561408080
21,49,rating,3,1561408253
21,50,rating,9,1561408426
21,51,rating,1,1561408599
21,52,rating,3,1561408772
21,53,rating,9,1561408945
21,54,rating,7,1561409118
21,55,rating,1,1561409291
21,56,rating,7,1561409464
21,57,rating,3,1561409637
21,58,rating,1,1561409810
21,59,rating,2,1561409983
21,60,rating,1,1561410156
21,61,rating,3,1561410329
21,62,rating,3,1561410502
21,63,rating,6,1561410675
21,64,rating,2,1561410848
21,65,rating,2,1561411021
21,66,rating,8,1561411194
21,67,rating,4,1561411367
21,68,rating,6,1561411540
21,69,rating,4,1561411713
21,70,rating,5,1561411886
21,71,rating,3,1561412059
21,72,rating,6,1561412232
21,73,rating,6,1561412405
21,74,rating,2,1561412578
21,75,rating,6,1561412751
21,76,rating,8,1561412924
21,77,rating,8,1561413097
21,78,rating,1,1561413270
21,79,rating,6,1561413443
21,80,rating,7,1561413616
21,81,rating,5,1561413789
21,82,rating,5,1561413962
21,83,rating,5,1561414135
21,84,rating,8,1561414308
22,1,rating,2,1561414481
22,2,rating,6,1561414654
22,3,rating,1,1561414827
22,4,rating,2,1561415000
22,5,rating,8,1561415173
22,6,rating,9,1561415346
22,7,rating,5,1561415519
22,8,rating,1,1561415692
22,9,rating,3,1561415865
22,10,rating,4,1561416038
22,11,rating,1,1561416211
22,12,rating,7,1561416384
22,13,rating,4,1561416557
22,14,rating,9,1561416730
22,15,rating,2,1561416903
22,16,rating,5,1561417076
22,17,rating,8,1561417249
22,18,rating,4,1561417422
22,19,rating,8,1561417595
22,20,rating,5,1561417768
22,21,rating,1,1561417941
22,22,rating,8,1561418114
22,23,rating,1,1561418287
22,24,rating,3,1561418460
22,25,rating,5,1561418633
22,26,rating,9,1561418806
22,27,rating,7,1561418979
22,28,rating,2,1561419152
22,29,rating,2,1561419325
22,30,rating,5,1561419498
22,31,rating,6,1561419671
22,32,rating,9,1561419844
22,33,rating,6,1561420017
22,34,rating,8,1561420190
22,35,rating,1,1561420363
22,36,rating,9,1561420536
22,37,rating,2,1561420709
22,38,rating,2,1561420882
22,39,rating,9,1561421055
22,40,rating,1,1561421228
22,41,rating,3,1561421401
22,42,rating,9,1561421574
22,43,rating,6,1561421747
22,44,rating,4,1561421920
22,45,rating,2,1561422093
22,46,rating,6,1561422266
22,47,rating,4,1561422439
22,48,rating,4,1561422612
22,49,rating,8,1561422785
22,50,rating,2,1561422958
22,51,rating,1,1561423131
22,52,rating,1,1561423304
22,53,rating,4,1561423477
22,54,rating,4,1561423650
22,55,rating,1,1561423823
22,56,rating,8,1561423996
22,57,rating,1,1561424169
22,58,rating,1,1561424342
22,59,rating,8,1561424515
22,60,rating,6,1561424688
22,61,rating,9,1561424861
22,62,rating,6,1561425034
22,63,rating,7,1561425207
22,64,rating,8,1561425380
22,65,rating,3,1561425553
22,66,rating,9,1561425726
22,67,rating,7,1561425899
22,68,rating,7,1561426072
22,69,rating,8,1561426245
22,70,rating,1,1561426418
22,71,rating,3,1561426591
22,72,rating,3,1561426764
22,73,rating,2,1561426937
22,74,rating,3,1561427110
22,75,rating,7,1561427283
22,76,rating,4,1561427456
22,77,rating,9,1561427629
22,78,rating,6,1561427802
22,79,rating,5,1561427975
22,80,rating,4,1561428148
22,81,rating,3,1561428321
22,82,rating,1,1561428494
22,83,rating,5,1561428667
22,84,rating,3,1561428840
23,1,rating,9,1561429013
23,2,rating,8,1561429186
23,3,rating,7,1561429359
23,4,rating,8,1561429532
23,5,rating,1,1561429705
23,6,rating,6,1561429878
23,7,rating,8,1561430051
23,8,rating,4,1561430224
23,9,rating,4,1561430397
23,10,rating,2,1561430570
23,11,rating,2,1561430743
23,12,rating,6,1561430916
23,13,rating,5,1561431089
23,14,rating,3,1561431262
23,15,rating,4,1561431435
23,16,rating,3,1561431608
23,17,rating,6,1561431781
23,18,rating,9,1561431954
23,19,rating,9,1561432127
23,20,rating,6,1561432300
23,21,rating,9,1561432473
23,22,rating,4,1561432646
23,23,rating,7,1561432819
23,24,rating,2,1561432992
23,25,rating,4,1561433165
23,26,rating,8,1561433338
23,27,rating,6,1561433511
23,28,rating,7,1561433684
23,29,rating,2,1561433857
23,30,rating,3,1561434030
23,31,rating,7,1561434203
23,32,rating,8,1561434376
23,33,rating,6,1561434549
23,34,rating,5,1561434722
23,35,rating,7,1561434895
23,36,rating,8,1561435068
23,37,rating,9,1561435241
23,38,rating,3,1561435414
23,39,rating,3,1561435587
23,40,rating,1,1561435760
23,41,rating,9,1561435933
23,42,rating,4,1561436106
23,43,rating,7,1561436279
23,44,rating,3,1561436452
23,45,rating,3,1561436625
23,46,rating,1,1561436798
23,47,rating,2,1561436971
23,48,rating,7,1561437144
23,49,rating,9,1561437317
23,50,rating,8,1561437490
23,51,rating,2,1561437663
23,52,rating,8,1561437836
23,53,rating,1,1561438009
23,54,rating,4,1561438182
23,55,rating,1,1561438355
23,56,rating,1,1561438528
23,57,rating,8,1561438701
23,58,rating,2,1561438874
23,59,rating,7,1561439047
23,60,rating,3,1561439220
23,61,rating,7,1561439393
23,62,rating,4,1561439566
23,63,rating,2,1561439739
23,64,rating,9,1561439912
23,65,rating,6,1561440085
23,66,rating,1,1561440258
23,67,rating,2,1561440431
23,68,rating,7,1561440604
23,69,rating,6,1561440777
23,70,rating,5,1561440950
23,71,rating,4,1561441123
23,72,rating,8,1561441296
23,73,rating,3,1561441469
23,74,rating,5,1561441642
23,75,rating,9,1561441815
23,76,rating,2,1561441988
23,77,rating,5,1561442161
23,78,rating,7,1561442334
23,79,rating,7,1561442507
23,80,rating,9,1561442680
23,81,rating,5,1561442853
23,82,rating,3,1561443026
23,83,rating,9,1561443199
23,84,rating,1,1561443372
24,1,rating,3,1561443545
24,2,rating,2,1561443718
24,3,rating,9,1561443891
24,4,rating,1,1561444064
24,5,rating,4,1561444237
24,6,rating,9,1561444410
24,7,rating,4,1561444583
24,8,rating,3,1561444756
24,9,rating,5,1561444929
24,10,rating,1,1561445102
24,11,rating,2,1561445275
24,12,rating,3,1561445448
24,13,rating,4,1561445621
24,14,rating,4,1561445794
24,15,rating,7,1561445967
24,16,rating,7,1561446140
24,17,rating,4,1561446313
24,18,rating,5,1561446486
24,19,rating,2,1561446659
24,20,rating,5,1561446832
24,21,rating,4,1561447005
24,22,rating,5,1561447178
24,23,rating,2,1561447351
24,24,rating,6,1561447524
24,25,rating,8,1561447697
24,26,rating,3,1561447870
24,27,rating,5,1561448043
24,28,rating,7,1561448216
24,29,rating,5,1561448389
24,30,rating,2,1561448562
24,31,rating,9,1561448735
24,32,rating,9,1561448908
24,33,rating,2,1561449081
24,34,rating,7,1561449254
24,35,rating,5,1561449427
24,36,rating,6,1561449600
24,37,rating,2,1561449773
24,38,rating,1,1561449946
24,39,rating,8,1561450119
24,40,rating,7,1561450292
24,41,rating,7,1561450465
24,42,rating,8,1561450638
24,43,rating,2,1561450811
24,44,rating,7,1561450984
24,45,rating,8,1561451157
24,46,rating,5,1561451330
24,47,rating,8,1561451503
24,48,rating,5,1561451676
24,49,rating,4,1561451849
24,50,rating,5,1561452022
24,51,rating,4,1561452195
24,52,rating,7,1561452368
24,53,rating,4,1561452541
24,54,rating,2,1561452714
24,55,rating,7,1561452887
24,56,rating,3,1561453060
24,57,rating,3,1561453233
24,58,rating,9,1561453406
24,59,rating,5,1561453579
24,60,rating,6,1561453752
24,61,rating,4,1561453925
24,62,rating,9,1561454098
24,63,rating,2,1561454271
24,64,rating,6,1561454444
24,65,rating,4,1561454617
24,66,rating,6,1561454790
24,67,rating,2,1561454963
24,68,rating,9,1561455136
24,69,rating,5,1561455309
24,70,rating,5,1561455482
24,71,rating,5,1561455655
24,72,rating,6,1561455828
24,73,rating,9,1561456001
24,74,rating,3,1561456174
24,75,rating,3,1561456347
24,76,rating,2,1561456520
24,77,rating,8,1561456693
24,78,rating,9,1561456866
24,79,rating,4,1561457039
24,80,rating,4,1561457212
24,81,rating,7,1561457385
24,82,rating,2,1561457558
24,83,rating,5,1561457731
24,84,rating,6,1561457904
24,1,rating,3,1561458077
24,2,rating,1,1561458250
24,3,rating,2,1561458423
24,4,rating,3,1561458596
24,5,rating,8,1561458769
24,6,rating,6,1561458942
24,7,rating,2,1561459115
24,8,rating,6,1561459288
24,9,rating,8,1561459461
24,10,rating,5,1561459634
24,11,rating,2,1561459807
24,12,rating,2,1561459980
24,13,rating,5,1561460153
24,14,rating,6,1561460326
24,15,rating,3,1561460499
24,16,rating,2,1561460672
24,17,rating,8,1561460845
24,18,rating,2,1561461018
24,19,rating,9,1561461191
24,20,rating,4,1561461364
24,21,rating,5,1561461537
24,22,rating,1,1561461710
24,23,rating,8,1561461883
24,24,rating,6,1561462056
24,25,rating,6,1561462229
24,26,rating,4,1561462402
24,27,rating,4,1561462575
24,28,rating,2,1561462748
24,29,rating,6,1561462921
24,30,rating,6,1561463094
24,31,rating,4,1561463267
24,32,rating,4,1561463440
24,33,rating,9,1561463613
24,34,rating,9,1561463786
24,35,rating,5,1561463959
24,36,rating,2,1561464132
24,37,rating,3,1561464305
24,38,rating,1,1561464478
24,39,rating,4,1561464651
24,40,rating,3,1561464824
24,41,rating,2,1561464997
24,42,rating,6,1561465170
24,43,rating,9,1561465343
24,44,rating,3,1561465516
24,45,rating,4,1561465689
24,46,rating,3,1561465862
24,47,rating,6,1561466035
24,48,rating,4,1561466208
24,49,rating,4,1561466381
24,50,rating,4,1561466554
24,51,rating,7,1561466727
24,52,rating,7,1561466900
24,53,rating,3,1561467073
24,54,rating,6,1561467246
24,55,rating,3,1561467419
24,56,rating,5,1561467592
24,57,rating,7,1561467765
24,58,rating,1,1561467938
24,59,rating,2,1561468111
24,60,rating,5,1561468284
24,61,rating,7,1561468457
24,62,rating,9,1561468630
24,63,rating,1,1561468803
24,64,rating,4,1561468976
24,65,rating,2,1561469149
24,66,rating,1,1561469322
24,67,rating,3,1561469495
24,68,rating,5,1561469668
24,69,rating,2,1561469841
24,70,rating,8,1561470014
24,71,rating,6,1561470187
24,72,rating,3,1561470360
24,73,rating,6,1561470533
24,74,rating,2,1561470706
24,75,rating,6,1561470879
24,76,rating,9,1561471052
24,77,rating,5,1561471225
24,78,rating,1,1561471398
24,79,rating,6,1561471571
24,80,rating,1,1561471744
24,81,rating,4,1561471917
24,82,rating,8,1561472090
24,83,rating,1,1561472263
24,84,rating,5,1561472436
25,1,rating,2,1561472609
25,2,rating,3,1561472782
25,3,rating,3,1561472955
25,4,rating,7,1561473128
25,5,rating,9,1561473301
25,6,rating,5,1561473474
25,7,rating,7,1561473647
25,8,rating,2,1561473820
25,9,rating,3,1561473993
25,10,rating,3,1561474166
25,11,rating,3,1561474339
25,12,rating,4,1561474512
25,13,rating,6,1561474685
25,14,rating,7,1561474858
25,15,rating,2,1561475031
25,16,rating,7,1561475204
25,17,rating,2,1561475377
25,18,rating,7,1561475550
25,19,rating,4,1561475723
25,20,rating,9,1561475896
25,21,rating,1,1561476069
25,22,rating,6,1561476242
25,23,rating,3,1561476415
25,24,rating,7,1561476588
25,25,rating,9,1561476761
25,26,rating,7,1561476934
25,27,rating,4,1561477107
25,28,rating,3,1561477280
25,29,rating,3,1561477453
25,30,rating,6,1561477626
25,31,rating,4,1561477799
25,32,rating,8,1561477972
25,33,rating,1,1561478145
25,34,rating,5,1561478318
25,35,rating,3,1561478491
25,36,rating,1,1561478664
25,37,rating,8,1561478837
25,38,rating,3,1561479010
25,39,rating,7,1561479183
25,40,rating,3,1561479356
25,41,rating,8,1561479529
25,42,rating,7,1561479702
25,43,rating,7,1561479875
25,44,rating,9,1561480048
25,45,rating,3,1561480221
25,46,rating,3,1561480394
25,47,rating,6,1561480567
25,48,rating,1,1561480740
25,49,rating,1,1561480913
25,50,rating,5,1561481086
25,51,rating,3,1561481259
25,52,rating,2,1561481432
25,53,rating,9,1561481605
25,54,rating,1,1561481778
25,55,rating,9,1561481951
25,56,rating,5,1561482124
25,57,rating,4,1561482297
25,58,rating,5,1561482470
25,59,rating,5,1561482643
25,60,rating,7,1561482816
25,61,rating,8,1561482989
25,62,rating,1,1561483162
25,63,rating,5,1561483335
25,64,rating,1,1561483508
25,65,rating,6,1561483681
25,66,rating,2,1561483854
25,67,rating,1,1561484027
25,68,rating,6,1561484200
25,69,rating,4,1561484373
25,70,rating,2,1561484546
25,71,rating,2,1561484719
25,72,rating,7,1561484892
25,73,rating,1,1561485065
25,74,rating,2,1561485238
25,75,rating,4,1561485411
25,76,rating,9,1561485584
25,77,rating,6,1561485757
25,78,rating,6,1561485930
25,79,rating,2,1561486103
25,80,rating,1,1561486276
25,81,rating,3,1561486449
25,82,rating,1,1561486622
25,83,rating,8,1561486795
25,84,rating,1,1561486968
26,1,rating,9,1561487141
26,2,rating,4,1561487314
26,3,rating,6,1561487487
26,4,rating,1,1561487660
26,5,rating,8,1561487833
26,6,rating,5,1561488006
26,7,rating,2,1561488179
26,8,rating,8,1561488352
26,9,rating,8,1561488525
26,10,rating,6,1561488698
26,11,rating,1,1561488871
26,12,rating,3,1561489044
26,13,rating,7,1561489217
26,14,rating,1,1561489390
26,15,rating,9,1561489563
26,16,rating,7,1561489736
26,17,rating,2,1561489909
26,18,rating,7,1561490082
26,19,rating,5,1561490255
26,20,rating,5,1561490428
26,21,rating,7,1561490601
26,22,rating,1,1561490774
26,23,rating,2,1561490947
26,24,rating,1,1561491120
26,25,rating,4,1561491293
26,26,rating,6,1561491466
26,27,rating,8,1561491639
26,28,rating,2,1561491812
26,29,rating,2,1561491985
26,30,rating,4,1561492158
26,31,rating,2,1561492331
26,32,rating,9,1561492504
26,33,rating,5,1561492677
26,34,rating,6,1561492850
26,35,rating,8,1561493023
26,36,rating,6,1561493196
26,37,rating,9,1561493369
26,38,rating,3,1561493542
26,39,rating,7,1561493715
26,40,rating,7,1561493888
26,41,rating,2,1561494061
26,42,rating,2,1561494234
26,43,rating,4,1561494407
26,44,rating,5,1561494580
26,45,rating,3,1561494753
26,46,rating,7,1561494926
26,47,rating,3,1561495099
26,48,rating,5,1561495272
26,49,rating,9,1561495445
26,50,rating,4,1561495618
26,51,rating,4,1561495791
26,52,rating,2,1561495964
26,53,rating,1,1561496137
26,54,rating,6,1561496310
26,55,rating,9,1561496483
26,56,rating,9,1561496656
26,57,rating,2,1561496829
26,58,rating,7,1561497002
26,59,rating,3,1561497175
26,60,rating,4,1561497348
26,61,rating,4,1561497521
26,62,rating,5,1561497694
26,63,rating,3,1561497867
26,64,rating,6,1561498040
26,65,rating,9,1561498213
26,66,rating,2,1561498386
26,67,rating,8,1561498559
26,68,rating,7,1561498732
26,69,rating,9,1561498905
26,70,rating,8,1561499078
26,71,rating,3,1561499251
26,72,rating,2,1561499424
26,73,rating,5,1561499597
26,74,rating,4,1561499770
26,75,rating,8,1561499943
26,76,rating,6,1561500116
26,77,rating,9,1561500289
26,78,rating,2,1561500462
26,79,rating,7,1561500635
26,80,rating,8,1561500808
26,81,rating,8,1561500981
26,82,rating,9,1561501154
26,83,rating,2,1561501327
26,84,rating,7,1561501500
27,1,rating,6,1561501673
27,2,rating,7,1561501846
27,3,rating,6,1561502019
27,4,rating,6,1561502192
27,5,rating,3,1561502365
27,6,rating,7,1561502538
27,7,rating,1,1561502711
27,8,rating,8,1561502884
27,9,rating,3,1561503057
27,10,rating,3,1561503230
27,11,rating,2,1561503403
27,12,rating,5,1561503576
27,13,rating,3,1561503749
27,14,rating,7,1561503922
27,15,rating,7,1561504095
27,16,rating,5,1561504268
27,17,rating,8,1561504441
27,18,rating,9,1561504614
27,19,rating,3,1561504787
27,20,rating,7,1561504960
27,21,rating,1,1561505133
27,22,rating,4,1561505306
27,23,rating,6,1561505479
27,24,rating,8,1561505652
27,25,rating,6,1561505825
27,26,rating,8,1561505998
27,27,rating,1,1561506171
27,28,rating,8,1561506344
27,29,rating,9,1561506517
27,30,rating,7,1561506690
27,31,rating,7,1561506863
27,32,rating,1,1561507036
27,33,rating,3,1561507209
27,34,rating,8,1561507382
27,35,rating,9,1561507555
27,36,rating,2,1561507728
27,37,rating,2,1561507901
27,38,rating,5,1561508074
27,39,rating,5,1561508247
27,40,rating,8,1561508420
27,41,rating,2,1561508593
27,42,rating,9,1561508766
27,43,rating,2,1561508939
27,44,rating,4,1561509112
27,45,rating,2,1561509285
27,46,rating,3,1561509458
27,47,rating,4,1561509631
27,48,rating,7,1561509804
27,49,rating,2,1561509977
27,50,rating,9,1561510150
27,51,rating,2,1561510323
27,52,rating,9,1561510496
27,53,rating,5,1561510669
27,54,rating,2,1561510842
27,55,rating,5,1561511015
27,56,rating,5,1561511188
27,57,rating,1,1561511361
27,58,rating,3,1561511534
27,59,rating,1,1561511707
27,60,rating,1,1561511880
27,61,rating,6,1561512053
27,62,rating,6,1561512226
27,63,rating,2,1561512399
27,64,rating,7,1561512572
27,65,rating,4,1561512745
27,66,rating,1,1561512918
27,67,rating,9,1561513091
27,68,rating,4,1561513264
27,69,rating,2,1561513437
27,70,rating,2,1561513610
27,71,rating,7,1561513783
27,72,rating,8,1561513956
27,73,rating,6,1561514129
27,74,rating,8,1561514302
27,75,rating,2,1561514475
27,76,rating,4,1561514648
27,77,rating,8,1561514821
27,78,rating,9,1561514994
27,79,rating,2,1561515167
27,80,rating,6,1561515340
27,81,rating,1,1561515513
27,82,rating,9,1561515686
27,83,rating,9,1561515859
27,84,rating,5,1561516032
28,1,rating,9,1561516205
28,2,rating,2,1561516378
28,3,rating,2,1561516551
28,4,rating,5,1561516724
28,5,rating,7,1561516897
28,6,rating,1,1561517070
28,7,rating,1,1561517243
28,8,rating,8,1561517416
28,9,rating,4,1561517589
28,10,rating,7,1561517762
28,11,rating,6,1561517935
28,12,rating,1,1561518108
28,13,rating,7,1561518281
28,14,rating,1,1561518454
28,15,rating,9,1561518627
28,16,rating,5,1561518800
28,17,rating,1,1561518973
28,18,rating,4,1561519146
28,19,rating,5,1561519319
28,20,rating,5,1561519492
28,21,rating,1,1561519665
28,22,rating,5,1561519838
28,23,rating,7,1561520011
28,24,rating,8,1561520184
28,25,rating,9,1561520357
28,26,rating,1,1561520530
28,27,rating,5,1561520703
28,28,rating,2,1561520876
28,29,rating,6,1561521049
28,30,rating,7,1561521222
28,31,rating,7,1561521395
28,32,rating,4,1561521568
28,33,rating,6,1561521741
28,34,rating,7,1561521914
28,35,rating,2,1561522087
28,36,rating,1,1561522260
28,37,rating,9,1561522433
28,38,rating,3,1561522606
28,39,rating,3,1561522779
28,40,rating,1,1561522952
28,41,rating,9,1561523125
28,42,rating,5,1561523298
28,43,rating,2,1561523471
28,44,rating,6,1561523644
28,45,rating,4,1561523817
28,46,rating,6,1561523990
28,47,rating,9,1561524163
28,48,rating,1,1561524336
28,49,rating,4,1561524509
28,50,rating,9,1561524682
28,51,rating,9,1561524855
28,52,rating,3,1561525028
28,53,rating,8,1561525201
28,54,rating,5,1561525374
28,55,rating,4,1561525547
28,56,rating,2,1561525720
28,57,rating,2,1561525893
28,58,rating,1,1561526066
28,59,rating,7,1561526239
28,60,rating,6,1561526412
28,61,rating,8,1561526585
28,62,rating,3,1561526758
28,63,rating,9,1561526931
28,64,rating,5,1561527104
28,65,rating,7,1561527277
28,66,rating,3,1561527450
28,67,rating,3,1561527623
28,68,rating,8,1561527796
28,69,rating,8,1561527969
28,70,rating,2,1561528142
28,71,rating,6,1561528315
28,72,rating,9,1561528488
28,73,rating,4,1561528661
28,74,rating,3,1561528834
28,75,rating,3,1561529007
28,76,rating,1,1561529180
28,77,rating,3,1561529353
28,78,rating,2,1561529526
28,79,rating,4,1561529699
28,80,rating,3,1561529872
28,81,rating,3,1561530045
28,82,rating,6,1561530218
28,83,rating,5,1561530391
28,84,rating,6,1561530564
29,1,rating,3,1561530737
29,2,rating,3,1561530910
29,3,rating,9,1561531083
29,4,rating,5,1561531256
29,5,rating,5,1561531429
29,6,rating,3,1561531602
29,7,rating,8,1561531775
29,8,rating,5,1561531948
29,9,rating,9,1561532121
29,10,rating,9,1561532294
29,11,rating,3,1561532467
29,12,rating,5,1561532640
29,13,rating,5,1561532813
29,14,rating,7,1561532986
29,15,rating,2,1561533159
29,16,rating,1,1561533332
29,17,rating,6,1561533505
29,18,rating,8,1561533678
29,19,rating,3,1561533851
29,20,rating,1,1561534024
29,21,rating,2,1561534197
29,22,rating,6,1561534370
29,23,rating,2,1561534543
29,24,rating,8,1561534716
29,25,rating,8,1561534889
29,26,rating,1,1561535062
29,27,rating,2,1561535235
29,28,rating,5,1561535408
29,29,rating,2,1561535581
29,30,rating,9,1561535754
29,31,rating,4,1561535927
29,32,rating,4,1561536100
29,33,rating,8,1561536273
29,34,rating,1,1561536446
29,35,rating,4,1561536619
29,36,rating,8,1561536792
29,37,rating,1,1561536965
29,38,rating,4,1561537138
29,39,rating,7,1561537311
29,40,rating,6,1561537484
29,41,rating,5,1561537657
29,42,rating,8,1561537830
29,43,rating,6,1561538003
29,44,rating,1,1561538176
29,45,rating,7,1561538349
29,46,rating,4,1561538522
29,47,rating,4,1561538695
29,48,rating,7,1561538868
29,49,rating,2,1561539041
29,50,rating,3,1561539214
29,51,rating,5,1561539387
29,52,rating,4,1561539560
29,53,rating,4,1561539733
29,54,rating,4,1561539906
29,55,rating,5,1561540079
29,56,rating,8,1561540252
29,57,rating,6,1561540425
29,58,rating,6,1561540598
29,59,rating,5,1561540771
29,60,rating,6,1561540944
29,61,rating,7,1561541117
29,62,rating,9,1561541290
29,63,rating,2,1561541463
29,64,rating,3,1561541636
29,65,rating,3,1561541809
29,66,rating,4,1561541982
29,67,rating,4,1561542155
29,68,rating,9,1561542328
29,69,rating,4,1561542501
29,70,rating,6,1561542674
29,71,rating,7,1561542847
29,72,rating,6,1561543020
29,73,rating,8,1561543193
29,74,rating,1,1561543366
29,75,rating,2,1561543539
29,76,rating,4,1561543712
29,77,rating,9,1561543885
29,78,rating,4,1561544058
29,79,rating,4,1561544231
29,80,rating,4,1561544404
29,81,rating,5,1561544577
29,82,rating,7,1561544750
29,83,rating,4,1561544923
29,84,rating,7,1561545096
30,1,rating,9,1561545269
30,2,rating,5,1561545442
30,3,rating,6,1561545615
30,4,rating,6,1561545788
30,5,rating,9,1561545961
30,6,rating,5,1561546134
30,7,rating,4,1561546307
30,8,rating,8,1561546480
30,9,rating,3,1561546653
30,10,rating,6,1561546826
30,11,rating,4,1561546999
30,12,rating,4,1561547172
30,13,rating,2,1561547345
30,14,rating,8,1561547518
30,15,rating,2,1561547691
30,16,rating,8,1561547864
30,17,rating,4,1561548037
30,18,rating,1,1561548210
30,19,rating,2,1561548383
30,20,rating,9,1561548556
30,21,rating,6,1561548729
30,22,rating,2,1561548902
30,23,rating,6,1561549075
30,24,rating,7,1561549248
30,25,rating,7,1561549421
30,26,rating,6,1561549594
30,27,rating,9,1561549767
30,28,rating,8,1561549940
30,29,rating,6,1561550113
30,30,rating,4,1561550286
30,31,rating,1,1561550459
30,32,rating,1,1561550632
30,33,rating,2,1561550805
30,34,rating,6,1561550978
30,35,rating,6,1561551151
30,36,rating,2,1561551324
30,37,rating,5,1561551497
30,38,rating,7,1561551670
30,39,rating,8,1561551843
30,40,rating,6,1561552016
30,41,rating,3,1561552189
30,42,rating,6,1561552362
30,43,rating,9,1561552535
30,44,rating,4,1561552708
30,45,rating,3,1561552881
30,46,rating,2,1561553054
30,47,rating,2,1561553227
30,48,rating,1,1561553400
30,49,rating,3,1561553573
30,50,rating,3,1561553746
30,51,rating,2,1561553919
30,52,rating,3,1561554092
30,53,rating,8,1561554265
30,54,rating,3,1561554438
30,55,rating,2,1561554611
30,56,rating,6,1561554784
30,57,rating,4,1561554957
30,58,rating,3,1561555130
30,59,rating,7,1561555303
30,60,rating,9,1561555476
30,61,rating,1,1561555649
30,62,rating,8,1561555822
30,63,rating,5,1561555995
30,64,rating,1,1561556168
30,65,rating,2,1561556341
30,66,rating,4,1561556514
30,67,rating,3,1561556687
30,68,rating,3,1561556860
30,69,rating,3,1561557033
30,70,rating,6,1561557206
30,71,rating,8,1561557379
30,72,rating,8,1561557552
30,73,rating,1,1561557725
30,74,rating,3,1561557898
30,75,rating,1,1561558071
30,76,rating,4,1561558244
30,77,rating,2,1561558417
30,78,rating,1,1561558590
30,79,rating,6,1561558763
30,80,rating,3,1561558936
30,81,rating,4,1561559109
30,82,rating,3,1561559282
30,83,rating,8,1561559455
30,84,rating,1,1561559628