[
    { "id": "48.132.146.37", "firstName": "Kora", "lastName": "McLoney" },
    { "id": "38.235.97.48", "firstName": "Harlie", "lastName": "Timperley" },
    { "id": "171.237.32.33", "firstName": "Ashlen", "lastName": "Manis" },
    { "id": "173.33.48.108", "firstName": "Mendel", "lastName": "Lebel" },
    { "id": "8.65.100.150", "firstName": "Sissie", "lastName": "Daybell" }
]
