\relax 
\providecommand\hyper@newdestlabel[2]{}
\catcode `"\active 
\providecommand\HyperFirstAtBeginDocument{\AtBeginDocument}
\HyperFirstAtBeginDocument{\ifx\hyper@anchor\@undefined
\global\let\oldcontentsline\contentsline
\gdef\contentsline#1#2#3#4{\oldcontentsline{#1}{#2}{#3}}
\global\let\oldnewlabel\newlabel
\gdef\newlabel#1#2{\newlabelxx{#1}#2}
\gdef\newlabelxx#1#2#3#4#5#6{\oldnewlabel{#1}{{#2}{#3}}}
\AtEndDocument{\ifx\hyper@anchor\@undefined
\let\contentsline\oldcontentsline
\let\newlabel\oldnewlabel
\fi}
\fi}
\global\let\hyper@last\relax 
\gdef\HyperFirstAtBeginDocument#1{#1}
\providecommand\HyField@AuxAddToFields[1]{}
\providecommand\HyField@AuxAddToCoFields[2]{}
\providecommand \oddpage@label [2]{}
\select@language{brazil}
\@writefile{toc}{\select@language{brazil}}
\@writefile{lof}{\select@language{brazil}}
\@writefile{lot}{\select@language{brazil}}
\@writefile{toc}{\contentsline {section}{\numberline {1}Descri\IeC {\c c}\IeC {\~a}o}{1}{section.1}}
\@writefile{toc}{\contentsline {section}{\numberline {2}Estrutura do Modelo}{1}{section.2}}
\@writefile{toc}{\contentsline {section}{\numberline {3}Documenta\IeC {\c c}\IeC {\~a}o das Fun\IeC {\c c}\IeC {\~o}es}{2}{section.3}}
\@writefile{toc}{\contentsline {subsection}{\numberline {3.1} Backward, logBackward e scaleBackward }{2}{subsection.3.1}}
\@writefile{toc}{\contentsline {subsubsection}{\numberline {3.1.1}Descri\IeC {\c c}\IeC {\~a}o}{2}{subsubsection.3.1.1}}
\@writefile{toc}{\contentsline {subsubsection}{\numberline {3.1.2} Uso}{2}{subsubsection.3.1.2}}
\@writefile{toc}{\contentsline {subsubsection}{\numberline {3.1.3}Argumentos}{2}{subsubsection.3.1.3}}
\@writefile{toc}{\contentsline {subsubsection}{\numberline {3.1.4}Retorno}{3}{subsubsection.3.1.4}}
\@writefile{toc}{\contentsline {subsection}{\numberline {3.2} BaumWelch e logBaumWelch }{3}{subsection.3.2}}
\@writefile{toc}{\contentsline {subsubsection}{\numberline {3.2.1}Descri\IeC {\c c}\IeC {\~a}o}{3}{subsubsection.3.2.1}}
\@writefile{toc}{\contentsline {subsubsection}{\numberline {3.2.2} Uso}{3}{subsubsection.3.2.2}}
\@writefile{toc}{\contentsline {subsubsection}{\numberline {3.2.3}Argumentos}{3}{subsubsection.3.2.3}}
\@writefile{toc}{\contentsline {subsubsection}{\numberline {3.2.4}Retorno}{3}{subsubsection.3.2.4}}
\@writefile{toc}{\contentsline {subsection}{\numberline {3.3} Forward, logForward e scaleForward }{3}{subsection.3.3}}
\@writefile{toc}{\contentsline {subsubsection}{\numberline {3.3.1}Descri\IeC {\c c}\IeC {\~a}o}{3}{subsubsection.3.3.1}}
\@writefile{toc}{\contentsline {subsubsection}{\numberline {3.3.2} Uso}{4}{subsubsection.3.3.2}}
\@writefile{toc}{\contentsline {subsubsection}{\numberline {3.3.3}Argumentos}{4}{subsubsection.3.3.3}}
\@writefile{toc}{\contentsline {subsubsection}{\numberline {3.3.4}Retorno}{4}{subsubsection.3.3.4}}
\@writefile{toc}{\contentsline {subsection}{\numberline {3.4}inicializarHMM}{4}{subsection.3.4}}
\@writefile{toc}{\contentsline {subsubsection}{\numberline {3.4.1}Descri\IeC {\c c}\IeC {\~a}o}{4}{subsubsection.3.4.1}}
\@writefile{toc}{\contentsline {subsubsection}{\numberline {3.4.2} Uso}{4}{subsubsection.3.4.2}}
\@writefile{toc}{\contentsline {subsubsection}{\numberline {3.4.3}Argumentos}{4}{subsubsection.3.4.3}}
\@writefile{toc}{\contentsline {subsubsection}{\numberline {3.4.4}Retorno}{5}{subsubsection.3.4.4}}
\@writefile{toc}{\contentsline {subsection}{\numberline {3.5}gerarObs}{5}{subsection.3.5}}
\@writefile{toc}{\contentsline {subsubsection}{\numberline {3.5.1}Descri\IeC {\c c}\IeC {\~a}o}{5}{subsubsection.3.5.1}}
\@writefile{toc}{\contentsline {subsubsection}{\numberline {3.5.2} Uso}{5}{subsubsection.3.5.2}}
\@writefile{toc}{\contentsline {subsubsection}{\numberline {3.5.3}Argumentos}{5}{subsubsection.3.5.3}}
\@writefile{toc}{\contentsline {subsubsection}{\numberline {3.5.4}Retorno}{5}{subsubsection.3.5.4}}
\bibdata{documentacaoR}
\@writefile{toc}{\contentsline {subsection}{\numberline {3.6}Viterbi e logViterbi }{6}{subsection.3.6}}
\@writefile{toc}{\contentsline {subsubsection}{\numberline {3.6.1}Descri\IeC {\c c}\IeC {\~a}o}{6}{subsubsection.3.6.1}}
\@writefile{toc}{\contentsline {subsubsection}{\numberline {3.6.2} Uso}{6}{subsubsection.3.6.2}}
\@writefile{toc}{\contentsline {subsubsection}{\numberline {3.6.3}Argumentos}{6}{subsubsection.3.6.3}}
\@writefile{toc}{\contentsline {subsubsection}{\numberline {3.6.4}Retorno}{6}{subsubsection.3.6.4}}
\@writefile{toc}{\contentsline {section}{\numberline {4}Lista de arquivos}{6}{section.4}}
