<mxfile host="app.diagrams.net" modified="2022-08-02T18:00:58.360Z" agent="5.0 (Windows NT 10.0; Win64; x64) AppleWebKit/537.36 (KHTML, like Gecko) Chrome/103.0.0.0 Safari/537.36" etag="BzWt7jicUhkZckA6SCqG" version="20.2.2" type="gitlab">
  <diagram id="0UYVDVv5m0FQKOgLKKol" name="Page-1">
    <mxGraphModel dx="2044" dy="872" grid="1" gridSize="10" guides="1" tooltips="1" connect="1" arrows="1" fold="1" page="1" pageScale="1" pageWidth="850" pageHeight="1100" math="0" shadow="0">
      <root>
        <mxCell id="0" />
        <mxCell id="1" parent="0" />
        <mxCell id="fB1HUZ4lTLVt3vPAVsF_-102" value="" style="rounded=0;whiteSpace=wrap;html=1;fontSize=18;" vertex="1" parent="1">
          <mxGeometry x="140" y="40" width="580" height="720" as="geometry" />
        </mxCell>
        <mxCell id="fB1HUZ4lTLVt3vPAVsF_-1" value="&lt;font style=&quot;font-size: 18px;&quot;&gt;Super &lt;br&gt;Admin&lt;/font&gt;" style="shape=umlActor;verticalLabelPosition=bottom;verticalAlign=top;html=1;outlineConnect=0;" vertex="1" parent="1">
          <mxGeometry x="50" y="140" width="30" height="60" as="geometry" />
        </mxCell>
        <mxCell id="fB1HUZ4lTLVt3vPAVsF_-2" value="&lt;font style=&quot;font-size: 18px;&quot;&gt;System &lt;br&gt;Admin&lt;/font&gt;" style="shape=umlActor;verticalLabelPosition=bottom;verticalAlign=top;html=1;outlineConnect=0;" vertex="1" parent="1">
          <mxGeometry x="50" y="575" width="30" height="60" as="geometry" />
        </mxCell>
        <mxCell id="fB1HUZ4lTLVt3vPAVsF_-3" value="&lt;font style=&quot;font-size: 18px;&quot;&gt;Insurance &lt;br&gt;company&lt;/font&gt;" style="shape=umlActor;verticalLabelPosition=bottom;verticalAlign=top;html=1;outlineConnect=0;" vertex="1" parent="1">
          <mxGeometry x="770" y="140" width="30" height="60" as="geometry" />
        </mxCell>
        <mxCell id="fB1HUZ4lTLVt3vPAVsF_-8" value="&lt;font style=&quot;font-size: 18px;&quot;&gt;User&lt;/font&gt;" style="shape=umlActor;verticalLabelPosition=bottom;verticalAlign=top;html=1;outlineConnect=0;" vertex="1" parent="1">
          <mxGeometry x="770" y="575" width="30" height="60" as="geometry" />
        </mxCell>
        <mxCell id="fB1HUZ4lTLVt3vPAVsF_-12" value="&lt;font style=&quot;font-size: 18px;&quot;&gt;Report generation&lt;/font&gt;" style="ellipse;whiteSpace=wrap;html=1;align=center;" vertex="1" parent="1">
          <mxGeometry x="240" y="400" width="440" height="40" as="geometry" />
        </mxCell>
        <mxCell id="fB1HUZ4lTLVt3vPAVsF_-14" value="&lt;font style=&quot;font-size: 18px;&quot;&gt;Manage taxes&lt;/font&gt;" style="ellipse;whiteSpace=wrap;html=1;align=center;" vertex="1" parent="1">
          <mxGeometry x="200" y="650" width="200" height="50" as="geometry" />
        </mxCell>
        <mxCell id="fB1HUZ4lTLVt3vPAVsF_-15" value="&lt;font style=&quot;font-size: 18px;&quot;&gt;Manage Plans&lt;/font&gt;" style="ellipse;whiteSpace=wrap;html=1;align=center;" vertex="1" parent="1">
          <mxGeometry x="200" y="520" width="200" height="50" as="geometry" />
        </mxCell>
        <mxCell id="fB1HUZ4lTLVt3vPAVsF_-16" value="&lt;font style=&quot;font-size: 18px;&quot;&gt;Manage payments&lt;/font&gt;" style="ellipse;whiteSpace=wrap;html=1;align=center;" vertex="1" parent="1">
          <mxGeometry x="200" y="580" width="200" height="50" as="geometry" />
        </mxCell>
        <mxCell id="fB1HUZ4lTLVt3vPAVsF_-17" value="&lt;font style=&quot;font-size: 18px;&quot;&gt;Search policy&lt;/font&gt;" style="ellipse;whiteSpace=wrap;html=1;align=center;" vertex="1" parent="1">
          <mxGeometry x="480" y="520" width="200" height="50" as="geometry" />
        </mxCell>
        <mxCell id="fB1HUZ4lTLVt3vPAVsF_-18" value="&lt;font style=&quot;font-size: 18px;&quot;&gt;Compare policies&lt;/font&gt;" style="ellipse;whiteSpace=wrap;html=1;align=center;" vertex="1" parent="1">
          <mxGeometry x="480" y="580" width="200" height="55" as="geometry" />
        </mxCell>
        <mxCell id="fB1HUZ4lTLVt3vPAVsF_-19" value="&lt;font style=&quot;font-size: 18px;&quot;&gt;Get customer care support&lt;/font&gt;" style="ellipse;whiteSpace=wrap;html=1;align=center;" vertex="1" parent="1">
          <mxGeometry x="240" y="460" width="440" height="40" as="geometry" />
        </mxCell>
        <mxCell id="fB1HUZ4lTLVt3vPAVsF_-20" value="&lt;font style=&quot;font-size: 18px;&quot;&gt;Get Predicted amount&lt;/font&gt;" style="ellipse;whiteSpace=wrap;html=1;align=center;" vertex="1" parent="1">
          <mxGeometry x="480" y="650" width="200" height="50" as="geometry" />
        </mxCell>
        <mxCell id="fB1HUZ4lTLVt3vPAVsF_-21" value="&lt;font style=&quot;font-size: 18px;&quot;&gt;Create policies&lt;/font&gt;" style="ellipse;whiteSpace=wrap;html=1;align=center;" vertex="1" parent="1">
          <mxGeometry x="480" y="210" width="200" height="40" as="geometry" />
        </mxCell>
        <mxCell id="fB1HUZ4lTLVt3vPAVsF_-22" value="&lt;font style=&quot;font-size: 18px;&quot;&gt;Publish policies&lt;/font&gt;" style="ellipse;whiteSpace=wrap;html=1;align=center;" vertex="1" parent="1">
          <mxGeometry x="480" y="150" width="200" height="40" as="geometry" />
        </mxCell>
        <mxCell id="fB1HUZ4lTLVt3vPAVsF_-23" value="&lt;font style=&quot;font-size: 18px;&quot;&gt;Report policy mistakes&lt;/font&gt;" style="ellipse;whiteSpace=wrap;html=1;align=center;" vertex="1" parent="1">
          <mxGeometry x="480" y="80" width="200" height="50" as="geometry" />
        </mxCell>
        <mxCell id="fB1HUZ4lTLVt3vPAVsF_-24" value="&lt;font style=&quot;font-size: 18px;&quot;&gt;Sign in/Sign up and Login/logout&lt;/font&gt;" style="ellipse;whiteSpace=wrap;html=1;align=center;" vertex="1" parent="1">
          <mxGeometry x="240" y="340" width="440" height="40" as="geometry" />
        </mxCell>
        <mxCell id="fB1HUZ4lTLVt3vPAVsF_-25" value="&lt;font style=&quot;font-size: 18px;&quot;&gt;Profile update&lt;/font&gt;" style="ellipse;whiteSpace=wrap;html=1;align=center;" vertex="1" parent="1">
          <mxGeometry x="240" y="280" width="440" height="40" as="geometry" />
        </mxCell>
        <mxCell id="fB1HUZ4lTLVt3vPAVsF_-34" value="&lt;font style=&quot;font-size: 18px;&quot;&gt;Manage&amp;nbsp;&lt;br&gt;app workflow&lt;/font&gt;" style="ellipse;whiteSpace=wrap;html=1;align=center;" vertex="1" parent="1">
          <mxGeometry x="200" y="80" width="200" height="50" as="geometry" />
        </mxCell>
        <mxCell id="fB1HUZ4lTLVt3vPAVsF_-35" value="&lt;font style=&quot;font-size: 18px;&quot;&gt;Manage policies&amp;nbsp;&lt;/font&gt;" style="ellipse;whiteSpace=wrap;html=1;align=center;" vertex="1" parent="1">
          <mxGeometry x="200" y="150" width="200" height="40" as="geometry" />
        </mxCell>
        <mxCell id="fB1HUZ4lTLVt3vPAVsF_-36" value="&lt;font style=&quot;font-size: 18px;&quot;&gt;Approve policies&lt;/font&gt;" style="ellipse;whiteSpace=wrap;html=1;align=center;" vertex="1" parent="1">
          <mxGeometry x="200" y="210" width="200" height="40" as="geometry" />
        </mxCell>
        <mxCell id="fB1HUZ4lTLVt3vPAVsF_-54" value="" style="endArrow=classic;html=1;rounded=0;entryX=0;entryY=0.5;entryDx=0;entryDy=0;" edge="1" parent="1" target="fB1HUZ4lTLVt3vPAVsF_-34">
          <mxGeometry width="50" height="50" relative="1" as="geometry">
            <mxPoint x="90" y="170" as="sourcePoint" />
            <mxPoint x="270" y="100" as="targetPoint" />
          </mxGeometry>
        </mxCell>
        <mxCell id="fB1HUZ4lTLVt3vPAVsF_-55" value="" style="endArrow=classic;html=1;rounded=0;entryX=0;entryY=0.5;entryDx=0;entryDy=0;" edge="1" parent="1" target="fB1HUZ4lTLVt3vPAVsF_-35">
          <mxGeometry width="50" height="50" relative="1" as="geometry">
            <mxPoint x="90" y="170" as="sourcePoint" />
            <mxPoint x="270" y="100" as="targetPoint" />
          </mxGeometry>
        </mxCell>
        <mxCell id="fB1HUZ4lTLVt3vPAVsF_-56" value="" style="endArrow=classic;html=1;rounded=0;entryX=0;entryY=0.5;entryDx=0;entryDy=0;" edge="1" parent="1" target="fB1HUZ4lTLVt3vPAVsF_-36">
          <mxGeometry width="50" height="50" relative="1" as="geometry">
            <mxPoint x="90" y="170" as="sourcePoint" />
            <mxPoint x="270" y="200" as="targetPoint" />
          </mxGeometry>
        </mxCell>
        <mxCell id="fB1HUZ4lTLVt3vPAVsF_-60" value="" style="endArrow=classic;html=1;rounded=0;entryX=0;entryY=0.5;entryDx=0;entryDy=0;" edge="1" parent="1" target="fB1HUZ4lTLVt3vPAVsF_-16">
          <mxGeometry width="50" height="50" relative="1" as="geometry">
            <mxPoint x="90" y="600" as="sourcePoint" />
            <mxPoint x="180" y="650" as="targetPoint" />
          </mxGeometry>
        </mxCell>
        <mxCell id="fB1HUZ4lTLVt3vPAVsF_-61" value="" style="endArrow=classic;html=1;rounded=0;entryX=0;entryY=0.5;entryDx=0;entryDy=0;" edge="1" parent="1" target="fB1HUZ4lTLVt3vPAVsF_-15">
          <mxGeometry width="50" height="50" relative="1" as="geometry">
            <mxPoint x="90" y="600" as="sourcePoint" />
            <mxPoint x="170" y="650" as="targetPoint" />
          </mxGeometry>
        </mxCell>
        <mxCell id="fB1HUZ4lTLVt3vPAVsF_-62" value="" style="endArrow=classic;html=1;rounded=0;entryX=0;entryY=0.5;entryDx=0;entryDy=0;" edge="1" parent="1" target="fB1HUZ4lTLVt3vPAVsF_-14">
          <mxGeometry width="50" height="50" relative="1" as="geometry">
            <mxPoint x="90" y="600" as="sourcePoint" />
            <mxPoint x="170" y="650" as="targetPoint" />
          </mxGeometry>
        </mxCell>
        <mxCell id="fB1HUZ4lTLVt3vPAVsF_-63" value="" style="endArrow=classic;html=1;rounded=0;entryX=0;entryY=0.5;entryDx=0;entryDy=0;" edge="1" parent="1" target="fB1HUZ4lTLVt3vPAVsF_-25">
          <mxGeometry width="50" height="50" relative="1" as="geometry">
            <mxPoint x="90" y="170" as="sourcePoint" />
            <mxPoint x="160" y="120" as="targetPoint" />
          </mxGeometry>
        </mxCell>
        <mxCell id="fB1HUZ4lTLVt3vPAVsF_-64" value="" style="endArrow=classic;html=1;rounded=0;fontSize=18;entryX=0;entryY=0.5;entryDx=0;entryDy=0;" edge="1" parent="1" target="fB1HUZ4lTLVt3vPAVsF_-24">
          <mxGeometry width="50" height="50" relative="1" as="geometry">
            <mxPoint x="90" y="170" as="sourcePoint" />
            <mxPoint x="550" y="120" as="targetPoint" />
          </mxGeometry>
        </mxCell>
        <mxCell id="fB1HUZ4lTLVt3vPAVsF_-65" value="" style="endArrow=classic;html=1;rounded=0;fontSize=18;entryX=0;entryY=0.5;entryDx=0;entryDy=0;" edge="1" parent="1" target="fB1HUZ4lTLVt3vPAVsF_-12">
          <mxGeometry width="50" height="50" relative="1" as="geometry">
            <mxPoint x="90" y="170" as="sourcePoint" />
            <mxPoint x="550" y="370" as="targetPoint" />
          </mxGeometry>
        </mxCell>
        <mxCell id="fB1HUZ4lTLVt3vPAVsF_-66" value="" style="endArrow=classic;html=1;rounded=0;fontSize=18;entryX=0;entryY=0.5;entryDx=0;entryDy=0;" edge="1" parent="1" target="fB1HUZ4lTLVt3vPAVsF_-19">
          <mxGeometry width="50" height="50" relative="1" as="geometry">
            <mxPoint x="90" y="170" as="sourcePoint" />
            <mxPoint x="550" y="370" as="targetPoint" />
          </mxGeometry>
        </mxCell>
        <mxCell id="fB1HUZ4lTLVt3vPAVsF_-74" value="" style="endArrow=classic;html=1;rounded=0;fontSize=18;entryX=0;entryY=0.5;entryDx=0;entryDy=0;" edge="1" parent="1" target="fB1HUZ4lTLVt3vPAVsF_-19">
          <mxGeometry width="50" height="50" relative="1" as="geometry">
            <mxPoint x="90" y="600" as="sourcePoint" />
            <mxPoint x="370" y="460" as="targetPoint" />
          </mxGeometry>
        </mxCell>
        <mxCell id="fB1HUZ4lTLVt3vPAVsF_-75" value="" style="endArrow=classic;html=1;rounded=0;fontSize=18;entryX=0;entryY=0.5;entryDx=0;entryDy=0;" edge="1" parent="1" target="fB1HUZ4lTLVt3vPAVsF_-12">
          <mxGeometry width="50" height="50" relative="1" as="geometry">
            <mxPoint x="90" y="600" as="sourcePoint" />
            <mxPoint x="370" y="460" as="targetPoint" />
          </mxGeometry>
        </mxCell>
        <mxCell id="fB1HUZ4lTLVt3vPAVsF_-76" value="" style="endArrow=classic;html=1;rounded=0;fontSize=18;entryX=0;entryY=0.5;entryDx=0;entryDy=0;" edge="1" parent="1" target="fB1HUZ4lTLVt3vPAVsF_-24">
          <mxGeometry width="50" height="50" relative="1" as="geometry">
            <mxPoint x="90" y="600" as="sourcePoint" />
            <mxPoint x="370" y="460" as="targetPoint" />
          </mxGeometry>
        </mxCell>
        <mxCell id="fB1HUZ4lTLVt3vPAVsF_-77" value="" style="endArrow=classic;html=1;rounded=0;fontSize=18;entryX=0;entryY=0.5;entryDx=0;entryDy=0;" edge="1" parent="1" target="fB1HUZ4lTLVt3vPAVsF_-25">
          <mxGeometry width="50" height="50" relative="1" as="geometry">
            <mxPoint x="90" y="600" as="sourcePoint" />
            <mxPoint x="370" y="460" as="targetPoint" />
          </mxGeometry>
        </mxCell>
        <mxCell id="fB1HUZ4lTLVt3vPAVsF_-78" value="" style="endArrow=classic;html=1;rounded=0;fontSize=18;entryX=1;entryY=0.5;entryDx=0;entryDy=0;" edge="1" parent="1" target="fB1HUZ4lTLVt3vPAVsF_-23">
          <mxGeometry width="50" height="50" relative="1" as="geometry">
            <mxPoint x="750" y="170" as="sourcePoint" />
            <mxPoint x="370" y="290" as="targetPoint" />
          </mxGeometry>
        </mxCell>
        <mxCell id="fB1HUZ4lTLVt3vPAVsF_-79" value="" style="endArrow=classic;html=1;rounded=0;fontSize=18;entryX=1;entryY=0.5;entryDx=0;entryDy=0;" edge="1" parent="1" target="fB1HUZ4lTLVt3vPAVsF_-22">
          <mxGeometry width="50" height="50" relative="1" as="geometry">
            <mxPoint x="750" y="170" as="sourcePoint" />
            <mxPoint x="370" y="290" as="targetPoint" />
          </mxGeometry>
        </mxCell>
        <mxCell id="fB1HUZ4lTLVt3vPAVsF_-80" value="" style="endArrow=classic;html=1;rounded=0;fontSize=18;entryX=1;entryY=0.5;entryDx=0;entryDy=0;" edge="1" parent="1" target="fB1HUZ4lTLVt3vPAVsF_-21">
          <mxGeometry width="50" height="50" relative="1" as="geometry">
            <mxPoint x="750" y="170" as="sourcePoint" />
            <mxPoint x="370" y="290" as="targetPoint" />
          </mxGeometry>
        </mxCell>
        <mxCell id="fB1HUZ4lTLVt3vPAVsF_-90" value="" style="endArrow=classic;html=1;rounded=0;fontSize=18;entryX=1;entryY=0.5;entryDx=0;entryDy=0;" edge="1" parent="1" target="fB1HUZ4lTLVt3vPAVsF_-25">
          <mxGeometry width="50" height="50" relative="1" as="geometry">
            <mxPoint x="750" y="610" as="sourcePoint" />
            <mxPoint x="370" y="460" as="targetPoint" />
          </mxGeometry>
        </mxCell>
        <mxCell id="fB1HUZ4lTLVt3vPAVsF_-91" value="" style="endArrow=classic;html=1;rounded=0;fontSize=18;entryX=1;entryY=0.5;entryDx=0;entryDy=0;" edge="1" parent="1" target="fB1HUZ4lTLVt3vPAVsF_-24">
          <mxGeometry width="50" height="50" relative="1" as="geometry">
            <mxPoint x="750" y="610" as="sourcePoint" />
            <mxPoint x="370" y="460" as="targetPoint" />
          </mxGeometry>
        </mxCell>
        <mxCell id="fB1HUZ4lTLVt3vPAVsF_-92" value="" style="endArrow=classic;html=1;rounded=0;fontSize=18;entryX=1;entryY=0.5;entryDx=0;entryDy=0;" edge="1" parent="1" target="fB1HUZ4lTLVt3vPAVsF_-12">
          <mxGeometry width="50" height="50" relative="1" as="geometry">
            <mxPoint x="750" y="610" as="sourcePoint" />
            <mxPoint x="370" y="460" as="targetPoint" />
          </mxGeometry>
        </mxCell>
        <mxCell id="fB1HUZ4lTLVt3vPAVsF_-93" value="" style="endArrow=classic;html=1;rounded=0;fontSize=18;entryX=1;entryY=0.5;entryDx=0;entryDy=0;" edge="1" parent="1" target="fB1HUZ4lTLVt3vPAVsF_-19">
          <mxGeometry width="50" height="50" relative="1" as="geometry">
            <mxPoint x="750" y="610" as="sourcePoint" />
            <mxPoint x="370" y="460" as="targetPoint" />
          </mxGeometry>
        </mxCell>
        <mxCell id="fB1HUZ4lTLVt3vPAVsF_-94" value="" style="endArrow=classic;html=1;rounded=0;fontSize=18;entryX=1;entryY=0.5;entryDx=0;entryDy=0;" edge="1" parent="1" target="fB1HUZ4lTLVt3vPAVsF_-20">
          <mxGeometry width="50" height="50" relative="1" as="geometry">
            <mxPoint x="750" y="610" as="sourcePoint" />
            <mxPoint x="370" y="460" as="targetPoint" />
          </mxGeometry>
        </mxCell>
        <mxCell id="fB1HUZ4lTLVt3vPAVsF_-95" value="" style="endArrow=classic;html=1;rounded=0;fontSize=18;entryX=1;entryY=0.5;entryDx=0;entryDy=0;" edge="1" parent="1" target="fB1HUZ4lTLVt3vPAVsF_-18">
          <mxGeometry width="50" height="50" relative="1" as="geometry">
            <mxPoint x="750" y="608" as="sourcePoint" />
            <mxPoint x="690" y="660" as="targetPoint" />
          </mxGeometry>
        </mxCell>
        <mxCell id="fB1HUZ4lTLVt3vPAVsF_-96" value="" style="endArrow=classic;html=1;rounded=0;fontSize=18;exitX=1;exitY=0.5;exitDx=0;exitDy=0;entryX=1;entryY=0.5;entryDx=0;entryDy=0;" edge="1" parent="1" source="fB1HUZ4lTLVt3vPAVsF_-17" target="fB1HUZ4lTLVt3vPAVsF_-17">
          <mxGeometry width="50" height="50" relative="1" as="geometry">
            <mxPoint x="320" y="510" as="sourcePoint" />
            <mxPoint x="720" y="610" as="targetPoint" />
            <Array as="points">
              <mxPoint x="750" y="610" />
            </Array>
          </mxGeometry>
        </mxCell>
        <mxCell id="fB1HUZ4lTLVt3vPAVsF_-97" value="" style="endArrow=classic;html=1;rounded=0;fontSize=18;entryX=1;entryY=0.5;entryDx=0;entryDy=0;" edge="1" parent="1" target="fB1HUZ4lTLVt3vPAVsF_-19">
          <mxGeometry width="50" height="50" relative="1" as="geometry">
            <mxPoint x="750" y="170" as="sourcePoint" />
            <mxPoint x="370" y="460" as="targetPoint" />
          </mxGeometry>
        </mxCell>
        <mxCell id="fB1HUZ4lTLVt3vPAVsF_-98" value="" style="endArrow=classic;html=1;rounded=0;fontSize=18;entryX=1;entryY=0.5;entryDx=0;entryDy=0;" edge="1" parent="1" target="fB1HUZ4lTLVt3vPAVsF_-12">
          <mxGeometry width="50" height="50" relative="1" as="geometry">
            <mxPoint x="750" y="170" as="sourcePoint" />
            <mxPoint x="370" y="460" as="targetPoint" />
          </mxGeometry>
        </mxCell>
        <mxCell id="fB1HUZ4lTLVt3vPAVsF_-99" value="" style="endArrow=classic;html=1;rounded=0;fontSize=18;entryX=1;entryY=0.5;entryDx=0;entryDy=0;" edge="1" parent="1" target="fB1HUZ4lTLVt3vPAVsF_-24">
          <mxGeometry width="50" height="50" relative="1" as="geometry">
            <mxPoint x="750" y="170" as="sourcePoint" />
            <mxPoint x="370" y="460" as="targetPoint" />
          </mxGeometry>
        </mxCell>
        <mxCell id="fB1HUZ4lTLVt3vPAVsF_-100" value="" style="endArrow=classic;html=1;rounded=0;fontSize=18;entryX=1;entryY=0.5;entryDx=0;entryDy=0;" edge="1" parent="1" target="fB1HUZ4lTLVt3vPAVsF_-25">
          <mxGeometry width="50" height="50" relative="1" as="geometry">
            <mxPoint x="750" y="170" as="sourcePoint" />
            <mxPoint x="370" y="460" as="targetPoint" />
          </mxGeometry>
        </mxCell>
      </root>
    </mxGraphModel>
  </diagram>
</mxfile>
