<svg width="30.000000" height="30.000000" viewBox="0 0 30 30" fill="none" xmlns="http://www.w3.org/2000/svg" xmlns:xlink="http://www.w3.org/1999/xlink">
	<desc>
			Created with Pixso.
	</desc>
	<defs/>
	<path id="Vector" d="M14.9822 0C17.0559 0 19.0049 0.393555 20.8284 1.17969C22.6519 1.9668 24.2432 3.03906 25.6018 4.39844C26.9607 5.75684 28.0334 7.3418 28.8201 9.15332C29.6067 10.9658 30 12.9082 30 14.9824C30 17.0557 29.6067 19.0049 28.8201 20.8281C28.0334 22.6523 26.9607 24.2432 25.6018 25.6016C24.2432 26.9609 22.6519 28.0332 20.8284 28.8203C19.0049 29.6064 17.0559 30 14.9822 30C12.9082 30 10.9653 29.6064 9.15381 28.8203C7.34204 28.0332 5.75684 26.9609 4.39819 25.6016C3.03931 24.2432 1.96655 22.6523 1.17993 20.8281C0.393311 19.0049 0 17.0557 0 14.9824C0 12.9082 0.393311 10.9658 1.17993 9.15332C1.96655 7.3418 3.03931 5.75684 4.39819 4.39844C5.75684 3.03906 7.34204 1.9668 9.15381 1.17969C10.9653 0.393555 12.9082 0 14.9822 0ZM20.6316 6.54395L17.4495 6.54395C16.8296 6.54395 16.2576 6.65039 15.7329 6.86523C15.2085 7.08008 14.7498 7.36621 14.3564 7.72363C13.9631 8.08105 13.6592 8.48633 13.4446 8.93945C13.23 9.39258 13.1228 9.84473 13.1228 10.2979L13.1228 12.1934L10.2979 12.1934L10.2979 15.9121L13.1228 15.9121L13.1228 23.4209L16.8772 23.4209L16.8772 15.9121L19.6663 15.9121L19.6663 12.1934L16.8772 12.1934L16.8772 11.2275C16.8772 10.9414 16.9905 10.7148 17.217 10.5479C17.4434 10.3818 17.6401 10.2979 17.8069 10.2979L20.6316 10.2979L20.6316 6.54395Z" fill="#252525" fill-opacity="1.000000" fill-rule="nonzero"/>
</svg>
