<svg width="151.861328" height="34.199951" viewBox="0 0 151.861 34.2" fill="none" xmlns="http://www.w3.org/2000/svg" xmlns:xlink="http://www.w3.org/1999/xlink">
	<desc>
			Created with Pixso.
	</desc>
	<defs/>
	<path d="M0 34.2L34.2 34.2L34.2 0L0 0L0 34.2ZM27.6174 13.8093L20.3906 13.8093L20.3906 6.58276L27.6174 6.58276L27.6174 13.8093ZM6.5813 6.58276L13.812 6.58276L13.812 20.3906L27.6174 20.3906L27.6174 27.6174L6.5813 27.6174L6.5813 6.58276ZM56.4707 0C53.0886 0 49.7825 1.00293 46.9705 2.88184C44.1582 4.76074 41.9666 7.4314 40.6724 10.5562C39.3779 13.6809 39.0396 17.1189 39.6992 20.436C40.3591 23.7532 41.9875 26.8 44.3792 29.1914C46.7705 31.583 49.8174 33.2117 53.1345 33.8716C56.4517 34.5312 59.8899 34.1926 63.0146 32.8984C66.1392 31.6042 68.8098 29.4124 70.6887 26.6003C72.5679 23.7881 73.5708 20.4819 73.5708 17.1001C73.5654 12.5664 71.762 8.21997 68.5564 5.0144C65.3506 1.80859 61.0044 0.00537109 56.4707 0ZM56.4707 27.6174C54.3906 27.6174 52.3572 27.0005 50.6274 25.8447C48.8979 24.6892 47.5498 23.0466 46.7539 21.1248C45.958 19.2031 45.7495 17.0884 46.1553 15.0481C46.5613 13.0081 47.563 11.134 49.0337 9.66309C50.5046 8.19214 52.3787 7.19067 54.4189 6.78467C56.459 6.37891 58.5737 6.58716 60.4956 7.3833C62.4172 8.1792 64.0598 9.52734 65.2156 11.2568C66.3713 12.9863 66.988 15.0198 66.988 17.1001C66.9836 19.8882 65.8743 22.5608 63.9028 24.5322C61.9314 26.5037 59.2588 27.613 56.4707 27.6174ZM134.763 0C131.38 -0.000244141 128.074 1.00244 125.262 2.88135C122.45 4.76001 120.258 7.43066 118.963 10.5552C117.669 13.6797 117.33 17.1182 117.99 20.4353C118.649 23.7524 120.278 26.7996 122.669 29.1912C125.061 31.5828 128.108 33.2114 131.425 33.8713C134.741 34.5312 138.18 34.1926 141.305 32.8984C144.429 31.6042 147.1 29.4126 148.979 26.6003C150.859 23.7883 151.861 20.4822 151.861 17.1001C151.856 12.5667 150.053 8.22046 146.848 5.01489C143.643 1.80908 139.296 0.00561523 134.763 0ZM134.763 27.6174C132.683 27.6177 130.649 27.001 128.919 25.8455C127.189 24.6899 125.841 23.0474 125.045 21.1257C124.249 19.2041 124.04 17.0891 124.446 15.0488C124.852 13.0088 125.853 11.1348 127.324 9.66357C128.795 8.19263 130.669 7.19067 132.709 6.78491C134.749 6.37891 136.864 6.58716 138.785 7.38306C140.708 8.1792 142.351 9.5271 143.507 11.2568C144.661 12.9863 145.279 15.0198 145.279 17.1001C145.275 19.8879 144.165 22.5603 142.193 24.5317C140.223 26.5032 137.551 27.6128 134.763 27.6174ZM95.616 0C92.2339 0 88.9277 1.00293 86.1157 2.88184C83.3037 4.76074 81.1118 7.4314 79.8176 10.5562C78.5234 13.6809 78.1848 17.1189 78.8445 20.436C79.5044 23.7532 81.1331 26.8 83.5244 29.1914C85.916 31.583 88.9629 33.2117 92.2798 33.8716C95.5969 34.5312 99.0352 34.1926 102.16 32.8984C105.285 31.6042 107.955 29.4124 109.834 26.6003C111.713 23.7881 112.716 20.4819 112.716 17.1001C112.711 12.5664 110.907 8.21997 107.702 5.0144C104.496 1.80859 100.15 0.00537109 95.616 0ZM95.616 27.6174C93.678 27.6182 91.7773 27.0837 90.1238 26.0728C88.4705 25.0615 87.1287 23.6135 86.2463 21.8879C85.3643 20.1624 84.9758 18.2263 85.1243 16.2942C85.2729 14.3618 85.9524 12.5081 87.0879 10.9375C88.2234 9.36694 89.771 8.14087 91.5593 7.39429C93.3479 6.64771 95.3079 6.40991 97.2229 6.70703C99.1382 7.00415 100.934 7.82446 102.412 9.07788C103.89 10.3313 104.994 11.9688 105.6 13.8093L95.616 13.8093L95.616 20.3906L105.6 20.3906C104.906 22.491 103.567 24.3196 101.775 25.6167C99.9832 26.9138 97.8284 27.6138 95.616 27.6174Z" fill="#252525" fill-opacity="1.000000" fill-rule="nonzero"/>
</svg>
