<svg width="50.000000" height="50.000000" viewBox="0 0 50 50" fill="none" xmlns="http://www.w3.org/2000/svg" xmlns:xlink="http://www.w3.org/1999/xlink">
	<desc>
			Created with Pixso.
	</desc>
	<defs/>
	<path d="M24.9702 0C28.4348 0 31.6807 0.657104 34.7073 1.97131C37.7339 3.28552 40.3823 5.06775 42.6523 7.31775C44.9224 9.56787 46.7144 12.2063 48.0286 15.233C49.3428 18.2596 50 21.5054 50 24.9701C50 28.4349 49.3428 31.6807 48.0286 34.7073C46.7144 37.734 44.9224 40.3823 42.6523 42.6523C40.3823 44.9224 37.7339 46.7145 34.7073 48.0287C31.6807 49.3429 28.4348 50 24.9702 50C21.5054 50 18.2598 49.3429 15.2329 48.0287C12.2063 46.7145 9.56787 44.9224 7.31787 42.6523C5.06763 40.3823 3.28564 37.734 1.97144 34.7073C0.657227 31.6807 0 28.4349 0 24.9701C0 21.5054 0.657227 18.2596 1.97144 15.233C3.28564 12.2063 5.06763 9.56787 7.31787 7.31775C9.56787 5.06775 12.2063 3.28552 15.2329 1.97131C18.2598 0.657104 21.5054 0 24.9702 0ZM37.3955 19.5938C38.5503 18.7177 39.5659 17.6622 40.4421 16.4277C39.8845 16.6666 39.3169 16.8658 38.7395 17.0251C38.1621 17.1844 37.5547 17.3038 36.9175 17.3835C37.5547 16.9852 38.1123 16.4974 38.5901 15.9199C39.0681 15.3425 39.4065 14.7152 39.6057 14.0382C39.0083 14.3568 38.3911 14.6455 37.7539 14.9044C37.1167 15.1633 36.4595 15.3524 35.7825 15.4719C35.2251 14.9144 34.5679 14.4564 33.8113 14.098C33.0544 13.7395 32.2183 13.5603 31.3022 13.5603C30.4661 13.5603 29.6794 13.7196 28.9426 14.0382C28.2058 14.3568 27.5686 14.7949 27.031 15.3524C26.4934 15.91 26.0654 16.5571 25.7468 17.2939C25.4282 18.0306 25.2688 18.8173 25.2688 19.6536C25.2688 19.8925 25.2788 20.1315 25.2986 20.3704C25.3186 20.6094 25.3484 20.8284 25.3882 21.0275C22.8794 20.908 20.5496 20.2908 18.3989 19.1757C16.2485 18.0605 14.4165 16.5671 12.9033 14.6953C12.3457 15.6113 12.0669 16.6268 12.0669 17.7419C12.0669 18.7773 12.3159 19.7432 12.8137 20.6392C13.3115 21.5353 13.9585 22.2621 14.7551 22.8196C13.7197 22.74 12.8037 22.4811 12.0071 22.043L12.0071 22.1028C12.0071 23.6161 12.4751 24.9204 13.4109 26.0155C14.3469 27.1107 15.5117 27.7977 16.9055 28.0764C16.627 28.1561 16.3579 28.2158 16.0991 28.2556C15.8403 28.2955 15.5715 28.3154 15.2927 28.3154C15.0935 28.3154 14.9045 28.3054 14.7251 28.2855C14.5459 28.2656 14.3569 28.2357 14.1577 28.1959C14.5559 29.3906 15.2629 30.3864 16.2783 31.1827C17.2939 31.9792 18.4788 32.3776 19.8328 32.3776C18.7974 33.2139 17.6323 33.861 16.3381 34.319C15.0437 34.777 13.6997 35.006 12.3059 35.006C12.0271 35.006 11.7683 34.996 11.5293 34.9761C11.2903 34.9562 11.0513 34.9263 10.8125 34.8865C12.1665 35.7627 13.6301 36.4397 15.2031 36.9176C16.7761 37.3955 18.4189 37.6344 20.1313 37.6344C22.9192 37.6344 25.3882 37.1067 27.5388 36.0514C29.6895 34.996 31.4915 33.642 32.9451 31.9893C34.3987 30.3365 35.5037 28.4846 36.2605 26.4337C37.0171 24.3827 37.3955 22.3616 37.3955 20.3704L37.3955 19.5938Z" fill="#FFFFFF" fill-opacity="1.000000" fill-rule="nonzero"/>
</svg>
