<svg width="30.000000" height="30.000000" viewBox="0 0 30 30" fill="none" xmlns="http://www.w3.org/2000/svg" xmlns:xlink="http://www.w3.org/1999/xlink">
	<desc>
			Created with Pixso.
	</desc>
	<defs/>
	<path id="Vector" d="M14.9822 0C17.061 0 19.0083 0.394531 20.8245 1.18262C22.6404 1.97168 24.2295 3.04102 25.5913 4.39062C26.9534 5.74121 28.0286 7.32422 28.8171 9.13965C29.6057 10.9561 30 12.9033 30 14.9824C30 17.0605 29.6057 19.0088 28.8171 20.8242C28.0286 22.6406 26.9534 24.2295 25.5913 25.5918C24.2295 26.9531 22.6404 28.0283 20.8245 28.8174C19.0083 29.6055 17.061 30 14.9822 30C12.9033 30 10.9558 29.6055 9.13989 28.8174C7.32373 28.0283 5.74072 26.9531 4.39062 25.5918C3.04053 24.2295 1.97144 22.6406 1.18286 20.8242C0.394287 19.0088 0 17.0605 0 14.9824C0 12.9033 0.394287 10.9561 1.18286 9.13965C1.97144 7.32422 3.04053 5.74121 4.39062 4.39062C5.74072 3.04102 7.32373 1.97168 9.13989 1.18262C10.9558 0.394531 12.9033 0 14.9822 0ZM14.9822 23.4404C16.1528 23.4404 17.2522 23.2197 18.2795 22.7773C19.3071 22.3359 20.2031 21.7324 20.9678 20.9678C21.7324 20.2031 22.3357 19.3066 22.7778 18.2793C23.2197 17.252 23.4409 16.1533 23.4409 14.9824C23.4409 13.8115 23.2197 12.7178 22.7778 11.7021C22.3357 10.6865 21.7324 9.79688 20.9678 9.03223C20.2031 8.26758 19.3071 7.66406 18.2795 7.22266C17.2522 6.78027 16.1528 6.55957 14.9822 6.55957C13.8352 6.55957 12.7478 6.78027 11.7205 7.22266C10.6929 7.66406 9.79688 8.26758 9.03223 9.03223C8.26758 9.79688 7.66431 10.6865 7.22217 11.7021C6.78027 12.7178 6.55908 13.8115 6.55908 14.9824C6.55908 16.1533 6.78027 17.252 7.22217 18.2793C7.66431 19.3066 8.26758 20.2031 9.03223 20.9678C9.79688 21.7324 10.6929 22.3359 11.7205 22.7773C12.7478 23.2197 13.8352 23.4404 14.9822 23.4404ZM15.699 15.2334C14.4802 15.6396 13.3752 16.2246 12.3835 16.9893C11.3918 17.7539 10.5376 18.6738 9.8208 19.749C8.69775 18.5068 8.07642 17.0254 7.95703 15.3047C8.14819 15.3281 8.32129 15.3408 8.47681 15.3408L8.96069 15.3408C11.1589 15.3408 13.2617 14.9697 15.2688 14.2295L15.4839 14.7314L15.699 15.2334ZM16.595 13.6914C18.1003 13.0225 19.4983 12.1387 20.7886 11.0391C21.6011 12.21 22.0071 13.5127 22.0071 14.9463C21.0991 14.7314 20.2151 14.624 19.3547 14.624C18.5664 14.624 17.8018 14.707 17.061 14.875C16.9893 14.6836 16.9175 14.4863 16.8459 14.2832C16.7742 14.0801 16.6907 13.8828 16.595 13.6914ZM10.896 20.7168C11.5173 19.7129 12.282 18.8594 13.1899 18.1543C14.0979 17.4492 15.0896 16.918 16.1648 16.5596C16.4277 17.3711 16.6428 18.2021 16.8101 19.0498C16.9773 19.8984 17.1086 20.7646 17.2043 21.6484C16.5112 21.8877 15.7705 22.0068 14.9822 22.0068C13.4768 22.0068 12.1147 21.5771 10.896 20.7168ZM17.5269 16.2012C18.196 16.0811 18.8052 16.0215 19.3547 16.0215C20.239 16.0215 21.0752 16.1406 21.8638 16.3799C21.6726 17.3594 21.2903 18.2559 20.7168 19.0684C20.1433 19.8809 19.4265 20.5381 18.5664 21.0391C18.3989 19.415 18.0525 17.8018 17.5269 16.2012ZM19.8926 9.96387C19.2712 10.4658 18.6379 10.9258 17.9929 11.3438C17.3477 11.7627 16.6787 12.127 15.9856 12.4375C15.5793 11.6963 15.1433 10.9736 14.6775 10.2686C14.2114 9.56348 13.7036 8.87695 13.1541 8.20801C13.7275 8.04102 14.3369 7.95703 14.9822 7.95703C15.9141 7.95703 16.7981 8.12988 17.6345 8.47656C18.4707 8.82324 19.2234 9.31934 19.8926 9.96387ZM14.6594 12.9746C12.8196 13.6201 10.9199 13.9424 8.96069 13.9424L8.47681 13.9424L8.06445 13.9072C8.23169 12.8076 8.63794 11.8037 9.2832 10.8965C9.92822 9.98828 10.7527 9.27148 11.7563 8.74512C12.8794 10.0361 13.8472 11.4453 14.6594 12.9746Z" fill="#252525" fill-opacity="1.000000" fill-rule="nonzero"/>
</svg>
