<?xml version="1.0" encoding="utf-8"?>
<!-- Generator: Adobe Illustrator 21.1.0, SVG Export Plug-In . SVG Version: 6.00 Build 0)  -->
<svg version="1.1" id="Ebene_1" xmlns="http://www.w3.org/2000/svg" xmlns:xlink="http://www.w3.org/1999/xlink" x="0px" y="0px"
	 viewBox="0 0 111.5 111.5" style="enable-background:new 0 0 111.5 111.5;" xml:space="preserve">
<style type="text/css">
	.st0{fill:#FFFFFF;}
</style>
<title>logo_1</title>
<g id="Ebene_2">
	<g id="Ebene_6">
		<path class="st0" d="M55.8,15c22.5,0,40.8,18.2,40.8,40.8S78.3,96.5,55.8,96.5S15,78.3,15,55.8C15,33.3,33.3,15,55.8,15 M55.8,0
			C25,0,0,25,0,55.8s25,55.8,55.8,55.8s55.8-25,55.8-55.8S86.5,0,55.8,0z"/>
		<path class="st0" d="M55.8,82.2C44.6,82.1,34.7,75,31,64.5h49.5C76.8,75,66.9,82.1,55.8,82.2z"/>
		<polygon class="st0" points="100.5,84 111.5,111.5 84.5,101.7 		"/>
	</g>
</g>
</svg>
