<?xml version="1.0" encoding="UTF-8"?>
<glyph name="F" format="2">
	<unicode hex="0046"/>
	<advance width="1059"/>
	<outline>
		<contour>
			<point x="197" y="677" type="line"/>
			<point x="198" y="27" type="line" smooth="yes"/>
			<point x="198" y="6"/>
			<point x="182" y="-11"/>
			<point x="161" y="-11" type="curve" smooth="yes"/>
			<point x="140" y="-11"/>
			<point x="123" y="6"/>
			<point x="123" y="27" type="curve" smooth="yes"/>
			<point x="120" y="1321" type="line" smooth="yes"/>
			<point x="120" y="1342"/>
			<point x="136" y="1359"/>
			<point x="157" y="1359" type="curve" smooth="yes"/>
			<point x="971" y="1360" type="line" smooth="yes"/>
			<point x="992" y="1360"/>
			<point x="1009" y="1343"/>
			<point x="1009" y="1322" type="curve" smooth="yes"/>
			<point x="1009" y="1301"/>
			<point x="992" y="1285"/>
			<point x="971" y="1285" type="curve" smooth="yes"/>
			<point x="195" y="1284" type="line"/>
			<point x="196" y="751" type="line"/>
			<point x="785" y="757" type="line"/>
			<point x="786" y="757" type="line" smooth="yes"/>
			<point x="807" y="757"/>
			<point x="823" y="741"/>
			<point x="823" y="720" type="curve" smooth="yes"/>
			<point x="823" y="699"/>
			<point x="807" y="682"/>
			<point x="786" y="682" type="curve" smooth="yes"/>
		</contour>
	</outline>
	<lib>
		<dict>
			<key>org.fontforge.glyphclass</key>
			<string>baseglyph</string>
		</dict>
	</lib>
</glyph>
