<?xml version="1.0" encoding="UTF-8"?>
<glyph name="k3m1u2" format="2">
	<advance width="2051"/>
	<outline>
		<component base="uu_sign_drop" xOffset="1399" yOffset="132"/>
		<component base="k3m1"/>
	</outline>
	<lib>
		<dict>
			<key>org.fontforge.glyphclass</key>
			<string>baseligature</string>
		</dict>
	</lib>
</glyph>
