<?xml version="1.0" encoding="UTF-8"?>
<glyph name="oe" format="2">
	<unicode hex="0153"/>
	<advance width="1996"/>
	<outline>
		<contour>
			<point x="1897" y="548" type="curve" smooth="yes"/>
			<point x="1897" y="487"/>
			<point x="1878" y="435"/>
			<point x="1820" y="435" type="curve" smooth="yes"/>
			<point x="1091" y="434" type="line"/>
			<point x="1122" y="268"/>
			<point x="1265" y="126"/>
			<point x="1451" y="126" type="curve" smooth="yes"/>
			<point x="1556" y="126"/>
			<point x="1665" y="176"/>
			<point x="1731" y="257" type="curve" smooth="yes"/>
			<point x="1743" y="273"/>
			<point x="1770" y="285"/>
			<point x="1790" y="285" type="curve" smooth="yes"/>
			<point x="1831" y="285"/>
			<point x="1865" y="251"/>
			<point x="1865" y="210" type="curve" smooth="yes"/>
			<point x="1865" y="195"/>
			<point x="1857" y="174"/>
			<point x="1847" y="162" type="curve" smooth="yes"/>
			<point x="1751" y="44"/>
			<point x="1604" y="-24"/>
			<point x="1453" y="-24" type="curve" smooth="yes"/>
			<point x="1257" y="-24"/>
			<point x="1096" y="86"/>
			<point x="1011" y="229" type="curve"/>
			<point x="931" y="90"/>
			<point x="770" y="-20"/>
			<point x="591" y="-20" type="curve" smooth="yes"/>
			<point x="319" y="-20"/>
			<point x="100" y="220"/>
			<point x="100" y="498" type="curve" smooth="yes"/>
			<point x="100" y="777"/>
			<point x="314" y="1019"/>
			<point x="592" y="1019" type="curve" smooth="yes"/>
			<point x="769" y="1019"/>
			<point x="929" y="912"/>
			<point x="1009" y="775" type="curve"/>
			<point x="1090" y="911"/>
			<point x="1249" y="1017"/>
			<point x="1428" y="1017" type="curve" smooth="yes"/>
			<point x="1682" y="1017"/>
			<point x="1897" y="808"/>
		</contour>
		<contour>
			<point x="592" y="869" type="curve" smooth="yes"/>
			<point x="399" y="869"/>
			<point x="250" y="696"/>
			<point x="250" y="499" type="curve" smooth="yes"/>
			<point x="250" y="302"/>
			<point x="401" y="130"/>
			<point x="591" y="130" type="curve" smooth="yes"/>
			<point x="783" y="130"/>
			<point x="933" y="306"/>
			<point x="933" y="500" type="curve" smooth="yes"/>
			<point x="933" y="694"/>
			<point x="784" y="869"/>
		</contour>
		<contour>
			<point x="1744" y="585" type="line"/>
			<point x="1725" y="741"/>
			<point x="1593" y="867"/>
			<point x="1429" y="867" type="curve" smooth="yes"/>
			<point x="1258" y="867"/>
			<point x="1126" y="737"/>
			<point x="1093" y="584" type="curve"/>
		</contour>
	</outline>
</glyph>
