<?xml version="1.0" encoding="UTF-8"?>
<glyph name="l3cil" format="2">
	<unicode hex="0D7D"/>
	<advance width="2082"/>
	<outline>
		<contour>
			<point x="556" y="386" type="curve" smooth="yes"/>
			<point x="556" y="620"/>
			<point x="689" y="791"/>
			<point x="835" y="891" type="curve"/>
			<point x="766" y="921"/>
			<point x="698" y="941"/>
			<point x="634" y="941" type="curve" smooth="yes"/>
			<point x="383" y="941"/>
			<point x="170" y="731"/>
			<point x="170" y="465" type="curve" smooth="yes"/>
			<point x="170" y="280"/>
			<point x="280" y="127"/>
			<point x="405" y="55" type="curve" smooth="yes"/>
			<point x="417" y="48"/>
			<point x="423" y="39"/>
			<point x="423" y="27" type="curve" smooth="yes"/>
			<point x="423" y="7"/>
			<point x="410" y="-10"/>
			<point x="391" y="-10" type="curve" smooth="yes"/>
			<point x="383" y="-10"/>
			<point x="376" y="-9"/>
			<point x="370" y="-6" type="curve"/>
			<point x="226" y="77"/>
			<point x="100" y="252"/>
			<point x="100" y="464" type="curve" smooth="yes"/>
			<point x="100" y="775"/>
			<point x="353" y="1011"/>
			<point x="639" y="1011" type="curve" smooth="yes"/>
			<point x="726" y="1011"/>
			<point x="817" y="983"/>
			<point x="907" y="934" type="curve"/>
			<point x="1014" y="990"/>
			<point x="1137" y="1013"/>
			<point x="1261" y="1013" type="curve" smooth="yes"/>
			<point x="1374" y="1013"/>
			<point x="1487" y="995"/>
			<point x="1591" y="946" type="curve"/>
			<point x="1602" y="987"/>
			<point x="1607" y="1024"/>
			<point x="1607" y="1060" type="curve" smooth="yes"/>
			<point x="1607" y="1196"/>
			<point x="1511" y="1310"/>
			<point x="1385" y="1334" type="curve" smooth="yes"/>
			<point x="1366" y="1337"/>
			<point x="1356" y="1349"/>
			<point x="1356" y="1370" type="curve" smooth="yes"/>
			<point x="1356" y="1389"/>
			<point x="1376" y="1408"/>
			<point x="1398" y="1403" type="curve" smooth="yes"/>
			<point x="1556" y="1373"/>
			<point x="1678" y="1232"/>
			<point x="1678" y="1063" type="curve" smooth="yes"/>
			<point x="1678" y="1016"/>
			<point x="1670" y="966"/>
			<point x="1654" y="912" type="curve"/>
			<point x="1828" y="808"/>
			<point x="1982" y="620"/>
			<point x="1982" y="363" type="curve" smooth="yes"/>
			<point x="1982" y="173"/>
			<point x="1869" y="-9"/>
			<point x="1675" y="-9" type="curve" smooth="yes"/>
			<point x="1490" y="-9"/>
			<point x="1372" y="163"/>
			<point x="1372" y="347" type="curve" smooth="yes"/>
			<point x="1372" y="532"/>
			<point x="1514" y="738"/>
			<point x="1569" y="879" type="curve"/>
			<point x="1472" y="926"/>
			<point x="1366" y="943"/>
			<point x="1261" y="943" type="curve" smooth="yes"/>
			<point x="1163" y="943"/>
			<point x="1065" y="929"/>
			<point x="977" y="890" type="curve"/>
			<point x="1114" y="787"/>
			<point x="1220" y="615"/>
			<point x="1220" y="387" type="curve" smooth="yes"/>
			<point x="1220" y="189"/>
			<point x="1092" y="-9"/>
			<point x="886" y="-9" type="curve" smooth="yes"/>
			<point x="678" y="-9"/>
			<point x="556" y="184"/>
		</contour>
		<contour>
			<point x="906" y="853" type="curve"/>
			<point x="755" y="764"/>
			<point x="627" y="610"/>
			<point x="627" y="384" type="curve" smooth="yes"/>
			<point x="627" y="222"/>
			<point x="723" y="58"/>
			<point x="887" y="58" type="curve" smooth="yes"/>
			<point x="1050" y="58"/>
			<point x="1150" y="231"/>
			<point x="1150" y="392" type="curve" smooth="yes"/>
			<point x="1150" y="602"/>
			<point x="1052" y="759"/>
		</contour>
		<contour>
			<point x="1630" y="845" type="curve"/>
			<point x="1570" y="697"/>
			<point x="1443" y="511"/>
			<point x="1443" y="349" type="curve" smooth="yes"/>
			<point x="1443" y="204"/>
			<point x="1528" y="61"/>
			<point x="1676" y="61" type="curve" smooth="yes"/>
			<point x="1827" y="61"/>
			<point x="1914" y="216"/>
			<point x="1914" y="362" type="curve" smooth="yes"/>
			<point x="1914" y="582"/>
			<point x="1785" y="747"/>
		</contour>
	</outline>
	<lib>
		<dict>
			<key>org.fontforge.glyphclass</key>
			<string>baseligature</string>
		</dict>
	</lib>
</glyph>
