<?xml version="1.0" encoding="UTF-8"?>
<glyph name="ycircumflex" format="2">
	<unicode hex="0177"/>
	<advance width="1028"/>
	<outline>
		<component base="asciicircum" xOffset="139.0689655172" yOffset="141.1128526646"/>
		<component base="y"/>
	</outline>
</glyph>
