<?xml version="1.0" encoding="UTF-8"?>
<glyph name="paragraph" format="2">
	<unicode hex="00B6"/>
	<advance width="1007"/>
	<outline>
		<contour>
			<point x="840" y="1201" type="curve" smooth="yes"/>
			<point x="791" y="1201" type="line"/>
			<point x="791" y="47" type="line" smooth="yes"/>
			<point x="791" y="14"/>
			<point x="767" y="-15"/>
			<point x="725" y="-15" type="curve" smooth="yes"/>
			<point x="683" y="-15"/>
			<point x="656" y="14"/>
			<point x="656" y="47" type="curve" smooth="yes"/>
			<point x="656" y="1201" type="line"/>
			<point x="429" y="1201" type="line"/>
			<point x="429" y="47" type="line" smooth="yes"/>
			<point x="429" y="14"/>
			<point x="406" y="-15"/>
			<point x="364" y="-15" type="curve" smooth="yes"/>
			<point x="324" y="-15"/>
			<point x="296" y="14"/>
			<point x="296" y="47" type="curve" smooth="yes"/>
			<point x="296" y="788" type="line"/>
			<point x="180" y="821"/>
			<point x="100" y="928"/>
			<point x="100" y="1052" type="curve" smooth="yes"/>
			<point x="100" y="1201"/>
			<point x="227" y="1328"/>
			<point x="378" y="1328" type="curve" smooth="yes"/>
			<point x="840" y="1328" type="line" smooth="yes"/>
			<point x="880" y="1328"/>
			<point x="907" y="1303"/>
			<point x="907" y="1263" type="curve" smooth="yes"/>
			<point x="907" y="1223"/>
			<point x="880" y="1201"/>
		</contour>
	</outline>
</glyph>
