<?xml version="1.0" encoding="UTF-8"?>
<glyph name="bracketright" format="2">
	<unicode hex="005D"/>
	<advance width="735"/>
	<outline>
		<contour>
			<point x="601" y="1373" type="line" smooth="yes"/>
			<point x="621" y="1373"/>
			<point x="636" y="1358"/>
			<point x="636" y="1338" type="curve" smooth="yes"/>
			<point x="634" y="-325" type="line" smooth="yes"/>
			<point x="634" y="-345"/>
			<point x="619" y="-360"/>
			<point x="599" y="-360" type="curve" smooth="yes"/>
			<point x="249" y="-361" type="line"/>
			<point x="248" y="-361" type="line" smooth="yes"/>
			<point x="228" y="-361"/>
			<point x="213" y="-346"/>
			<point x="213" y="-326" type="curve" smooth="yes"/>
			<point x="213" y="-306"/>
			<point x="228" y="-291"/>
			<point x="248" y="-291" type="curve" smooth="yes"/>
			<point x="249" y="-291" type="line"/>
			<point x="565" y="-290" type="line"/>
			<point x="565" y="1303" type="line"/>
			<point x="247" y="1303" type="line" smooth="yes"/>
			<point x="227" y="1303"/>
			<point x="212" y="1318"/>
			<point x="212" y="1338" type="curve" smooth="yes"/>
			<point x="212" y="1358"/>
			<point x="227" y="1373"/>
			<point x="247" y="1373" type="curve" smooth="yes"/>
		</contour>
	</outline>
</glyph>
