<?xml version="1.0" encoding="UTF-8"?>
<glyph name="ecircumflex" format="2">
	<unicode hex="00EA"/>
	<advance width="1162"/>
	<outline>
		<component base="asciicircum" xOffset="207.0428422153" yOffset="184.5308254963"/>
		<component base="e"/>
	</outline>
</glyph>
