<?xml version="1.0" encoding="UTF-8"?>
<glyph name="k1th1u2" format="2">
	<advance width="3449"/>
	<outline>
		<contour>
			<point x="406" y="172" type="curve" smooth="yes"/>
			<point x="482" y="172"/>
			<point x="550" y="224"/>
			<point x="550" y="296" type="curve" smooth="yes"/>
			<point x="550" y="297"/>
			<point x="549" y="303"/>
			<point x="549" y="305" type="curve"/>
			<point x="533" y="354"/>
			<point x="525" y="403"/>
			<point x="524" y="454" type="curve"/>
			<point x="380" y="439"/>
			<point x="266" y="390"/>
			<point x="266" y="287" type="curve" smooth="yes"/>
			<point x="266" y="221"/>
			<point x="327" y="172"/>
		</contour>
		<contour>
			<point x="974" y="174" type="curve" smooth="yes"/>
			<point x="1136" y="174"/>
			<point x="1234" y="309"/>
			<point x="1240" y="464" type="curve"/>
			<point x="714" y="462" type="line"/>
			<point x="720" y="303"/>
			<point x="825" y="174"/>
		</contour>
		<contour>
			<point x="2495" y="178" type="curve" smooth="yes"/>
			<point x="2614" y="178"/>
			<point x="2693" y="286"/>
			<point x="2693" y="406" type="curve" smooth="yes"/>
			<point x="2693" y="544"/>
			<point x="2590" y="663"/>
			<point x="2498" y="726" type="curve"/>
			<point x="2380" y="660"/>
			<point x="2287" y="555"/>
			<point x="2287" y="412" type="curve" smooth="yes"/>
			<point x="2287" y="286"/>
			<point x="2376" y="178"/>
		</contour>
		<contour>
			<point x="1205" y="657" type="line"/>
			<point x="1161" y="748"/>
			<point x="1074" y="833"/>
			<point x="977" y="833" type="curve" smooth="yes"/>
			<point x="878" y="833"/>
			<point x="791" y="746"/>
			<point x="747" y="654" type="curve"/>
		</contour>
		<contour>
			<point x="2095" y="-30" type="curve"/>
			<point x="2704" y="-33" type="line" smooth="yes"/>
			<point x="2973" y="-31"/>
			<point x="3178" y="29"/>
			<point x="3178" y="193" type="curve" smooth="yes"/>
			<point x="3178" y="266"/>
			<point x="3119" y="329"/>
			<point x="3049" y="329" type="curve" smooth="yes"/>
			<point x="3007" y="329"/>
			<point x="2947" y="355"/>
			<point x="2947" y="414" type="curve" smooth="yes"/>
			<point x="2947" y="472"/>
			<point x="2980" y="517"/>
			<point x="3034" y="519" type="curve" smooth="yes"/>
			<point x="3102" y="521"/>
			<point x="3159" y="572"/>
			<point x="3159" y="632" type="curve" smooth="yes"/>
			<point x="3159" y="745"/>
			<point x="3022" y="832"/>
			<point x="2873" y="832" type="curve" smooth="yes"/>
			<point x="2811" y="832"/>
			<point x="2747" y="825"/>
			<point x="2699" y="816" type="curve"/>
			<point x="2821" y="697"/>
			<point x="2883" y="544"/>
			<point x="2883" y="384" type="curve" smooth="yes"/>
			<point x="2883" y="184"/>
			<point x="2726" y="-13"/>
			<point x="2494" y="-13" type="curve" smooth="yes"/>
			<point x="2250" y="-13"/>
			<point x="2096" y="194"/>
			<point x="2096" y="403" type="curve" smooth="yes"/>
			<point x="2096" y="581"/>
			<point x="2192" y="733"/>
			<point x="2300" y="826" type="curve"/>
			<point x="2263" y="834"/>
			<point x="2227" y="838"/>
			<point x="2191" y="838" type="curve" smooth="yes"/>
			<point x="1958" y="838"/>
			<point x="1772" y="683"/>
			<point x="1772" y="464" type="curve" smooth="yes"/>
			<point x="1772" y="304"/>
			<point x="1882" y="168"/>
			<point x="2033" y="146" type="curve" smooth="yes"/>
			<point x="2094" y="138"/>
			<point x="2139" y="107"/>
			<point x="2139" y="51" type="curve" smooth="yes"/>
			<point x="2139" y="21"/>
			<point x="2121" y="-12"/>
		</contour>
		<contour>
			<point x="1945" y="-28" type="line"/>
			<point x="1757" y="24"/>
			<point x="1625" y="199"/>
			<point x="1591" y="364" type="curve"/>
			<point x="1551" y="416"/>
			<point x="1498" y="432"/>
			<point x="1429" y="447" type="curve"/>
			<point x="1415" y="203"/>
			<point x="1246" y="-17"/>
			<point x="974" y="-17" type="curve" smooth="yes"/>
			<point x="858" y="-17"/>
			<point x="750" y="34"/>
			<point x="672" y="110" type="curve"/>
			<point x="613" y="33"/>
			<point x="522" y="-19"/>
			<point x="398" y="-19" type="curve" smooth="yes"/>
			<point x="223" y="-19"/>
			<point x="77" y="118"/>
			<point x="77" y="285" type="curve" smooth="yes"/>
			<point x="77" y="527"/>
			<point x="314" y="630"/>
			<point x="545" y="647" type="curve"/>
			<point x="601" y="853"/>
			<point x="747" y="1023"/>
			<point x="979" y="1023" type="curve" smooth="yes"/>
			<point x="1207" y="1023"/>
			<point x="1354" y="847"/>
			<point x="1409" y="645" type="curve"/>
			<point x="1478" y="634"/>
			<point x="1539" y="613"/>
			<point x="1595" y="583" type="curve"/>
			<point x="1656" y="844"/>
			<point x="1885" y="1026"/>
			<point x="2192" y="1026" type="curve" smooth="yes"/>
			<point x="2301" y="1026"/>
			<point x="2413" y="999"/>
			<point x="2508" y="952" type="curve"/>
			<point x="2615" y="995"/>
			<point x="2736" y="1022"/>
			<point x="2876" y="1022" type="curve" smooth="yes"/>
			<point x="3118" y="1022"/>
			<point x="3348" y="899"/>
			<point x="3348" y="645" type="curve" smooth="yes"/>
			<point x="3348" y="560"/>
			<point x="3319" y="486"/>
			<point x="3266" y="430" type="curve"/>
			<point x="3327" y="374"/>
			<point x="3369" y="296"/>
			<point x="3369" y="199" type="curve" smooth="yes"/>
			<point x="3369" y="-143"/>
			<point x="3003" y="-222"/>
			<point x="2658" y="-222" type="curve" smooth="yes"/>
			<point x="2514" y="-222" type="line"/>
			<point x="1985" y="-219" type="line"/>
			<point x="1973" y="-219" type="line" smooth="yes"/>
			<point x="1841" y="-219"/>
			<point x="1757" y="-227"/>
			<point x="1757" y="-277" type="curve" smooth="yes"/>
			<point x="1757" y="-315"/>
			<point x="1835" y="-332"/>
			<point x="1967" y="-332" type="curve" smooth="yes"/>
			<point x="1984" y="-332" type="line" smooth="yes"/>
			<point x="2004" y="-332"/>
			<point x="2018" y="-332"/>
			<point x="2024" y="-331" type="curve"/>
			<point x="2025" y="-331" type="line"/>
			<point x="3278" y="-328" type="line"/>
			<point x="3294" y="-328" type="line" smooth="yes"/>
			<point x="3341" y="-328"/>
			<point x="3375" y="-383"/>
			<point x="3375" y="-423" type="curve" smooth="yes"/>
			<point x="3375" y="-475"/>
			<point x="3332" y="-518"/>
			<point x="3280" y="-518" type="curve" smooth="yes"/>
			<point x="3279" y="-518" type="line"/>
			<point x="2027" y="-521" type="line"/>
			<point x="1915" y="-522" type="line" smooth="yes"/>
			<point x="1737" y="-519"/>
			<point x="1567" y="-455"/>
			<point x="1567" y="-277" type="curve" smooth="yes"/>
			<point x="1567" y="-96"/>
			<point x="1745" y="-28"/>
			<point x="1925" y="-28" type="curve" smooth="yes"/>
		</contour>
	</outline>
	<lib>
		<dict>
			<key>org.fontforge.glyphclass</key>
			<string>baseligature</string>
		</dict>
	</lib>
</glyph>
