<?xml version="1.0" encoding="UTF-8"?>
<glyph name="nhcil" format="2">
	<unicode hex="0D7A"/>
	<advance width="2769"/>
	<outline>
		<contour>
			<point x="1742" y="895" type="curve"/>
			<point x="1821" y="1006"/>
			<point x="1951" y="1095"/>
			<point x="2130" y="1095" type="curve" smooth="yes"/>
			<point x="2142" y="1095"/>
			<point x="2155" y="1094"/>
			<point x="2167" y="1093" type="curve"/>
			<point x="2154" y="1154"/>
			<point x="2120" y="1213"/>
			<point x="2074" y="1253" type="curve" smooth="yes"/>
			<point x="2054" y="1270"/>
			<point x="2039" y="1304"/>
			<point x="2039" y="1330" type="curve" smooth="yes"/>
			<point x="2039" y="1385"/>
			<point x="2084" y="1430"/>
			<point x="2139" y="1430" type="curve" smooth="yes"/>
			<point x="2161" y="1430"/>
			<point x="2189" y="1419"/>
			<point x="2205" y="1405" type="curve" smooth="yes"/>
			<point x="2312" y="1313"/>
			<point x="2373" y="1177"/>
			<point x="2373" y="1037" type="curve" smooth="yes"/>
			<point x="2373" y="1032" type="line"/>
			<point x="2562" y="929"/>
			<point x="2694" y="709"/>
			<point x="2694" y="445" type="curve" smooth="yes"/>
			<point x="2694" y="210"/>
			<point x="2553" y="-16"/>
			<point x="2308" y="-16" type="curve" smooth="yes"/>
			<point x="2089" y="-16"/>
			<point x="1949" y="172"/>
			<point x="1949" y="384" type="curve" smooth="yes"/>
			<point x="1949" y="609"/>
			<point x="2075" y="737"/>
			<point x="2140" y="894" type="curve"/>
			<point x="2137" y="894"/>
			<point x="2133" y="895"/>
			<point x="2130" y="895" type="curve" smooth="yes"/>
			<point x="1906" y="895"/>
			<point x="1837" y="708"/>
			<point x="1837" y="479" type="curve" smooth="yes"/>
			<point x="1837" y="459" type="line"/>
			<point x="1839" y="81" type="line"/>
			<point x="1839" y="80" type="line" smooth="yes"/>
			<point x="1839" y="25"/>
			<point x="1794" y="-19"/>
			<point x="1739" y="-19" type="curve" smooth="yes"/>
			<point x="1685" y="-19"/>
			<point x="1640" y="25"/>
			<point x="1639" y="79" type="curve" smooth="yes"/>
			<point x="1636" y="454" type="line" smooth="yes"/>
			<point x="1634" y="658"/>
			<point x="1601" y="895"/>
			<point x="1402" y="895" type="curve" smooth="yes"/>
			<point x="1215" y="895"/>
			<point x="1165" y="691"/>
			<point x="1164" y="498" type="curve"/>
			<point x="1164" y="482"/>
			<point x="1165" y="466"/>
			<point x="1165" y="450" type="curve" smooth="yes"/>
			<point x="1167" y="81" type="line" smooth="yes"/>
			<point x="1167" y="26"/>
			<point x="1122" y="-19"/>
			<point x="1067" y="-19" type="curve" smooth="yes"/>
			<point x="1013" y="-19"/>
			<point x="968" y="25"/>
			<point x="967" y="79" type="curve" smooth="yes"/>
			<point x="966" y="216"/>
			<point x="964" y="353"/>
			<point x="964" y="490" type="curve" smooth="yes"/>
			<point x="964" y="497" type="line" smooth="yes"/>
			<point x="959" y="721"/>
			<point x="872" y="899"/>
			<point x="648" y="899" type="curve" smooth="yes"/>
			<point x="471" y="899"/>
			<point x="333" y="757"/>
			<point x="291" y="601" type="curve"/>
			<point x="350" y="645"/>
			<point x="422" y="669"/>
			<point x="496" y="669" type="curve" smooth="yes"/>
			<point x="687" y="669"/>
			<point x="839" y="520"/>
			<point x="839" y="327" type="curve" smooth="yes"/>
			<point x="839" y="132"/>
			<point x="691" y="-14"/>
			<point x="496" y="-14" type="curve" smooth="yes"/>
			<point x="229" y="-14"/>
			<point x="75" y="217"/>
			<point x="75" y="479" type="curve" smooth="yes"/>
			<point x="75" y="806"/>
			<point x="319" y="1099"/>
			<point x="647" y="1099" type="curve" smooth="yes"/>
			<point x="829" y="1099"/>
			<point x="973" y="1005"/>
			<point x="1055" y="891" type="curve"/>
			<point x="1120" y="995"/>
			<point x="1241" y="1095"/>
			<point x="1401" y="1095" type="curve" smooth="yes"/>
			<point x="1559" y="1095"/>
			<point x="1677" y="998"/>
		</contour>
		<contour>
			<point x="2328" y="822" type="curve"/>
			<point x="2271" y="683"/>
			<point x="2149" y="546"/>
			<point x="2149" y="386" type="curve" smooth="yes"/>
			<point x="2149" y="283"/>
			<point x="2206" y="184"/>
			<point x="2308" y="184" type="curve" smooth="yes"/>
			<point x="2436" y="184"/>
			<point x="2494" y="320"/>
			<point x="2494" y="448" type="curve" smooth="yes"/>
			<point x="2494" y="610"/>
			<point x="2428" y="744"/>
		</contour>
		<contour>
			<point x="497" y="469" type="curve" smooth="yes"/>
			<point x="416" y="469"/>
			<point x="353" y="407"/>
			<point x="353" y="326" type="curve" smooth="yes"/>
			<point x="353" y="243"/>
			<point x="410" y="186"/>
			<point x="495" y="186" type="curve" smooth="yes"/>
			<point x="578" y="186"/>
			<point x="639" y="245"/>
			<point x="639" y="328" type="curve" smooth="yes"/>
			<point x="639" y="406"/>
			<point x="575" y="469"/>
		</contour>
	</outline>
	<lib>
		<dict>
			<key>org.fontforge.glyphclass</key>
			<string>baseglyph</string>
		</dict>
	</lib>
</glyph>
