<?xml version="1.0" encoding="UTF-8"?>
<glyph name="r3u2" format="2">
	<advance width="2178"/>
	<outline>
		<contour>
			<point x="1032" y="1092" type="curve" smooth="yes"/>
			<point x="1133" y="1092"/>
			<point x="1210" y="1070"/>
			<point x="1285" y="1034" type="curve"/>
			<point x="1374" y="1073"/>
			<point x="1471" y="1093"/>
			<point x="1568" y="1093" type="curve" smooth="yes"/>
			<point x="1841" y="1093"/>
			<point x="2095" y="937"/>
			<point x="2095" y="660" type="curve" smooth="yes"/>
			<point x="2095" y="555"/>
			<point x="2045" y="453"/>
			<point x="1980" y="390" type="curve"/>
			<point x="2048" y="327"/>
			<point x="2103" y="221"/>
			<point x="2103" y="111" type="curve" smooth="yes"/>
			<point x="2103" y="-253"/>
			<point x="1730" y="-340"/>
			<point x="1385" y="-346" type="curve" smooth="yes"/>
			<point x="1107" y="-350" type="line" smooth="yes"/>
			<point x="1081" y="-350"/>
			<point x="1055" y="-351"/>
			<point x="1029" y="-351" type="curve" smooth="yes"/>
			<point x="483" y="-351"/>
			<point x="75" y="-78"/>
			<point x="75" y="464" type="curve" smooth="yes"/>
			<point x="75" y="689"/>
			<point x="157" y="895"/>
			<point x="302" y="1056" type="curve" smooth="yes"/>
			<point x="318" y="1075"/>
			<point x="353" y="1090"/>
			<point x="378" y="1090" type="curve" smooth="yes"/>
			<point x="433" y="1090"/>
			<point x="478" y="1045"/>
			<point x="478" y="990" type="curve" smooth="yes"/>
			<point x="478" y="968"/>
			<point x="466" y="938"/>
			<point x="451" y="922" type="curve" smooth="yes"/>
			<point x="340" y="799"/>
			<point x="275" y="636"/>
			<point x="275" y="464" type="curve" smooth="yes"/>
			<point x="275" y="34"/>
			<point x="598" y="-150"/>
			<point x="1035" y="-150" type="curve" smooth="yes"/>
			<point x="1058" y="-150"/>
			<point x="1081" y="-150"/>
			<point x="1104" y="-150" type="curve" smooth="yes"/>
			<point x="1382" y="-146" type="line" smooth="yes"/>
			<point x="1612" y="-144"/>
			<point x="1903" y="-116"/>
			<point x="1903" y="109" type="curve" smooth="yes"/>
			<point x="1903" y="206"/>
			<point x="1830" y="278"/>
			<point x="1746" y="288" type="curve" smooth="yes"/>
			<point x="1697" y="294"/>
			<point x="1657" y="338"/>
			<point x="1657" y="387" type="curve" smooth="yes"/>
			<point x="1657" y="435"/>
			<point x="1696" y="479"/>
			<point x="1744" y="486" type="curve" smooth="yes"/>
			<point x="1825" y="497"/>
			<point x="1895" y="567"/>
			<point x="1895" y="662" type="curve" smooth="yes"/>
			<point x="1895" y="815"/>
			<point x="1728" y="893"/>
			<point x="1570" y="893" type="curve" smooth="yes"/>
			<point x="1540" y="893"/>
			<point x="1510" y="890"/>
			<point x="1480" y="885" type="curve"/>
			<point x="1584" y="766"/>
			<point x="1641" y="612"/>
			<point x="1641" y="450" type="curve" smooth="yes"/>
			<point x="1641" y="221"/>
			<point x="1506" y="-6"/>
			<point x="1262" y="-6" type="curve" smooth="yes"/>
			<point x="1025" y="-6"/>
			<point x="884" y="211"/>
			<point x="884" y="435" type="curve" smooth="yes"/>
			<point x="884" y="622"/>
			<point x="958" y="774"/>
			<point x="1074" y="891" type="curve"/>
			<point x="1060" y="893"/>
			<point x="1047" y="891"/>
			<point x="1033" y="891" type="curve" smooth="yes"/>
			<point x="822" y="891"/>
			<point x="670" y="730"/>
			<point x="670" y="520" type="curve" smooth="yes"/>
			<point x="670" y="371"/>
			<point x="754" y="246"/>
			<point x="868" y="181" type="curve" smooth="yes"/>
			<point x="897" y="165"/>
			<point x="920" y="126"/>
			<point x="920" y="93" type="curve" smooth="yes"/>
			<point x="920" y="38"/>
			<point x="875" y="-7"/>
			<point x="820" y="-7" type="curve" smooth="yes"/>
			<point x="805" y="-7"/>
			<point x="783" y="-1"/>
			<point x="770" y="7" type="curve" smooth="yes"/>
			<point x="593" y="108"/>
			<point x="470" y="291"/>
			<point x="470" y="521" type="curve" smooth="yes"/>
			<point x="470" y="842"/>
			<point x="709" y="1092"/>
		</contour>
		<contour>
			<point x="1279" y="802" type="curve"/>
			<point x="1166" y="722"/>
			<point x="1084" y="589"/>
			<point x="1084" y="435" type="curve" smooth="yes"/>
			<point x="1084" y="317"/>
			<point x="1144" y="194"/>
			<point x="1263" y="194" type="curve" smooth="yes"/>
			<point x="1385" y="194"/>
			<point x="1441" y="329"/>
			<point x="1441" y="451" type="curve" smooth="yes"/>
			<point x="1441" y="587"/>
			<point x="1379" y="720"/>
		</contour>
	</outline>
	<lib>
		<dict>
			<key>org.fontforge.glyphclass</key>
			<string>baseligature</string>
		</dict>
	</lib>
</glyph>
