<?xml version="1.0" encoding="UTF-8"?>
<glyph name="asciitilde" format="2">
	<unicode hex="007E"/>
	<advance width="822"/>
	<outline>
		<contour>
			<point x="623" y="1309" type="curve" smooth="yes"/>
			<point x="623" y="1317"/>
			<point x="620" y="1326"/>
			<point x="620" y="1334" type="curve" smooth="yes"/>
			<point x="620" y="1389"/>
			<point x="665" y="1434"/>
			<point x="720" y="1434" type="curve" smooth="yes"/>
			<point x="721" y="1434" type="line" smooth="yes"/>
			<point x="787" y="1434"/>
			<point x="823" y="1378"/>
			<point x="823" y="1306" type="curve" smooth="yes"/>
			<point x="823" y="1172"/>
			<point x="709" y="1060"/>
			<point x="577" y="1060" type="curve" smooth="yes"/>
			<point x="437" y="1060"/>
			<point x="376" y="1158"/>
			<point x="294" y="1211" type="curve" smooth="yes"/>
			<point x="277" y="1222"/>
			<point x="265" y="1228"/>
			<point x="251" y="1228" type="curve" smooth="yes"/>
			<point x="222" y="1228"/>
			<point x="200" y="1206"/>
			<point x="200" y="1178" type="curve" smooth="yes"/>
			<point x="200" y="1173"/>
			<point x="201" y="1167"/>
			<point x="201" y="1162" type="curve" smooth="yes"/>
			<point x="201" y="1107"/>
			<point x="156" y="1062"/>
			<point x="101" y="1062" type="curve" smooth="yes"/>
			<point x="39" y="1062"/>
			<point x="0" y="1113"/>
			<point x="0" y="1180" type="curve" smooth="yes"/>
			<point x="0" y="1313"/>
			<point x="113" y="1428"/>
			<point x="248" y="1428" type="curve" smooth="yes"/>
			<point x="390" y="1428"/>
			<point x="450" y="1329"/>
			<point x="533" y="1276" type="curve" smooth="yes"/>
			<point x="550" y="1265"/>
			<point x="561" y="1260"/>
			<point x="574" y="1260" type="curve" smooth="yes"/>
			<point x="602" y="1260"/>
			<point x="623" y="1281"/>
		</contour>
	</outline>
	<lib>
		<dict>
			<key>org.fontforge.glyphclass</key>
			<string>baseglyph</string>
		</dict>
	</lib>
</glyph>
