<?xml version="1.0" encoding="UTF-8"?>
<glyph name="uni0D68" format="2">
	<unicode hex="0D68"/>
	<advance width="1535"/>
	<outline>
		<contour>
			<point x="100" y="479" type="curve" smooth="yes"/>
			<point x="100" y="764"/>
			<point x="305" y="1023"/>
			<point x="591" y="1023" type="curve" smooth="yes"/>
			<point x="875" y="1023"/>
			<point x="1085" y="764"/>
			<point x="1085" y="484" type="curve" smooth="yes"/>
			<point x="1085" y="360"/>
			<point x="1046" y="239"/>
			<point x="977" y="138" type="curve"/>
			<point x="1364" y="136" type="line"/>
			<point x="1365" y="136" type="line" smooth="yes"/>
			<point x="1404" y="136"/>
			<point x="1435" y="105"/>
			<point x="1435" y="66" type="curve" smooth="yes"/>
			<point x="1435" y="27"/>
			<point x="1404" y="-4"/>
			<point x="1365" y="-4" type="curve" smooth="yes"/>
			<point x="1363" y="-4" type="line"/>
			<point x="822" y="-1" type="line" smooth="yes"/>
			<point x="784" y="-1"/>
			<point x="752" y="31"/>
			<point x="752" y="69" type="curve" smooth="yes"/>
			<point x="752" y="87"/>
			<point x="763" y="110"/>
			<point x="777" y="122" type="curve" smooth="yes"/>
			<point x="881" y="210"/>
			<point x="945" y="349"/>
			<point x="945" y="485" type="curve" smooth="yes"/>
			<point x="945" y="691"/>
			<point x="795" y="882"/>
			<point x="590" y="882" type="curve" smooth="yes"/>
			<point x="385" y="882"/>
			<point x="240" y="688"/>
			<point x="240" y="480" type="curve" smooth="yes"/>
			<point x="240" y="335"/>
			<point x="310" y="188"/>
			<point x="422" y="96" type="curve" smooth="yes"/>
			<point x="437" y="84"/>
			<point x="448" y="60"/>
			<point x="448" y="41" type="curve" smooth="yes"/>
			<point x="448" y="2"/>
			<point x="417" y="-29"/>
			<point x="378" y="-29" type="curve" smooth="yes"/>
			<point x="364" y="-29"/>
			<point x="344" y="-22"/>
			<point x="333" y="-13" type="curve" smooth="yes"/>
			<point x="187" y="106"/>
			<point x="100" y="291"/>
		</contour>
	</outline>
</glyph>
