<?xml version="1.0" encoding="UTF-8"?>
<glyph name="ccaron" format="2">
	<unicode hex="010D"/>
	<advance width="1098"/>
	<outline>
		<component base="c"/>
		<component base="caron" xOffset="196.4997063714" yOffset="35.1165250908"/>
	</outline>
</glyph>
