<?xml version="1.0" encoding="UTF-8"?>
<glyph name="th2u1" format="2">
	<advance width="1549"/>
	<outline>
		<component base="u_sign_drop" xOffset="803" yOffset="135"/>
		<component base="th2" yOffset="2"/>
	</outline>
	<lib>
		<dict>
			<key>org.fontforge.glyphclass</key>
			<string>baseligature</string>
		</dict>
	</lib>
</glyph>
