<?xml version="1.0" encoding="UTF-8"?>
<glyph name="quotedblbase" format="2">
	<unicode hex="201E"/>
	<advance width="980"/>
	<outline>
		<component base="quotedblright" yOffset="-1490"/>
	</outline>
</glyph>
