<?xml version="1.0" encoding="UTF-8"?>
<glyph name="k1t1r3" format="2">
	<advance width="1982"/>
	<outline>
		<contour>
			<point x="1566" y="-317" type="curve" smooth="yes"/>
			<point x="1694" y="-317"/>
			<point x="1829" y="-397"/>
			<point x="1829" y="-543" type="curve" smooth="yes"/>
			<point x="1829" y="-744"/>
			<point x="1621" y="-800"/>
			<point x="1445" y="-800" type="curve" smooth="yes"/>
			<point x="1132" y="-800"/>
			<point x="854" y="-659"/>
			<point x="854" y="-339" type="curve" smooth="yes"/>
			<point x="854" y="-240"/>
			<point x="886" y="-147"/>
			<point x="951" y="-68" type="curve" smooth="yes"/>
			<point x="966" y="-48"/>
			<point x="990" y="-35"/>
			<point x="1016" y="-35" type="curve" smooth="yes"/>
			<point x="1062" y="-35"/>
			<point x="1102" y="-71"/>
			<point x="1102" y="-119" type="curve" smooth="yes"/>
			<point x="1102" y="-142"/>
			<point x="1092" y="-166"/>
			<point x="1074" y="-187" type="curve" smooth="yes"/>
			<point x="1051" y="-216"/>
			<point x="1024" y="-284"/>
			<point x="1024" y="-342" type="curve" smooth="yes"/>
			<point x="1024" y="-554"/>
			<point x="1212" y="-627"/>
			<point x="1451" y="-627" type="curve" smooth="yes"/>
			<point x="1565" y="-627"/>
			<point x="1659" y="-597"/>
			<point x="1659" y="-547" type="curve" smooth="yes"/>
			<point x="1659" y="-507"/>
			<point x="1618" y="-491"/>
			<point x="1555" y="-491" type="curve" smooth="yes"/>
			<point x="1482" y="-491"/>
			<point x="1420" y="-512"/>
			<point x="1342" y="-512" type="curve" smooth="yes"/>
			<point x="1204" y="-512"/>
			<point x="1070" y="-441"/>
			<point x="1070" y="-287" type="curve" smooth="yes"/>
			<point x="1070" y="-116"/>
			<point x="1247" y="-31"/>
			<point x="1427" y="-31" type="curve" smooth="yes"/>
			<point x="1572" y="-31"/>
			<point x="1691" y="-94"/>
			<point x="1771" y="-161" type="curve" smooth="yes"/>
			<point x="1792" y="-178"/>
			<point x="1803" y="-199"/>
			<point x="1803" y="-224" type="curve" smooth="yes"/>
			<point x="1803" y="-269"/>
			<point x="1768" y="-310"/>
			<point x="1720" y="-310" type="curve" smooth="yes"/>
			<point x="1699" y="-310"/>
			<point x="1679" y="-304"/>
			<point x="1663" y="-291" type="curve" smooth="yes"/>
			<point x="1609" y="-246"/>
			<point x="1515" y="-203"/>
			<point x="1418" y="-203" type="curve" smooth="yes"/>
			<point x="1318" y="-203"/>
			<point x="1241" y="-242"/>
			<point x="1241" y="-288" type="curve" smooth="yes"/>
			<point x="1241" y="-316"/>
			<point x="1279" y="-344"/>
			<point x="1334" y="-344" type="curve" smooth="yes"/>
			<point x="1408" y="-344"/>
			<point x="1495" y="-317"/>
		</contour>
		<component base="k1"/>
	</outline>
</glyph>
