<?xml version="1.0" encoding="UTF-8"?>
<glyph name="k3th3u1" format="2">
	<advance width="1740"/>
	<outline>
		<component base="u_sign_drop" xOffset="988" yOffset="82"/>
		<component base="k3th3"/>
	</outline>
	<lib>
		<dict>
			<key>org.fontforge.glyphclass</key>
			<string>baseligature</string>
		</dict>
	</lib>
</glyph>
