<?xml version="1.0" encoding="UTF-8"?>
<glyph name="uni0D6D" format="2">
	<unicode hex="0D6D"/>
	<advance width="1405"/>
	<outline>
		<contour>
			<point x="673" y="1023" type="curve" smooth="yes"/>
			<point x="1062" y="1023"/>
			<point x="1331" y="675"/>
			<point x="1331" y="300" type="curve" smooth="yes"/>
			<point x="1331" y="-163"/>
			<point x="940" y="-552"/>
			<point x="466" y="-552" type="curve" smooth="yes"/>
			<point x="401" y="-552"/>
			<point x="285" y="-554"/>
			<point x="285" y="-452" type="curve" smooth="yes"/>
			<point x="285" y="-400"/>
			<point x="328" y="-357"/>
			<point x="380" y="-357" type="curve" smooth="yes"/>
			<point x="411" y="-357"/>
			<point x="439" y="-362"/>
			<point x="464" y="-362" type="curve" smooth="yes"/>
			<point x="836" y="-362"/>
			<point x="1141" y="-60"/>
			<point x="1141" y="301" type="curve" smooth="yes"/>
			<point x="1141" y="579"/>
			<point x="945" y="833"/>
			<point x="672" y="833" type="curve" smooth="yes"/>
			<point x="540" y="833"/>
			<point x="429" y="771"/>
			<point x="357" y="689" type="curve"/>
			<point x="398" y="704"/>
			<point x="442" y="712"/>
			<point x="488" y="712" type="curve" smooth="yes"/>
			<point x="699" y="712"/>
			<point x="874" y="548"/>
			<point x="874" y="345" type="curve" smooth="yes"/>
			<point x="874" y="146"/>
			<point x="705" y="-16"/>
			<point x="499" y="-16" type="curve" smooth="yes"/>
			<point x="238" y="-16"/>
			<point x="75" y="195"/>
			<point x="75" y="439" type="curve" smooth="yes"/>
			<point x="75" y="760"/>
			<point x="339" y="1023"/>
		</contour>
		<contour>
			<point x="487" y="520" type="curve" smooth="yes"/>
			<point x="380" y="520"/>
			<point x="288" y="439"/>
			<point x="288" y="336" type="curve" smooth="yes"/>
			<point x="288" y="251"/>
			<point x="398" y="174"/>
			<point x="499" y="174" type="curve" smooth="yes"/>
			<point x="601" y="174"/>
			<point x="684" y="251"/>
			<point x="684" y="345" type="curve" smooth="yes"/>
			<point x="684" y="440"/>
			<point x="594" y="520"/>
		</contour>
	</outline>
</glyph>
