<?xml version="1.0" encoding="UTF-8"?>
<glyph name="p1p2" format="2">
	<advance width="1657"/>
	<outline>
		<contour>
			<point x="941" y="-429" type="curve" smooth="yes"/>
			<point x="941" y="-609" type="line"/>
			<point x="1436" y="-609" type="line"/>
			<point x="1436" y="-419" type="line" smooth="yes"/>
			<point x="1436" y="-222"/>
			<point x="1315" y="-124"/>
			<point x="1192" y="-124" type="curve" smooth="yes"/>
			<point x="1067" y="-124"/>
			<point x="941" y="-226"/>
		</contour>
		<contour>
			<point x="152" y="-486" type="curve" smooth="yes"/>
			<point x="152" y="-339"/>
			<point x="267" y="-223"/>
			<point x="412" y="-223" type="curve" smooth="yes"/>
			<point x="561" y="-223"/>
			<point x="675" y="-338"/>
			<point x="675" y="-490" type="curve" smooth="yes"/>
			<point x="675" y="-530"/>
			<point x="665" y="-572"/>
			<point x="645" y="-608" type="curve"/>
			<point x="821" y="-608" type="line"/>
			<point x="821" y="-429" type="line" smooth="yes"/>
			<point x="821" y="-172"/>
			<point x="944" y="0"/>
			<point x="1184" y="0" type="curve" smooth="yes"/>
			<point x="1433" y="0"/>
			<point x="1557" y="-166"/>
			<point x="1557" y="-429" type="curve" smooth="yes"/>
			<point x="1557" y="-669" type="line" smooth="yes"/>
			<point x="1557" y="-695"/>
			<point x="1529" y="-730"/>
			<point x="1505" y="-730" type="curve" smooth="yes"/>
			<point x="497" y="-730" type="line" smooth="yes"/>
			<point x="462" y="-730"/>
			<point x="437" y="-700"/>
			<point x="437" y="-664" type="curve" smooth="yes"/>
			<point x="437" y="-640"/>
			<point x="449" y="-623"/>
			<point x="473" y="-612" type="curve" smooth="yes"/>
			<point x="515" y="-592"/>
			<point x="555" y="-545"/>
			<point x="555" y="-485" type="curve" smooth="yes"/>
			<point x="555" y="-400"/>
			<point x="485" y="-344"/>
			<point x="411" y="-344" type="curve" smooth="yes"/>
			<point x="335" y="-344"/>
			<point x="272" y="-409"/>
			<point x="272" y="-485" type="curve" smooth="yes"/>
			<point x="272" y="-543"/>
			<point x="314" y="-599"/>
			<point x="355" y="-613" type="curve" smooth="yes"/>
			<point x="384" y="-623"/>
			<point x="410" y="-641"/>
			<point x="410" y="-672" type="curve" smooth="yes"/>
			<point x="410" y="-705"/>
			<point x="384" y="-735"/>
			<point x="350" y="-735" type="curve" smooth="yes"/>
			<point x="343" y="-735"/>
			<point x="336" y="-734"/>
			<point x="329" y="-731" type="curve"/>
			<point x="235" y="-699"/>
			<point x="152" y="-607"/>
		</contour>
		<component base="p1"/>
	</outline>
	<lib>
		<dict>
			<key>org.fontforge.glyphclass</key>
			<string>baseligature</string>
		</dict>
	</lib>
</glyph>
