<?xml version="1.0" encoding="UTF-8"?>
<glyph name="divide" format="2">
	<unicode hex="00F7"/>
	<advance width="1110"/>
	<outline>
		<contour>
			<point x="548" y="686" type="curve" smooth="yes"/>
			<point x="470" y="686"/>
			<point x="404" y="749"/>
			<point x="404" y="826" type="curve" smooth="yes"/>
			<point x="404" y="903"/>
			<point x="470" y="965"/>
			<point x="548" y="965" type="curve" smooth="yes"/>
			<point x="626" y="965"/>
			<point x="693" y="903"/>
			<point x="693" y="826" type="curve" smooth="yes"/>
			<point x="693" y="749"/>
			<point x="626" y="686"/>
		</contour>
		<contour>
			<point x="540" y="-2" type="curve" smooth="yes"/>
			<point x="462" y="-2"/>
			<point x="396" y="61"/>
			<point x="396" y="138" type="curve" smooth="yes"/>
			<point x="396" y="215"/>
			<point x="462" y="277"/>
			<point x="540" y="277" type="curve" smooth="yes"/>
			<point x="618" y="277"/>
			<point x="685" y="215"/>
			<point x="685" y="138" type="curve" smooth="yes"/>
			<point x="685" y="61"/>
			<point x="618" y="-2"/>
		</contour>
		<contour>
			<point x="0" y="477" type="curve" smooth="yes"/>
			<point x="0" y="502"/>
			<point x="27" y="548"/>
			<point x="48" y="548" type="curve" smooth="yes"/>
			<point x="71" y="547" type="line"/>
			<point x="1039" y="547" type="line"/>
			<point x="1054" y="548" type="line"/>
			<point x="1080" y="548"/>
			<point x="1110" y="507"/>
			<point x="1110" y="477" type="curve" smooth="yes"/>
			<point x="1110" y="447"/>
			<point x="1080" y="407"/>
			<point x="1054" y="407" type="curve" smooth="yes"/>
			<point x="56" y="407" type="line" smooth="yes"/>
			<point x="30" y="407"/>
			<point x="0" y="447"/>
		</contour>
	</outline>
</glyph>
