<?xml version="1.0" encoding="UTF-8"?>
<glyph name="s1n1" format="2">
	<advance width="2478"/>
	<outline>
		<component base="s1" yOffset="3"/>
		<component base="_n1" xOffset="1018.4854881266" yOffset="-21.2453825858"/>
	</outline>
</glyph>
