<?xml version="1.0" encoding="UTF-8"?>
<glyph name="eacute" format="2">
	<unicode hex="00E9"/>
	<advance width="1131"/>
	<outline>
		<component base="acute" xOffset="469.0438871473" yOffset="260.7513061651"/>
		<component base="e"/>
	</outline>
</glyph>
