<?xml version="1.0" encoding="UTF-8"?>
<glyph name="g" format="2">
	<unicode hex="0067"/>
	<advance width="1205"/>
	<outline>
		<contour>
			<point x="1006" y="1099" type="curve" smooth="yes"/>
			<point x="1061" y="1099"/>
			<point x="1106" y="1054"/>
			<point x="1106" y="999" type="curve" smooth="yes"/>
			<point x="1106" y="997" type="line"/>
			<point x="1099" y="42" type="line" smooth="yes"/>
			<point x="1097" y="-257"/>
			<point x="839" y="-506"/>
			<point x="539" y="-506" type="curve" smooth="yes"/>
			<point x="369" y="-506"/>
			<point x="207" y="-428"/>
			<point x="101" y="-295" type="curve" smooth="yes"/>
			<point x="89" y="-280"/>
			<point x="78" y="-251"/>
			<point x="78" y="-231" type="curve" smooth="yes"/>
			<point x="78" y="-176"/>
			<point x="123" y="-131"/>
			<point x="178" y="-131" type="curve" smooth="yes"/>
			<point x="205" y="-131"/>
			<point x="241" y="-148"/>
			<point x="258" y="-170" type="curve" smooth="yes"/>
			<point x="324" y="-253"/>
			<point x="434" y="-306"/>
			<point x="540" y="-306" type="curve" smooth="yes"/>
			<point x="734" y="-306"/>
			<point x="899" y="-145"/>
			<point x="899" y="45" type="curve" smooth="yes"/>
			<point x="899" y="143" type="line"/>
			<point x="820" y="20"/>
			<point x="702" y="-18"/>
			<point x="586" y="-18" type="curve" smooth="yes"/>
			<point x="294" y="-18"/>
			<point x="75" y="258"/>
			<point x="75" y="547" type="curve" smooth="yes"/>
			<point x="75" y="834"/>
			<point x="293" y="1096"/>
			<point x="586" y="1096" type="curve" smooth="yes"/>
			<point x="713" y="1096"/>
			<point x="828" y="1038"/>
			<point x="905" y="918" type="curve"/>
			<point x="920" y="998" type="line" smooth="yes"/>
			<point x="930" y="1053"/>
			<point x="950.4532470703" y="1099"/>
		</contour>
		<contour>
			<point x="897" y="546" type="curve" smooth="yes"/>
			<point x="897" y="727"/>
			<point x="767" y="896"/>
			<point x="589" y="896" type="curve" smooth="yes"/>
			<point x="408" y="896"/>
			<point x="276" y="728"/>
			<point x="276" y="547" type="curve" smooth="yes"/>
			<point x="276" y="367"/>
			<point x="406" y="182"/>
			<point x="586" y="182" type="curve" smooth="yes"/>
			<point x="764" y="182"/>
			<point x="897" y="364"/>
		</contour>
	</outline>
	<lib>
		<dict>
			<key>org.fontforge.glyphclass</key>
			<string>baseglyph</string>
		</dict>
	</lib>
</glyph>
