<?xml version="1.0" encoding="UTF-8"?>
<glyph name="Oslash" format="2">
	<unicode hex="00D8"/>
	<advance width="1503"/>
	<outline>
		<contour>
			<point x="1091" y="1390" type="curve" smooth="yes"/>
			<point x="1143" y="1368"/>
			<point x="1146" y="1320"/>
			<point x="1128" y="1286" type="curve"/>
			<point x="1313" y="1162"/>
			<point x="1428" y="946"/>
			<point x="1428" y="694" type="curve" smooth="yes"/>
			<point x="1428" y="296"/>
			<point x="1147" y="-14"/>
			<point x="750" y="-14" type="curve" smooth="yes"/>
			<point x="651" y="-14"/>
			<point x="562" y="4"/>
			<point x="481" y="38" type="curve"/>
			<point x="476" y="29"/>
			<point x="471" y="19"/>
			<point x="466" y="10" type="curve"/>
			<point x="451" y="-21"/>
			<point x="403" y="-30"/>
			<point x="377" y="-19" type="curve" smooth="yes"/>
			<point x="334" y="-1"/>
			<point x="315" y="40"/>
			<point x="334" y="78" type="curve" smooth="yes"/>
			<point x="351" y="111" type="line"/>
			<point x="177" y="238"/>
			<point x="75" y="451"/>
			<point x="75" y="699" type="curve" smooth="yes"/>
			<point x="75" y="1089"/>
			<point x="362" y="1398"/>
			<point x="749" y="1398" type="curve" smooth="yes"/>
			<point x="838" y="1398"/>
			<point x="921" y="1383"/>
			<point x="997" y="1354" type="curve"/>
			<point x="1015" y="1387"/>
			<point x="1055" y="1406"/>
		</contour>
		<contour>
			<point x="753" y="1245" type="curve" smooth="yes"/>
			<point x="441" y="1245"/>
			<point x="225" y="995"/>
			<point x="225" y="678" type="curve" smooth="yes"/>
			<point x="225" y="509"/>
			<point x="304" y="355"/>
			<point x="426" y="255" type="curve"/>
			<point x="925" y="1216" type="line"/>
			<point x="871" y="1235"/>
			<point x="813" y="1245"/>
		</contour>
		<contour>
			<point x="1056" y="1146" type="curve"/>
			<point x="553" y="178" type="line"/>
			<point x="614" y="152"/>
			<point x="681" y="138"/>
			<point x="750" y="138" type="curve" smooth="yes"/>
			<point x="1039" y="138"/>
			<point x="1281" y="395"/>
			<point x="1281" y="673" type="curve" smooth="yes"/>
			<point x="1281" y="876"/>
			<point x="1193" y="1045"/>
		</contour>
	</outline>
</glyph>
