<?xml version="1.0" encoding="UTF-8"?>
<glyph name="n1th4r3" format="2">
	<advance width="3705"/>
	<outline>
		<contour>
			<point x="2523" y="565" type="curve" smooth="yes"/>
			<point x="2523" y="707"/>
			<point x="2511" y="848"/>
			<point x="2511" y="989" type="curve" smooth="yes"/>
			<point x="2511" y="1044"/>
			<point x="2556" y="1089"/>
			<point x="2611" y="1089" type="curve" smooth="yes"/>
			<point x="2664" y="1089"/>
			<point x="2709" y="1046"/>
			<point x="2711" y="993" type="curve" smooth="yes"/>
			<point x="2722" y="674" type="line" smooth="yes"/>
			<point x="2732" y="403"/>
			<point x="2807" y="164"/>
			<point x="3082" y="164" type="curve" smooth="yes"/>
			<point x="3276" y="164"/>
			<point x="3429" y="324"/>
			<point x="3429" y="518" type="curve" smooth="yes"/>
			<point x="3429" y="723"/>
			<point x="3260" y="890"/>
			<point x="3058" y="890" type="curve" smooth="yes"/>
			<point x="3045" y="890"/>
			<point x="3033" y="888"/>
			<point x="3020" y="888" type="curve" smooth="yes"/>
			<point x="2965" y="888"/>
			<point x="2920" y="933"/>
			<point x="2920" y="988" type="curve" smooth="yes"/>
			<point x="2920" y="1039"/>
			<point x="2961" y="1084"/>
			<point x="3012" y="1088" type="curve" smooth="yes"/>
			<point x="3028" y="1089"/>
			<point x="3044" y="1090"/>
			<point x="3060" y="1090" type="curve" smooth="yes"/>
			<point x="3459" y="1090"/>
			<point x="3630" y="767"/>
			<point x="3630" y="369" type="curve" smooth="yes"/>
			<point x="3630" y="-237"/>
			<point x="3153" y="-498"/>
			<point x="2537" y="-498" type="curve" smooth="yes"/>
			<point x="1453" y="-498" type="line" smooth="yes"/>
			<point x="725" y="-498"/>
			<point x="75" y="-238"/>
			<point x="75" y="495" type="curve" smooth="yes"/>
			<point x="75" y="698"/>
			<point x="141" y="891"/>
			<point x="261" y="1050" type="curve" smooth="yes"/>
			<point x="278" y="1073"/>
			<point x="314" y="1091"/>
			<point x="342" y="1091" type="curve" smooth="yes"/>
			<point x="398" y="1091"/>
			<point x="442" y="1045"/>
			<point x="442" y="991" type="curve" smooth="yes"/>
			<point x="442" y="972"/>
			<point x="433" y="945"/>
			<point x="421" y="930" type="curve" smooth="yes"/>
			<point x="328" y="807"/>
			<point x="275" y="652"/>
			<point x="275" y="495" type="curve" smooth="yes"/>
			<point x="275" y="-116"/>
			<point x="833" y="-298"/>
			<point x="1455" y="-298" type="curve" smooth="yes"/>
			<point x="1816" y="-298"/>
			<point x="2176" y="-298"/>
			<point x="2537" y="-298" type="curve" smooth="yes"/>
			<point x="2927" y="-298"/>
			<point x="3180" y="-214"/>
			<point x="3332" y="26" type="curve"/>
			<point x="3257" y="-13"/>
			<point x="3181" y="-36"/>
			<point x="3081" y="-36" type="curve" smooth="yes"/>
			<point x="2882" y="-36"/>
			<point x="2737" y="66"/>
			<point x="2649" y="188" type="curve"/>
			<point x="2591" y="78"/>
			<point x="2471" y="-35"/>
			<point x="2310" y="-35" type="curve" smooth="yes"/>
			<point x="2045" y="-35"/>
			<point x="1952" y="214"/>
			<point x="1943" y="456" type="curve" smooth="yes"/>
			<point x="1939" y="564" type="line" smooth="yes"/>
			<point x="1933" y="721"/>
			<point x="1904" y="893"/>
			<point x="1750" y="893" type="curve" smooth="yes"/>
			<point x="1613" y="893"/>
			<point x="1562" y="756"/>
			<point x="1558" y="618" type="curve"/>
			<point x="1560" y="589"/>
			<point x="1561" y="561"/>
			<point x="1561" y="535" type="curve" smooth="yes"/>
			<point x="1568" y="73" type="line"/>
			<point x="1568" y="72" type="line" smooth="yes"/>
			<point x="1568" y="17"/>
			<point x="1523" y="-28"/>
			<point x="1468" y="-28" type="curve" smooth="yes"/>
			<point x="1415" y="-28"/>
			<point x="1370" y="16"/>
			<point x="1368" y="69" type="curve" smooth="yes"/>
			<point x="1358" y="525" type="line"/>
			<point x="1358" y="614" type="line"/>
			<point x="1346" y="779"/>
			<point x="1260" y="895"/>
			<point x="1086" y="895" type="curve" smooth="yes"/>
			<point x="880" y="895"/>
			<point x="711" y="729"/>
			<point x="711" y="526" type="curve" smooth="yes"/>
			<point x="711" y="331"/>
			<point x="874" y="167"/>
			<point x="1071" y="167" type="curve" smooth="yes"/>
			<point x="1082" y="167"/>
			<point x="1093" y="168"/>
			<point x="1103" y="168" type="curve" smooth="yes"/>
			<point x="1158" y="168"/>
			<point x="1203" y="123"/>
			<point x="1203" y="68" type="curve" smooth="yes"/>
			<point x="1203" y="16"/>
			<point x="1160" y="-28"/>
			<point x="1108" y="-31" type="curve" smooth="yes"/>
			<point x="1095" y="-32"/>
			<point x="1082" y="-33"/>
			<point x="1069" y="-33" type="curve" smooth="yes"/>
			<point x="764" y="-33"/>
			<point x="511" y="223"/>
			<point x="511" y="525" type="curve" smooth="yes"/>
			<point x="511" y="841"/>
			<point x="769" y="1095"/>
			<point x="1087" y="1095" type="curve" smooth="yes"/>
			<point x="1250" y="1095"/>
			<point x="1368" y="1027"/>
			<point x="1448" y="930" type="curve"/>
			<point x="1507" y="1015"/>
			<point x="1614" y="1093"/>
			<point x="1749" y="1093" type="curve" smooth="yes"/>
			<point x="2029" y="1093"/>
			<point x="2131" y="826"/>
			<point x="2139" y="571" type="curve" smooth="yes"/>
			<point x="2143" y="463" type="line" smooth="yes"/>
			<point x="2148" y="322"/>
			<point x="2171" y="165"/>
			<point x="2308" y="165" type="curve" smooth="yes"/>
			<point x="2483" y="165"/>
			<point x="2523" y="386"/>
		</contour>
	</outline>
	<lib>
		<dict>
			<key>org.fontforge.glyphclass</key>
			<string>baseligature</string>
		</dict>
	</lib>
</glyph>
