<?xml version="1.0" encoding="UTF-8"?>
<glyph name="th1p4u2" format="2">
	<advance width="3129"/>
	<outline>
		<contour>
			<point x="2761" y="209" type="curve" smooth="yes"/>
			<point x="2708" y="209"/>
			<point x="2635" y="197"/>
			<point x="2583" y="197" type="curve" smooth="yes"/>
			<point x="2438" y="197"/>
			<point x="2324" y="266"/>
			<point x="2324" y="385" type="curve" smooth="yes"/>
			<point x="2324" y="538"/>
			<point x="2494" y="583"/>
			<point x="2651" y="590" type="curve" smooth="yes"/>
			<point x="2781" y="596"/>
			<point x="2922" y="612"/>
			<point x="2922" y="745" type="curve" smooth="yes"/>
			<point x="2922" y="891"/>
			<point x="2766" y="946"/>
			<point x="2573" y="946" type="curve" smooth="yes"/>
			<point x="2217" y="946"/>
			<point x="2066" y="753"/>
			<point x="2061" y="392" type="curve" smooth="yes"/>
			<point x="2056" y="35" type="line"/>
			<point x="2056" y="16"/>
			<point x="2040" y="1"/>
			<point x="2021" y="1" type="curve" smooth="yes"/>
			<point x="2002" y="1"/>
			<point x="1986" y="17"/>
			<point x="1986" y="36" type="curve" smooth="yes"/>
			<point x="1990" y="392" type="line" smooth="yes"/>
			<point x="1990" y="721"/>
			<point x="1906" y="942"/>
			<point x="1592" y="942" type="curve" smooth="yes"/>
			<point x="1538" y="942"/>
			<point x="1481" y="933"/>
			<point x="1423" y="914" type="curve"/>
			<point x="1581" y="806"/>
			<point x="1689" y="644"/>
			<point x="1689" y="411" type="curve" smooth="yes"/>
			<point x="1689" y="198"/>
			<point x="1558" y="2"/>
			<point x="1340" y="2" type="curve" smooth="yes"/>
			<point x="1117" y="2"/>
			<point x="990" y="195"/>
			<point x="990" y="415" type="curve" smooth="yes"/>
			<point x="990" y="636"/>
			<point x="1124" y="823"/>
			<point x="1267" y="916" type="curve"/>
			<point x="1205" y="938"/>
			<point x="1145" y="948"/>
			<point x="1089" y="948" type="curve" smooth="yes"/>
			<point x="814" y="948"/>
			<point x="606" y="742"/>
			<point x="606" y="470" type="curve" smooth="yes"/>
			<point x="606" y="263"/>
			<point x="729" y="117"/>
			<point x="873" y="49" type="curve" smooth="yes"/>
			<point x="886" y="43"/>
			<point x="893" y="34"/>
			<point x="893" y="22" type="curve" smooth="yes"/>
			<point x="893" y="1"/>
			<point x="881" y="-18"/>
			<point x="862" y="-18" type="curve" smooth="yes"/>
			<point x="854" y="-18"/>
			<point x="837" y="-12"/>
			<point x="812" y="0" type="curve" smooth="yes"/>
			<point x="652" y="77"/>
			<point x="536" y="262"/>
			<point x="536" y="479" type="curve" smooth="yes"/>
			<point x="536" y="787"/>
			<point x="784" y="1019"/>
			<point x="1094" y="1019" type="curve" smooth="yes"/>
			<point x="1178" y="1019"/>
			<point x="1262" y="999"/>
			<point x="1345" y="959" type="curve"/>
			<point x="1423" y="994"/>
			<point x="1503" y="1012"/>
			<point x="1585" y="1012" type="curve" smooth="yes"/>
			<point x="1834" y="1012"/>
			<point x="1961" y="881"/>
			<point x="2029" y="680" type="curve"/>
			<point x="2106" y="892"/>
			<point x="2295" y="1015"/>
			<point x="2579" y="1015" type="curve" smooth="yes"/>
			<point x="2808" y="1015"/>
			<point x="2993" y="939"/>
			<point x="2993" y="745" type="curve" smooth="yes"/>
			<point x="2993" y="597"/>
			<point x="2855" y="531"/>
			<point x="2695" y="521" type="curve" smooth="yes"/>
			<point x="2554" y="516"/>
			<point x="2393" y="503"/>
			<point x="2393" y="385" type="curve" smooth="yes"/>
			<point x="2393" y="298"/>
			<point x="2484" y="268"/>
			<point x="2564" y="268" type="curve" smooth="yes"/>
			<point x="2619" y="268"/>
			<point x="2703" y="280"/>
			<point x="2761" y="280" type="curve" smooth="yes"/>
			<point x="2885" y="280"/>
			<point x="3027" y="208"/>
			<point x="3027" y="84" type="curve" smooth="yes"/>
			<point x="3027" y="5"/>
			<point x="2995" y="-54"/>
			<point x="2932" y="-93" type="curve"/>
			<point x="2988" y="-123"/>
			<point x="3029" y="-179"/>
			<point x="3029" y="-240" type="curve" smooth="yes"/>
			<point x="3029" y="-369"/>
			<point x="2897" y="-427"/>
			<point x="2760" y="-428" type="curve" smooth="yes"/>
			<point x="1159" y="-423" type="line" smooth="yes"/>
			<point x="552" y="-423"/>
			<point x="100" y="-145"/>
			<point x="100" y="441" type="curve" smooth="yes"/>
			<point x="100" y="674"/>
			<point x="174" y="845"/>
			<point x="305" y="999" type="curve" smooth="yes"/>
			<point x="312" y="1008"/>
			<point x="320" y="1012"/>
			<point x="330" y="1012" type="curve" smooth="yes"/>
			<point x="350" y="1012"/>
			<point x="367" y="996"/>
			<point x="367" y="977" type="curve" smooth="yes"/>
			<point x="367" y="968"/>
			<point x="364" y="960"/>
			<point x="358" y="954" type="curve"/>
			<point x="241" y="817"/>
			<point x="170" y="633"/>
			<point x="170" y="441" type="curve" smooth="yes"/>
			<point x="170" y="-123"/>
			<point x="609" y="-353"/>
			<point x="1188" y="-353" type="curve" smooth="yes"/>
			<point x="2772" y="-358" type="line" smooth="yes"/>
			<point x="2868" y="-358"/>
			<point x="2957" y="-312"/>
			<point x="2957" y="-239" type="curve" smooth="yes"/>
			<point x="2957" y="-170"/>
			<point x="2886" y="-139"/>
			<point x="2808" y="-132" type="curve"/>
			<point x="2354" y="-137" type="line" smooth="yes"/>
			<point x="2335" y="-137"/>
			<point x="2319" y="-121"/>
			<point x="2319" y="-102" type="curve" smooth="yes"/>
			<point x="2319" y="-83"/>
			<point x="2335" y="-68"/>
			<point x="2353" y="-67" type="curve" smooth="yes"/>
			<point x="2802" y="-62" type="line" smooth="yes"/>
			<point x="2879" y="-62"/>
			<point x="2957" y="0"/>
			<point x="2957" y="60" type="curve" smooth="yes"/>
			<point x="2957" y="163"/>
			<point x="2864" y="209"/>
		</contour>
		<contour>
			<point x="1344" y="880" type="curve"/>
			<point x="1198" y="804"/>
			<point x="1059" y="623"/>
			<point x="1059" y="419" type="curve" smooth="yes"/>
			<point x="1059" y="234"/>
			<point x="1159" y="72"/>
			<point x="1340" y="72" type="curve" smooth="yes"/>
			<point x="1517" y="72"/>
			<point x="1621" y="243"/>
			<point x="1621" y="415" type="curve" smooth="yes"/>
			<point x="1621" y="631"/>
			<point x="1492" y="797"/>
		</contour>
	</outline>
	<lib>
		<dict>
			<key>org.fontforge.glyphclass</key>
			<string>baseligature</string>
		</dict>
	</lib>
</glyph>
