<?xml version="1.0" encoding="UTF-8"?>
<glyph name="m1m1u1" format="2">
	<advance width="2512"/>
	<outline>
		<component base="u_sign_drop" xOffset="1761" yOffset="117"/>
		<component base="m1m1"/>
	</outline>
	<lib>
		<dict>
			<key>org.fontforge.glyphclass</key>
			<string>baseligature</string>
		</dict>
	</lib>
</glyph>
