<?xml version="1.0" encoding="UTF-8"?>
<glyph name="Udieresis" format="2">
	<unicode hex="00DC"/>
	<advance width="1366"/>
	<outline>
		<component base="dieresis" xOffset="326" yOffset="404"/>
		<component base="U"/>
	</outline>
</glyph>
