<?xml version="1.0" encoding="UTF-8"?>
<glyph name="at" format="2">
	<unicode hex="0040"/>
	<advance width="1827"/>
	<outline>
		<contour>
			<point x="125" y="399" type="curve" smooth="yes"/>
			<point x="125" y="832"/>
			<point x="479" y="1181"/>
			<point x="907" y="1181" type="curve" smooth="yes"/>
			<point x="1344" y="1181"/>
			<point x="1703" y="827"/>
			<point x="1703" y="397" type="curve" smooth="yes"/>
			<point x="1703" y="212"/>
			<point x="1602" y="31"/>
			<point x="1413" y="31" type="curve" smooth="yes"/>
			<point x="1308" y="31"/>
			<point x="1216" y="102"/>
			<point x="1185" y="195" type="curve"/>
			<point x="1121" y="105"/>
			<point x="1004" y="38"/>
			<point x="882" y="38" type="curve" smooth="yes"/>
			<point x="675" y="38"/>
			<point x="511" y="211"/>
			<point x="511" y="417" type="curve" smooth="yes"/>
			<point x="511" y="622"/>
			<point x="679" y="795"/>
			<point x="883" y="795" type="curve" smooth="yes"/>
			<point x="999" y="795"/>
			<point x="1111" y="735"/>
			<point x="1176" y="650" type="curve"/>
			<point x="1175" y="758" type="line"/>
			<point x="1175" y="759" type="line" smooth="yes"/>
			<point x="1175" y="780"/>
			<point x="1192" y="797"/>
			<point x="1213" y="797" type="curve" smooth="yes"/>
			<point x="1234" y="797"/>
			<point x="1250" y="780"/>
			<point x="1250" y="759" type="curve" smooth="yes"/>
			<point x="1251" y="595"/>
			<point x="1251" y="432"/>
			<point x="1251" y="273" type="curve" smooth="yes"/>
			<point x="1251" y="179"/>
			<point x="1324" y="106"/>
			<point x="1413" y="106" type="curve" smooth="yes"/>
			<point x="1558" y="106"/>
			<point x="1628" y="254"/>
			<point x="1628" y="398" type="curve" smooth="yes"/>
			<point x="1628" y="787"/>
			<point x="1299" y="1106"/>
			<point x="906" y="1106" type="curve" smooth="yes"/>
			<point x="519" y="1106"/>
			<point x="200" y="791"/>
			<point x="200" y="399" type="curve" smooth="yes"/>
			<point x="200" y="24"/>
			<point x="500" y="-297"/>
			<point x="902" y="-297" type="curve" smooth="yes"/>
			<point x="984" y="-297"/>
			<point x="1066" y="-283"/>
			<point x="1143" y="-254" type="curve"/>
			<point x="1147" y="-253"/>
			<point x="1153" y="-251"/>
			<point x="1157" y="-251" type="curve" smooth="yes"/>
			<point x="1178" y="-251"/>
			<point x="1194" y="-268"/>
			<point x="1194" y="-289" type="curve" smooth="yes"/>
			<point x="1194" y="-304"/>
			<point x="1183" y="-319"/>
			<point x="1169" y="-324" type="curve" smooth="yes"/>
			<point x="1083" y="-356"/>
			<point x="992" y="-372"/>
			<point x="901" y="-372" type="curve" smooth="yes"/>
			<point x="457" y="-372"/>
			<point x="125" y="-17"/>
		</contour>
		<contour>
			<point x="883" y="720" type="curve" smooth="yes"/>
			<point x="720" y="720"/>
			<point x="586" y="580"/>
			<point x="586" y="416" type="curve" smooth="yes"/>
			<point x="586" y="252"/>
			<point x="718" y="113"/>
			<point x="882" y="113" type="curve" smooth="yes"/>
			<point x="1074" y="113"/>
			<point x="1170" y="264"/>
			<point x="1170" y="415" type="curve" smooth="yes"/>
			<point x="1170" y="567"/>
			<point x="1073" y="720"/>
		</contour>
	</outline>
	<lib>
		<dict>
			<key>org.fontforge.glyphclass</key>
			<string>baseglyph</string>
		</dict>
	</lib>
</glyph>
