<?xml version="1.0" encoding="UTF-8"?>
<glyph name="ch2r1" format="2">
	<advance width="2891"/>
	<outline>
		<contour>
			<point x="1213" y="450" type="curve" smooth="yes"/>
			<point x="1213" y="767"/>
			<point x="1470" y="1028"/>
			<point x="1788" y="1028" type="curve" smooth="yes"/>
			<point x="1930" y="1028"/>
			<point x="2073" y="970"/>
			<point x="2172" y="884" type="curve"/>
			<point x="2528" y="867"/>
			<point x="2791" y="581"/>
			<point x="2791" y="213" type="curve" smooth="yes"/>
			<point x="2791" y="-300"/>
			<point x="2353" y="-611"/>
			<point x="1841" y="-611" type="curve" smooth="yes"/>
			<point x="1629" y="-611"/>
			<point x="1427" y="-550"/>
			<point x="1427" y="-340" type="curve" smooth="yes"/>
			<point x="1427" y="-142"/>
			<point x="1628" y="-59"/>
			<point x="1811" y="-59" type="curve" smooth="yes"/>
			<point x="1999" y="-59"/>
			<point x="2210" y="-138"/>
			<point x="2210" y="-344" type="curve" smooth="yes"/>
			<point x="2210" y="-366"/>
			<point x="2207" y="-386"/>
			<point x="2202" y="-404" type="curve"/>
			<point x="2436" y="-311"/>
			<point x="2650" y="-102"/>
			<point x="2650" y="214" type="curve" smooth="yes"/>
			<point x="2650" y="468"/>
			<point x="2503" y="647"/>
			<point x="2305" y="716" type="curve"/>
			<point x="2346" y="640"/>
			<point x="2378" y="545"/>
			<point x="2378" y="436" type="curve" smooth="yes"/>
			<point x="2378" y="199"/>
			<point x="2218" y="-12"/>
			<point x="1975" y="-12" type="curve" smooth="yes"/>
			<point x="1758" y="-12"/>
			<point x="1598" y="175"/>
			<point x="1598" y="389" type="curve" smooth="yes"/>
			<point x="1598" y="619"/>
			<point x="1770" y="793"/>
			<point x="1956" y="855" type="curve"/>
			<point x="1903" y="877"/>
			<point x="1845" y="888"/>
			<point x="1788" y="888" type="curve" smooth="yes"/>
			<point x="1549" y="888"/>
			<point x="1353" y="689"/>
			<point x="1353" y="450" type="curve" smooth="yes"/>
			<point x="1353" y="325"/>
			<point x="1409" y="199"/>
			<point x="1502" y="117" type="curve" smooth="yes"/>
			<point x="1515" y="105"/>
			<point x="1526" y="81"/>
			<point x="1526" y="64" type="curve" smooth="yes"/>
			<point x="1526" y="25"/>
			<point x="1495" y="-6"/>
			<point x="1456" y="-6" type="curve" smooth="yes"/>
			<point x="121" y="-2" type="line"/>
			<point x="120" y="-2" type="line" smooth="yes"/>
			<point x="81" y="-2"/>
			<point x="50" y="29"/>
			<point x="50" y="68" type="curve" smooth="yes"/>
			<point x="50" y="107"/>
			<point x="81" y="138"/>
			<point x="120" y="138" type="curve" smooth="yes"/>
			<point x="121" y="138" type="line"/>
			<point x="657" y="136" type="line" smooth="yes"/>
			<point x="784" y="136"/>
			<point x="897" y="254"/>
			<point x="897" y="384" type="curve" smooth="yes"/>
			<point x="897" y="503"/>
			<point x="806" y="607"/>
			<point x="687" y="607" type="curve" smooth="yes"/>
			<point x="586" y="607"/>
			<point x="501" y="527"/>
			<point x="501" y="418" type="curve" smooth="yes"/>
			<point x="501" y="391"/>
			<point x="506" y="364"/>
			<point x="517" y="341" type="curve" smooth="yes"/>
			<point x="521" y="333"/>
			<point x="523" y="320"/>
			<point x="523" y="311" type="curve" smooth="yes"/>
			<point x="523" y="272"/>
			<point x="492" y="241"/>
			<point x="453" y="241" type="curve" smooth="yes"/>
			<point x="379" y="241"/>
			<point x="360" y="352"/>
			<point x="360" y="418" type="curve" smooth="yes"/>
			<point x="360" y="608"/>
			<point x="511" y="748"/>
			<point x="689" y="748" type="curve" smooth="yes"/>
			<point x="884" y="748"/>
			<point x="1037" y="577"/>
			<point x="1037" y="385" type="curve" smooth="yes"/>
			<point x="1037" y="287"/>
			<point x="1003" y="205"/>
			<point x="945" y="136" type="curve"/>
			<point x="1305" y="134" type="line"/>
			<point x="1245" y="228"/>
			<point x="1213" y="338"/>
		</contour>
		<contour>
			<point x="2238" y="438" type="curve" smooth="yes"/>
			<point x="2238" y="901"/>
			<point x="1738" y="725"/>
			<point x="1738" y="388" type="curve" smooth="yes"/>
			<point x="1738" y="251"/>
			<point x="1838" y="128"/>
			<point x="1974" y="128" type="curve" smooth="yes"/>
			<point x="2139" y="128"/>
			<point x="2238" y="274"/>
		</contour>
		<contour>
			<point x="1813" y="-199" type="curve" smooth="yes"/>
			<point x="1702" y="-199"/>
			<point x="1567" y="-231"/>
			<point x="1567" y="-341" type="curve" smooth="yes"/>
			<point x="1567" y="-457"/>
			<point x="1722" y="-469"/>
			<point x="1841" y="-469" type="curve" smooth="yes"/>
			<point x="1947" y="-469"/>
			<point x="2070" y="-445"/>
			<point x="2070" y="-345" type="curve" smooth="yes"/>
			<point x="2070" y="-231"/>
			<point x="1928" y="-199"/>
		</contour>
	</outline>
	<lib>
		<dict>
			<key>org.fontforge.glyphclass</key>
			<string>baseligature</string>
		</dict>
	</lib>
</glyph>
