<?xml version="1.0" encoding="UTF-8"?>
<glyph name="p1th1" format="2">
	<advance width="1672"/>
	<outline>
		<contour>
			<point x="723" y="-441" type="curve" smooth="yes"/>
			<point x="723" y="-325"/>
			<point x="763" y="-239"/>
			<point x="824" y="-166" type="curve"/>
			<point x="683" y="-170"/>
			<point x="560" y="-268"/>
			<point x="560" y="-410" type="curve" smooth="yes"/>
			<point x="560" y="-506"/>
			<point x="623" y="-579"/>
			<point x="695" y="-606" type="curve" smooth="yes"/>
			<point x="724" y="-617"/>
			<point x="748" y="-650"/>
			<point x="748" y="-681" type="curve" smooth="yes"/>
			<point x="748" y="-725"/>
			<point x="712" y="-761"/>
			<point x="668" y="-761" type="curve" smooth="yes"/>
			<point x="660" y="-761"/>
			<point x="646" y="-758"/>
			<point x="638" y="-755" type="curve" smooth="yes"/>
			<point x="510" y="-707"/>
			<point x="400" y="-579"/>
			<point x="400" y="-410" type="curve" smooth="yes"/>
			<point x="400" y="-173"/>
			<point x="597" y="-6"/>
			<point x="835" y="-6" type="curve" smooth="yes"/>
			<point x="892" y="-6"/>
			<point x="949" y="-16"/>
			<point x="1002" y="-37" type="curve"/>
			<point x="1056" y="-15"/>
			<point x="1114" y="-4"/>
			<point x="1172" y="-4" type="curve" smooth="yes"/>
			<point x="1403" y="-4"/>
			<point x="1599" y="-173"/>
			<point x="1599" y="-403" type="curve" smooth="yes"/>
			<point x="1599" y="-570"/>
			<point x="1491" y="-697"/>
			<point x="1366" y="-746" type="curve" smooth="yes"/>
			<point x="1358" y="-749"/>
			<point x="1344" y="-752"/>
			<point x="1335" y="-752" type="curve" smooth="yes"/>
			<point x="1291" y="-752"/>
			<point x="1255" y="-716"/>
			<point x="1255" y="-672" type="curve" smooth="yes"/>
			<point x="1255" y="-641"/>
			<point x="1278" y="-608"/>
			<point x="1307" y="-597" type="curve" smooth="yes"/>
			<point x="1378" y="-569"/>
			<point x="1439" y="-497"/>
			<point x="1439" y="-402" type="curve" smooth="yes"/>
			<point x="1439" y="-266"/>
			<point x="1316" y="-168"/>
			<point x="1179" y="-165" type="curve"/>
			<point x="1241" y="-238"/>
			<point x="1283" y="-324"/>
			<point x="1283" y="-442" type="curve" smooth="yes"/>
			<point x="1283" y="-606"/>
			<point x="1171" y="-756"/>
			<point x="1003" y="-756" type="curve" smooth="yes"/>
			<point x="834" y="-756"/>
			<point x="723" y="-604"/>
		</contour>
		<contour>
			<point x="1003" y="-596" type="curve" smooth="yes"/>
			<point x="1080" y="-596"/>
			<point x="1123" y="-518"/>
			<point x="1123" y="-440" type="curve" smooth="yes"/>
			<point x="1123" y="-342"/>
			<point x="1070" y="-265"/>
			<point x="1002" y="-217" type="curve"/>
			<point x="934" y="-265"/>
			<point x="883" y="-343"/>
			<point x="883" y="-439" type="curve" smooth="yes"/>
			<point x="883" y="-518"/>
			<point x="925" y="-596"/>
		</contour>
		<component base="p1" yOffset="2"/>
	</outline>
	<lib>
		<dict>
			<key>org.fontforge.glyphclass</key>
			<string>baseligature</string>
		</dict>
	</lib>
</glyph>
