<?xml version="1.0" encoding="UTF-8"?>
<glyph name="V" format="2">
	<unicode hex="0056"/>
	<advance width="1353"/>
	<outline>
		<contour>
			<point x="25" y="1340" type="curve" smooth="yes"/>
			<point x="25" y="1387"/>
			<point x="72" y="1433"/>
			<point x="120" y="1433" type="curve" smooth="yes"/>
			<point x="165" y="1433"/>
			<point x="201" y="1411"/>
			<point x="217" y="1373" type="curve" smooth="yes"/>
			<point x="700" y="275" type="line"/>
			<point x="1135" y="1384" type="line" smooth="yes"/>
			<point x="1151" y="1426"/>
			<point x="1188" y="1447"/>
			<point x="1233" y="1447" type="curve" smooth="yes"/>
			<point x="1282" y="1447"/>
			<point x="1328" y="1402"/>
			<point x="1328" y="1354" type="curve" smooth="yes"/>
			<point x="1328" y="1336"/>
			<point x="1326" y="1321"/>
			<point x="1321" y="1308" type="curve" smooth="yes"/>
			<point x="799" y="-16" type="line" smooth="yes"/>
			<point x="786" y="-50"/>
			<point x="749" y="-80"/>
			<point x="706" y="-80" type="curve" smooth="yes"/>
			<point x="664" y="-80"/>
			<point x="632" y="-57"/>
			<point x="615" y="-20" type="curve" smooth="yes"/>
			<point x="34" y="1291" type="line" smooth="yes"/>
			<point x="27" y="1305"/>
			<point x="25" y="1322"/>
		</contour>
	</outline>
	<lib>
		<dict>
			<key>org.fontforge.glyphclass</key>
			<string>baseglyph</string>
		</dict>
	</lib>
</glyph>
