<?xml version="1.0" encoding="UTF-8"?>
<glyph name="l2" format="2">
	<unicode hex="0D63"/>
	<advance width="138"/>
	<outline>
		<component base="ml_ll" xScale="0.674173" yScale="0.718004" xOffset="-1396.42" yOffset="-749.902"/>
	</outline>
</glyph>
