<?xml version="1.0" encoding="UTF-8"?>
<glyph name="t4u2" format="2">
	<advance width="2427"/>
	<outline>
		<component base="t4"/>
		<component base="uu_sign_drop" xOffset="1677" yOffset="20"/>
	</outline>
	<lib>
		<dict>
			<key>org.fontforge.glyphclass</key>
			<string>baseligature</string>
		</dict>
	</lib>
</glyph>
