<?xml version="1.0" encoding="UTF-8"?>
<glyph name="p1r3u2" format="2">
	<advance width="1890"/>
	<outline>
		<component base="p1r3"/>
		<component base="uu_sign_drop" xOffset="1389" yOffset="-360"/>
	</outline>
	<lib>
		<dict>
			<key>org.fontforge.glyphclass</key>
			<string>baseligature</string>
		</dict>
	</lib>
</glyph>
