<?xml version="1.0" encoding="UTF-8"?>
<glyph name="shu1" format="2">
	<advance width="1857"/>
	<outline>
		<component base="sh"/>
		<component base="u_sign_drop" xOffset="1247" yOffset="7"/>
	</outline>
	<lib>
		<dict>
			<key>org.fontforge.glyphclass</key>
			<string>baseligature</string>
		</dict>
	</lib>
</glyph>
