<?xml version="1.0" encoding="UTF-8"?>
<glyph name="Otilde" format="2">
	<unicode hex="00D5"/>
	<advance width="1486"/>
	<outline>
		<component base="O"/>
		<component base="asciitilde" xOffset="100" yOffset="354"/>
	</outline>
</glyph>
