<?xml version="1.0" encoding="UTF-8"?>
<glyph name="y1y1u2" format="2">
	<advance width="1690"/>
	<outline>
		<contour>
			<point x="1752.4117431641" y="-638.065246582" type="curve" smooth="yes"/>
			<point x="1752.4117431641" y="-753.2057495117"/>
			<point x="1651.1130371094" y="-837.25"/>
			<point x="1523.6573486328" y="-837.25" type="curve" smooth="yes"/>
			<point x="1400.3090820312" y="-837.25"/>
			<point x="1314.6212158203" y="-778.0410766602"/>
			<point x="1280" y="-687" type="curve" smooth="yes"/>
			<point x="1269.2083740234" y="-658.7756958008"/>
			<point x="1263.2404785156" y="-633.996887207"/>
			<point x="1263.2404785156" y="-612.0916748047" type="curve" smooth="yes"/>
			<point x="1263.2404785156" y="-607.6090698242"/>
			<point x="1263.4903564453" y="-603.2468261719"/>
			<point x="1264" y="-599" type="curve" smooth="yes"/>
			<point x="1277" y="-466"/>
			<point x="1386" y="-382"/>
			<point x="1589" y="-345" type="curve"/>
			<point x="1611.3934326172" y="-342.4649047852"/>
			<point x="1633.1656494141" y="-341.2151489258"/>
			<point x="1654.2580566406" y="-341.2151489258" type="curve" smooth="yes"/>
			<point x="1878.6821289062" y="-341.2151489258"/>
			<point x="2026.1472167969" y="-482.7000427246"/>
			<point x="2026.1472167969" y="-722.7846679688" type="curve" smooth="yes"/>
			<point x="2026.1472167969" y="-844.3497314453"/>
			<point x="1977.9916992188" y="-940.5488891602"/>
			<point x="1878" y="-1027" type="curve" smooth="yes"/>
			<point x="1810.4034423828" y="-1084.5075683594"/>
			<point x="1724.3057861328" y="-1114.0178222656"/>
			<point x="1618.2791748047" y="-1114.0178222656" type="curve" smooth="yes"/>
			<point x="1515.2120361328" y="-1114.0178222656"/>
			<point x="1399.4876708984" y="-1073.0354003906"/>
			<point x="1274" y="-993" type="curve" smooth="yes"/>
			<point x="1254.1733398438" y="-980.4625854492"/>
			<point x="1245.9083251953" y="-962.0592651367"/>
			<point x="1245.9083251953" y="-943.3919677734" type="curve" smooth="yes"/>
			<point x="1245.9083251953" y="-908.4241943359"/>
			<point x="1274.9095458984" y="-872.5300292969"/>
			<point x="1311.2432861328" y="-872.5300292969" type="curve" smooth="yes"/>
			<point x="1322.0377197266" y="-872.5300292969"/>
			<point x="1333.4793701172" y="-875.6981811523"/>
			<point x="1345" y="-883" type="curve" smooth="yes"/>
			<point x="1445.8892822266" y="-947.8936157227"/>
			<point x="1545.7504882812" y="-984.7709350586"/>
			<point x="1633.6375732422" y="-984.7709350586" type="curve" smooth="yes"/>
			<point x="1719.1041259766" y="-984.7709350586"/>
			<point x="1793.2470703125" y="-949.8969116211"/>
			<point x="1846" y="-872" type="curve" smooth="yes"/>
			<point x="1877.9367675781" y="-825.125"/>
			<point x="1895.5454101562" y="-764.1870727539"/>
			<point x="1895.5454101562" y="-704.2208251953" type="curve" smooth="yes"/>
			<point x="1895.5454101562" y="-576.9465942383"/>
			<point x="1819.1802978516" y="-488.1447143555"/>
			<point x="1699" y="-475" type="curve"/>
			<point x="1735.3081054688" y="-532.2861938477"/>
			<point x="1752.4117431641" y="-588.1076049805"/>
		</contour>
		<contour>
			<point x="1394" y="-592" type="curve" smooth="yes"/>
			<point x="1394" y="-665.133605957"/>
			<point x="1446.5424804688" y="-709.5625"/>
			<point x="1527.5549316406" y="-709.5625" type="curve" smooth="yes"/>
			<point x="1545.359375" y="-709.5625"/>
			<point x="1561" y="-706.0416870117"/>
			<point x="1574" y="-699" type="curve" smooth="yes"/>
			<point x="1607.3092041016" y="-680.9949951172"/>
			<point x="1623.5989990234" y="-675.1467895508"/>
			<point x="1623.5989990234" y="-642.0565795898" type="curve" smooth="yes"/>
			<point x="1623.5989990234" y="-589.5006103516"/>
			<point x="1596.5216064453" y="-544.9528198242"/>
			<point x="1544" y="-486" type="curve"/>
			<point x="1503" y="-498"/>
			<point x="1394" y="-544"/>
		</contour>
		<contour>
			<point x="788" y="178" type="curve"/>
			<point x="743" y="254"/>
			<point x="711" y="361"/>
			<point x="694" y="500" type="curve" smooth="yes"/>
			<point x="677" y="639"/>
			<point x="648" y="733"/>
			<point x="609" y="782" type="curve" smooth="yes"/>
			<point x="578.6895751953" y="819.8880004883"/>
			<point x="537.1503295898" y="838.3807983398"/>
			<point x="496.371887207" y="838.3807983398" type="curve" smooth="yes"/>
			<point x="456.4286804199" y="838.3807983398"/>
			<point x="417.2154541016" y="820.6378173828"/>
			<point x="390" y="786" type="curve"/>
			<point x="387" y="781"/>
			<point x="382" y="777"/>
			<point x="377" y="774" type="curve"/>
			<point x="290.5194091797" y="709.6423339844"/>
			<point x="230.1055145264" y="600.3421630859"/>
			<point x="230.1055145264" y="481.6517944336" type="curve" smooth="yes"/>
			<point x="230.1055145264" y="313.0355834961"/>
			<point x="345.3872070312" y="183.5375976562"/>
			<point x="476" y="140" type="curve" smooth="yes"/>
			<point x="516.1089477539" y="126.258972168"/>
			<point x="555.6661987305" y="119.4140625"/>
			<point x="594.6718139648" y="119.4140625" type="curve" smooth="yes"/>
			<point x="660.6951904297" y="119.4140625"/>
			<point x="725.1379394531" y="139.0255126953"/>
		</contour>
		<contour>
			<point x="1158.5510253906" y="614.6342163086" type="curve" smooth="yes"/>
			<point x="1158.5510253906" y="443.000579834"/>
			<point x="1067.7836914062" y="264.314239502"/>
			<point x="971" y="162" type="curve"/>
			<point x="1012.44140625" y="128.760559082"/>
			<point x="1056.8643798828" y="114.7150115967"/>
			<point x="1100.1662597656" y="114.7150115967" type="curve" smooth="yes"/>
			<point x="1157.1743164062" y="114.7150115967"/>
			<point x="1212.2395019531" y="139.0592651367"/>
			<point x="1256" y="176" type="curve" smooth="yes"/>
			<point x="1318" y="231"/>
			<point x="1367" y="321"/>
			<point x="1378" y="435" type="curve" smooth="yes"/>
			<point x="1379" y="446"/>
			<point x="1382" y="455"/>
			<point x="1385" y="462" type="curve"/>
			<point x="1387.2409667969" y="483.8496398926"/>
			<point x="1388.3143310547" y="505.1091918945"/>
			<point x="1388.3143310547" y="525.7842407227" type="curve" smooth="yes"/>
			<point x="1388.3143310547" y="689.6267700195"/>
			<point x="1320.9071044922" y="816.7651977539"/>
			<point x="1233" y="910" type="curve" smooth="yes"/>
			<point x="1219.9702148438" y="923.6923828125"/>
			<point x="1214.5" y="938.6528320312"/>
			<point x="1214.5" y="953.0072021484" type="curve" smooth="yes"/>
			<point x="1214.5" y="988.3610229492"/>
			<point x="1247.6820068359" y="1020.038269043"/>
			<point x="1282.8269042969" y="1020.038269043" type="curve" smooth="yes"/>
			<point x="1298.0258789062" y="1020.038269043"/>
			<point x="1313.5919189453" y="1014.1137695312"/>
			<point x="1327" y="1000" type="curve" smooth="yes"/>
			<point x="1412" y="911"/>
			<point x="1468" y="809"/>
			<point x="1496" y="696" type="curve" smooth="yes"/>
			<point x="1510.80859375" y="636.2367553711"/>
			<point x="1518.0649414062" y="577.3126831055"/>
			<point x="1518.0649414062" y="519.5235595703" type="curve" smooth="yes"/>
			<point x="1518.0649414062" y="468.0453491211"/>
			<point x="1512.3068847656" y="417.4677734375"/>
			<point x="1501" y="368" type="curve"/>
			<point x="1489.6451416016" y="288.5155944824"/>
			<point x="1471.982421875" y="167.5527191162"/>
			<point x="1471.982421875" y="82.5126342773" type="curve" smooth="yes"/>
			<point x="1471.982421875" y="-73.486114502"/>
			<point x="1502.1702880859" y="-211.9599304199"/>
			<point x="1540" y="-354" type="curve" smooth="yes"/>
			<point x="1545" y="-373"/>
			<point x="1545" y="-394"/>
			<point x="1539" y="-415" type="curve" smooth="yes"/>
			<point x="1521.9000244141" y="-477.4519958496"/>
			<point x="1447.8660888672" y="-493.472442627"/>
			<point x="1362.1040039062" y="-493.472442627" type="curve" smooth="yes"/>
			<point x="1332.5133056641" y="-493.472442627"/>
			<point x="1301.5263671875" y="-491.565246582"/>
			<point x="1271" y="-489" type="curve" smooth="yes"/>
			<point x="1078.1358642578" y="-474.6473083496"/>
			<point x="920.4767456055" y="-467.3356323242"/>
			<point x="774.7432861328" y="-467.3356323242" type="curve" smooth="yes"/>
			<point x="595.5569458008" y="-467.3356323242"/>
			<point x="434.399810791" y="-478.3893737793"/>
			<point x="248" y="-501" type="curve" smooth="yes"/>
			<point x="244.8494262695" y="-501.3988037109"/>
			<point x="241.7895050049" y="-501.5908508301"/>
			<point x="238.8230285645" y="-501.5908508301" type="curve" smooth="yes"/>
			<point x="199.5157775879" y="-501.5908508301"/>
			<point x="176.6156921387" y="-467.872253418"/>
			<point x="176.6156921387" y="-434.6703491211" type="curve" smooth="yes"/>
			<point x="176.6156921387" y="-407.5478820801"/>
			<point x="191.8973083496" y="-380.7702331543"/>
			<point x="226" y="-373" type="curve" smooth="yes"/>
			<point x="258" y="-366" type="line" smooth="yes"/>
			<point x="513" y="-308"/>
			<point x="839" y="-176"/>
			<point x="999" y="0" type="curve"/>
			<point x="953" y="15"/>
			<point x="910" y="41"/>
			<point x="870" y="76" type="curve"/>
			<point x="784.8686523438" y="19.5542144775"/>
			<point x="687.7497558594" y="-8.4210758209"/>
			<point x="591.4194946289" y="-8.4210758209" type="curve" smooth="yes"/>
			<point x="317.7676086426" y="-8.4210758209"/>
			<point x="99.8263092041" y="210.0131378174"/>
			<point x="99.8263092041" y="486.6733093262" type="curve" smooth="yes"/>
			<point x="99.8263092041" y="648.1718139648"/>
			<point x="190.7772064209" y="793.7155761719"/>
			<point x="294" y="874" type="curve"/>
			<point x="343.4596862793" y="932.6614990234"/>
			<point x="418.7182617188" y="967.5086669922"/>
			<point x="497.3295593262" y="967.5086669922" type="curve" smooth="yes"/>
			<point x="555.4067993164" y="967.5086669922"/>
			<point x="615.3139648438" y="948.4887084961"/>
			<point x="668" y="906" type="curve"/>
			<point x="700.3374633789" y="971.7899780273"/>
			<point x="758.7042236328" y="1013.640625"/>
			<point x="848.9586791992" y="1013.640625" type="curve" smooth="yes"/>
			<point x="922.5383300781" y="1013.640625"/>
			<point x="990.8854370117" y="977.7604370117"/>
			<point x="1054" y="906" type="curve" smooth="yes"/>
			<point x="1126.8126220703" y="823.4138793945"/>
			<point x="1158.5510253906" y="720.7683105469"/>
		</contour>
		<contour>
			<point x="854.4166259766" y="884.8928833008" type="curve" smooth="yes"/>
			<point x="810.5952758789" y="884.8928833008"/>
			<point x="778.6987304688" y="859.2194213867"/>
			<point x="778.6987304688" y="825.8756103516" type="curve" smooth="yes"/>
			<point x="778.6987304688" y="814.9110107422"/>
			<point x="781.928894043" y="802.8327636719"/>
			<point x="789" y="790" type="curve" smooth="yes"/>
			<point x="798" y="773"/>
			<point x="796" y="753"/>
			<point x="783" y="732" type="curve"/>
			<point x="799" y="684"/>
			<point x="826" y="548"/>
			<point x="826" y="495" type="curve"/>
			<point x="839" y="399"/>
			<point x="860" y="322"/>
			<point x="889" y="265" type="curve"/>
			<point x="912" y="292"/>
			<point x="933" y="322"/>
			<point x="953" y="355" type="curve" smooth="yes"/>
			<point x="1003.42578125" y="441.444152832"/>
			<point x="1028.2509765625" y="526.9657592773"/>
			<point x="1028.2509765625" y="606.3590087891" type="curve" smooth="yes"/>
			<point x="1028.2509765625" y="692.2839355469"/>
			<point x="999.173034668" y="771.0306396484"/>
			<point x="942" y="836" type="curve" smooth="yes"/>
			<point x="913.8095092773" y="868.5952148438"/>
			<point x="884.842956543" y="884.8928833008"/>
		</contour>
		<contour>
			<point x="1341" y="78" type="curve"/>
			<point x="1277" y="21"/>
			<point x="1206" y="-10"/>
			<point x="1127" y="-16" type="curve"/>
			<point x="1130" y="-35"/>
			<point x="1125" y="-52"/>
			<point x="1113" y="-67" type="curve" smooth="yes"/>
			<point x="1030" y="-167"/>
			<point x="901" y="-258"/>
			<point x="727" y="-339" type="curve"/>
			<point x="759.4328613281" y="-338.3469848633"/>
			<point x="791.6287841797" y="-338.0256347656"/>
			<point x="823.5671386719" y="-338.0256347656" type="curve" smooth="yes"/>
			<point x="938.3572998047" y="-338.0256347656"/>
			<point x="1049.8208007812" y="-342.1766967773"/>
			<point x="1157" y="-350" type="curve" smooth="yes"/>
			<point x="1267.3397216797" y="-358.0539855957"/>
			<point x="1343.3000488281" y="-362.864654541"/>
			<point x="1384.3585205078" y="-362.864654541" type="curve" smooth="yes"/>
			<point x="1394.2790527344" y="-362.864654541"/>
			<point x="1402.1619873047" y="-362.5838012695"/>
			<point x="1408" y="-362" type="curve"/>
			<point x="1363.9383544922" y="-188.6907043457"/>
			<point x="1340.96875" y="-44.1433677673"/>
			<point x="1340.96875" y="70.7032699585" type="curve" smooth="yes"/>
			<point x="1340.96875" y="73.1489868164"/>
			<point x="1340.9791259766" y="75.5812301636"/>
		</contour>
	</outline>
</glyph>
