<?xml version="1.0" encoding="UTF-8"?>
<glyph name="infinity" format="2">
	<unicode hex="221E"/>
	<advance width="1561"/>
	<outline>
		<contour>
			<point x="481.0373535156" y="989.8858642578" type="curve" smooth="yes"/>
			<point x="481.0373535156" y="952.4750976562"/>
			<point x="446.1561889648" y="912.5568237305"/>
			<point x="420.4585266113" y="912.5568237305" type="curve" smooth="yes"/>
			<point x="405.5263671875" y="912.5568237305"/>
			<point x="388.8854675293" y="924.6407470703"/>
			<point x="373.2163696289" y="924.6407470703" type="curve" smooth="yes"/>
			<point x="350.3718566895" y="924.6407470703"/>
			<point x="326.9664001465" y="907.9537963867"/>
			<point x="303" y="875" type="curve" smooth="yes"/>
			<point x="269.3457336426" y="828.725402832"/>
			<point x="227.1217498779" y="686.0841064453"/>
			<point x="227.1217498779" y="558.6021728516" type="curve" smooth="yes"/>
			<point x="227.1217498779" y="440.3746337891"/>
			<point x="273.7320251465" y="376.3969421387"/>
			<point x="357.8327331543" y="376.3969421387" type="curve" smooth="yes"/>
			<point x="401.2953491211" y="376.3969421387"/>
			<point x="454.770690918" y="393.4837646484"/>
			<point x="517" y="429" type="curve"/>
			<point x="585" y="494"/>
			<point x="646" y="560"/>
			<point x="700" y="627" type="curve"/>
			<point x="675" y="672"/>
			<point x="637" y="745"/>
			<point x="586" y="846" type="curve" smooth="yes"/>
			<point x="535" y="947"/>
			<point x="494" y="1017"/>
			<point x="464" y="1054" type="curve" smooth="yes"/>
			<point x="449.9375" y="1071.34375"/>
			<point x="442.90625" y="1087.5888671875"/>
			<point x="442.90625" y="1102.7353515625" type="curve" smooth="yes"/>
			<point x="442.90625" y="1131.2364501953"/>
			<point x="478.7565307617" y="1166.4337158203"/>
			<point x="510.7984619141" y="1166.4337158203" type="curve" smooth="yes"/>
			<point x="530.6733398438" y="1166.4337158203"/>
			<point x="550.3366699219" y="1154.4301757812"/>
			<point x="570" y="1130" type="curve" smooth="yes"/>
			<point x="603" y="1089"/>
			<point x="643" y="1021"/>
			<point x="691" y="926" type="curve" smooth="yes"/>
			<point x="739" y="831"/>
			<point x="771" y="770"/>
			<point x="785" y="744" type="curve"/>
			<point x="794" y="758"/>
			<point x="820" y="799"/>
			<point x="862" y="866" type="curve" smooth="yes"/>
			<point x="904" y="933"/>
			<point x="955" y="986"/>
			<point x="1015" y="1026" type="curve" smooth="yes"/>
			<point x="1075" y="1066"/>
			<point x="1129" y="1094"/>
			<point x="1176" y="1109" type="curve" smooth="yes"/>
			<point x="1195.3618164062" y="1115.1793212891"/>
			<point x="1214.5538330078" y="1118.3038330078"/>
			<point x="1233.6461181641" y="1118.3038330078" type="curve" smooth="yes"/>
			<point x="1260.8996582031" y="1118.3038330078"/>
			<point x="1287.9498291016" y="1111.9370117188"/>
			<point x="1315" y="1099" type="curve" smooth="yes"/>
			<point x="1401.9342041016" y="1057.4227294922"/>
			<point x="1461.7672119141" y="935.3061523438"/>
			<point x="1461.7672119141" y="785.9419555664" type="curve" smooth="yes"/>
			<point x="1461.7672119141" y="615.2233886719"/>
			<point x="1412.7974853516" y="433.4673156738"/>
			<point x="1353" y="350" type="curve" smooth="yes"/>
			<point x="1284.6823730469" y="256.469909668"/>
			<point x="1212.0651855469" y="209.7384796143"/>
			<point x="1135.1485595703" y="209.7384796143" type="curve" smooth="yes"/>
			<point x="1022.9192504883" y="209.7384796143"/>
			<point x="901.5364379883" y="309.2286071777"/>
			<point x="771" y="508" type="curve"/>
			<point x="681" y="401"/>
			<point x="618" y="338"/>
			<point x="584" y="318" type="curve" smooth="yes"/>
			<point x="502.2692260742" y="269.9230651855"/>
			<point x="422.3875732422" y="245.8846130371"/>
			<point x="346.133026123" y="245.8846130371" type="curve" smooth="yes"/>
			<point x="179.354095459" y="245.8846130371"/>
			<point x="100.6535339355" y="408.0990905762"/>
			<point x="100.6535339355" y="591.2668457031" type="curve" smooth="yes"/>
			<point x="100.6535339355" y="735.3501586914"/>
			<point x="144.5760650635" y="878.6389770508"/>
			<point x="192" y="943" type="curve" smooth="yes"/>
			<point x="249.8571472168" y="1021.5714111328"/>
			<point x="308.7346801758" y="1060.8571777344"/>
			<point x="368.9970703125" y="1060.8571777344" type="curve" smooth="yes"/>
			<point x="414.2153320312" y="1060.8571777344"/>
			<point x="481.0373535156" y="1033.6667480469"/>
		</contour>
		<contour>
			<point x="856" y="617" type="curve"/>
			<point x="943" y="472"/>
			<point x="1025" y="383"/>
			<point x="1103" y="350" type="curve" smooth="yes"/>
			<point x="1113.7517089844" y="345.4603881836"/>
			<point x="1124.4464111328" y="343.2042236328"/>
			<point x="1135.0975341797" y="343.2042236328" type="curve" smooth="yes"/>
			<point x="1169.0256347656" y="343.2042236328"/>
			<point x="1202.5128173828" y="366.0967102051"/>
			<point x="1236" y="411" type="curve" smooth="yes"/>
			<point x="1292.0004882812" y="486.0915222168"/>
			<point x="1332.375" y="643.4312744141"/>
			<point x="1332.375" y="789.8848266602" type="curve" smooth="yes"/>
			<point x="1332.375" y="839.2777709961"/>
			<point x="1326.25" y="877.5833129883"/>
			<point x="1314" y="905" type="curve" smooth="yes"/>
			<point x="1293" y="952"/>
			<point x="1277" y="978"/>
			<point x="1263" y="985" type="curve" smooth="yes"/>
			<point x="1258.4085693359" y="987.295715332"/>
			<point x="1252.8491210938" y="988.4083251953"/>
			<point x="1246.2510986328" y="988.4083251953" type="curve" smooth="yes"/>
			<point x="1232.7307128906" y="988.4083251953"/>
			<point x="1214.8493652344" y="983.7365112305"/>
			<point x="1192" y="975" type="curve" smooth="yes"/>
			<point x="1101" y="938"/>
			<point x="1030" y="880"/>
			<point x="977" y="803" type="curve" smooth="yes"/>
			<point x="938" y="746"/>
			<point x="898" y="678"/>
		</contour>
	</outline>
</glyph>
