{
  "project_info": {
    "project_number": "83551861469",
    "project_id": "onlive-smartup-zero",
    "storage_bucket": "onlive-smartup-zero.appspot.com"
  },
  "client": [
    {
      "client_info": {
        "mobilesdk_app_id": "1:83551861469:android:43df495f3f4611df97b934",
        "android_client_info": {
          "package_name": "com.app.onlive"
        }
      },
      "oauth_client": [
        {
          "client_id": "83551861469-kdlmt1asu34j2k7meojbd5p6ue6j4m85.apps.googleusercontent.com",
          "client_type": 3
        }
      ],
      "api_key": [
        {
          "current_key": "AIzaSyAdVzGN-NRu_7vcLPS9EDDE5S5bt-tNoxI"
        }
      ],
      "services": {
        "appinvite_service": {
          "other_platform_oauth_client": [
            {
              "client_id": "83551861469-kdlmt1asu34j2k7meojbd5p6ue6j4m85.apps.googleusercontent.com",
              "client_type": 3
            }
          ]
        }
      }
    }
  ],
  "configuration_version": "1"
}