<?xml version="1.0" encoding="UTF-8"?>
<svg width="26px" height="26px" viewBox="0 0 26 26" version="1.1" xmlns="http://www.w3.org/2000/svg" xmlns:xlink="http://www.w3.org/1999/xlink">
    <!-- Generator: sketchtool 58 (101010) - https://sketch.com -->
    <title>2E86643C-DEAD-4118-864C-A8B01137A86E</title>
    <desc>Created with sketchtool.</desc>
    <g id="Page-1" stroke="none" stroke-width="1" fill="none" fill-rule="evenodd">
        <g id="Home-page" transform="translate(-173.000000, -3859.000000)">
            <g id="Why" transform="translate(135.000000, 3602.000000)">
                <g id="features" transform="translate(0.000000, 214.000000)">
                    <g id="Group-4">
                        <g id="top=traders-ic" transform="translate(34.000000, 39.000000)">
                            <rect id="bound" x="0" y="0" width="34" height="34"></rect>
                            <path d="M7.08333333,26.9166667 L28.3333333,26.9166667 C29.1157367,26.9166667 29.75,27.55093 29.75,28.3333333 C29.75,29.1157367 29.1157367,29.75 28.3333333,29.75 L5.66666667,29.75 C4.88426327,29.75 4.25,29.1157367 4.25,28.3333333 L4.25,5.66666667 C4.25,4.88426327 4.88426327,4.25 5.66666667,4.25 C6.44907006,4.25 7.08333333,4.88426327 7.08333333,5.66666667 L7.08333333,26.9166667 Z" id="Path-95" fill="#FFFFFF" fill-rule="nonzero"></path>
                            <path d="M12.3668444,20.8022499 C11.8317265,21.3730423 10.9352091,21.4019623 10.3644167,20.8668444 C9.79362435,20.3317264 9.76470443,19.4352091 10.2998223,18.8644168 L15.6123223,13.1977501 C16.1298444,12.6457265 16.9898254,12.5978541 17.565419,13.0890272 L21.7583779,16.6670189 L27.221416,9.74717059 C27.7062278,9.13307565 28.5970678,9.02827095 29.2111628,9.51308274 C29.8252577,9.99789455 29.9300624,10.8887345 29.4452506,11.5028294 L23.0702506,19.5778294 C22.5723128,20.2085507 21.6500252,20.299263 21.0387477,19.7776394 L16.754675,16.1218973 L12.3668444,20.8022499 Z" id="Path-97" fill="#FFFFFF" fill-rule="nonzero" opacity="0.3"></path>
                        </g>
                    </g>
                </g>
            </g>
        </g>
    </g>
</svg>