<?xml version="1.0" encoding="UTF-8"?>
<svg width="207px" height="248px" viewBox="0 0 207 248" version="1.1" xmlns="http://www.w3.org/2000/svg" xmlns:xlink="http://www.w3.org/1999/xlink">
    <!-- Generator: sketchtool 58 (101010) - https://sketch.com -->
    <title>FE5D79A8-E90B-4496-A618-CD99CAEBA79F</title>
    <desc>Created with sketchtool.</desc>
    <defs>
        <linearGradient x1="-1.44374958%" y1="49.7808932%" x2="100.006236%" y2="49.7808932%" id="linearGradient-1">
            <stop stop-color="#5963C5" offset="0%"></stop>
            <stop stop-color="#4F54BE" offset="30%"></stop>
            <stop stop-color="#332BAC" offset="88%"></stop>
            <stop stop-color="#2D22A8" offset="100%"></stop>
        </linearGradient>
    </defs>
    <g id="Page-1" stroke="none" stroke-width="1" fill="none" fill-rule="evenodd" opacity="0.1">
        <g id="Home-page" transform="translate(0.000000, -5038.000000)" fill="url(#linearGradient-1)" fill-rule="nonzero">
            <g id="Footer" transform="translate(0.000000, 4972.000000)">
                <g id="footer-bg-ic">
                    <g>
                        <path d="M-12.9034323,134.963887 C12.6960264,77.6703195 79.3486884,50.953379 137.676436,74.6057071 C165.953948,87.1038922 188.086792,110.274972 199.205904,139.021477 C210.325016,167.767982 209.519558,199.735099 196.966724,227.890295 L196.966724,227.890295 L147.724056,337.84388 C147.162719,339.087006 145.953277,339.915838 144.586625,339.993967 C143.219972,340.072097 141.923203,339.38654 141.222655,338.215554 C130.335142,319.817686 116.33691,298.880046 95.2151338,297.207513 C93.8464178,297.083621 92.508809,296.928757 91.2023074,296.74292 C74.5655938,296.889641 58.0911664,293.478012 42.8928547,286.738693 L42.8928547,286.738693 L41.2015306,285.907788 C-14.2941502,258.096401 -38.2468963,191.68452 -12.9034323,134.963887 Z M92.5,133 C63.5050506,133 40,156.728908 40,186 C40,215.271092 63.5050506,239 92.5,239 C121.494949,239 145,215.271092 145,186 C145,156.728908 121.494949,133 92.5,133 Z"></path>
                    </g>
                </g>
            </g>
        </g>
    </g>
</svg>