{
    "swagger": "2.0",
    "info": {
        "title": "Dokumentasi API SmartClassroom",
        "contact": {
            "name": "Smart Campus : Smart Classroom",
            "email": "ryche@s.itb.ac.id"
        },
        "version": "0.1"
    },
    "host": "localhost/smartcampus/classroomserv1.0/",
    "paths": {
        "/api/attendance": {
            "get": {
                "tags": [
                    "attendance"
                ],
                "summary": "Mengambil Data Attendance yang tersimpan dalam service SmartClassroom",
                "operationId": "getAttendance",
                "parameters": [
                    {
                        "name": "u",
                        "in": "query",
                        "description": "Token SSO",
                        "required": true,
                        "type": "string"
                    }
                ],
                "responses": {
                    "200": {
                        "description": "Working"
                    },
                    "default": {
                        "description": "an \"unexpected\" error"
                    }
                }
            }
        },
        "/api/attendance/{id}": {
            "get": {
                "tags": [
                    "attendance"
                ],
                "summary": "Mengambil Data Attendance yang tersimpan dalam service SmartClassroom",
                "operationId": "show",
                "parameters": [
                    {
                        "name": "u",
                        "in": "query",
                        "description": "Token SSO",
                        "required": true,
                        "type": "string"
                    }
                ],
                "responses": {
                    "200": {
                        "description": "Working"
                    },
                    "default": {
                        "description": "an \"unexpected\" error"
                    }
                }
            }
        },
        "/api/attendance/update/{id}": {
            "put": {
                "tags": [
                    "attendance"
                ],
                "summary": "Update data attendance SmartClassroom",
                "operationId": "updateAttendance",
                "parameters": [
                    {
                        "name": "id",
                        "in": "path",
                        "description": "id attendance",
                        "required": true,
                        "type": "string"
                    },
                    {
                        "name": "u",
                        "in": "query",
                        "description": "Token SSO",
                        "required": true,
                        "type": "string"
                    },
                    {
                        "name": "body",
                        "in": "body",
                        "schema": {
                            "properties": {
                                "attendance": {
                                    "type": "boolean",
                                    "example": true
                                }
                            }
                        }
                    }
                ],
                "responses": {
                    "200": {
                        "description": "Working"
                    },
                    "default": {
                        "description": "an \"unexpected\" error"
                    }
                }
            }
        },
        "/api/user/register": {
            "post": {
                "tags": [
                    "user"
                ],
                "summary": "Register User",
                "description": "deprecated, see identitymanager to get access",
                "operationId": "register",
                "parameters": [
                    {
                        "name": "User",
                        "in": "body",
                        "description": "User to create",
                        "schema": {
                            "properties": {
                                "name": {
                                    "type": "string",
                                    "example": "John Doe"
                                },
                                "email": {
                                    "type": "string",
                                    "example": "33216028@students.itb.ac.id"
                                },
                                "password": {
                                    "type": "string",
                                    "example": "33216028"
                                },
                                "role": {
                                    "maxProperties": 8,
                                    "minProperties": 0,
                                    "type": "integer",
                                    "example": 1
                                }
                            }
                        }
                    }
                ],
                "responses": {
                    "201": {
                        "description": "Success"
                    },
                    "default": {
                        "description": "an \"unexpected\" error"
                    }
                }
            }
        },
        "/api/user/login": {
            "post": {
                "tags": [
                    "user"
                ],
                "summary": "Login User",
                "description": "deprecated, see identitymanager to get access",
                "operationId": "login",
                "parameters": [
                    {
                        "name": "User",
                        "in": "body",
                        "description": "User to create",
                        "schema": {
                            "properties": {
                                "email": {
                                    "type": "string",
                                    "example": "33216028@students.itb.ac.id"
                                },
                                "password": {
                                    "type": "string",
                                    "example": "33216028"
                                }
                            }
                        }
                    }
                ],
                "responses": {
                    "200": {
                        "description": "Success!"
                    },
                    "403": {
                        "description": "The Username or Password not Valid!"
                    }
                }
            }
        },
        "/api/request": {
            "get": {
                "tags": [
                    "schedule request"
                ],
                "summary": "Mengambil Data Permintaan Jadwal Ruangan yang tersimpan dalam service SmartClassroom",
                "operationId": "getClassroomScheduleRequest",
                "responses": {
                    "200": {
                        "description": "Working"
                    },
                    "default": {
                        "description": "an \"unexpected\" error"
                    }
                }
            },
            "post": {
                "tags": [
                    "schedule request"
                ],
                "operationId": "addClassroomScheduleRequest",
                "parameters": [
                    {
                        "name": "u",
                        "in": "query",
                        "description": "Token SSO",
                        "required": true,
                        "type": "string"
                    },
                    {
                        "name": "body",
                        "in": "body",
                        "schema": {
                            "properties": {
                                "class_id": {
                                    "type": "integer",
                                    "example": 1
                                },
                                "schedule_date": {
                                    "type": "string",
                                    "example": "2019-01-21"
                                },
                                "schedule_time_start": {
                                    "type": "string",
                                    "example": "13:00:00"
                                },
                                "schedule_time_end": {
                                    "type": "string",
                                    "example": "15:00:00"
                                }
                            }
                        }
                    }
                ],
                "responses": {
                    "201": {
                        "description": "OK"
                    },
                    "default": {
                        "description": "an \"unexpected\" error"
                    }
                }
            }
        },
        "/api/request/verifikasi/{id}": {
            "put": {
                "tags": [
                    "schedule request"
                ],
                "summary": "verifikasi permintaan jadwal ruangan kelas",
                "operationId": "verifikasiClassroomScheduleRequest",
                "parameters": [
                    {
                        "name": "u",
                        "in": "query",
                        "description": "Token SSO",
                        "required": true,
                        "type": "string"
                    },
                    {
                        "name": "id",
                        "in": "path",
                        "type": "integer"
                    }
                ],
                "responses": {
                    "201": {
                        "description": "Working"
                    },
                    "default": {
                        "description": "an \"unexpected\" error"
                    }
                }
            }
        },
        "/api/classroom/schedule": {
            "get": {
                "description": "mendapatkan jadwal dari seluruh ruangan",
                "operationId": "getClassroomSchedule",
                "responses": {
                    "200": {
                        "description": "Working"
                    },
                    "default": {
                        "description": "an \"unexpected\" error"
                    }
                }
            }
        },
        "/api/mahasiswa": {
            "get": {
                "tags": [
                    "mahasiswa"
                ],
                "summary": "Get All Student registered in ITB",
                "description": "Token yang diberikan hanya untuk staf akademik/dosen",
                "operationId": "index",
                "parameters": [
                    {
                        "name": "u",
                        "in": "query",
                        "description": "Token SSO",
                        "required": true,
                        "type": "string"
                    }
                ],
                "responses": {
                    "200": {
                        "description": "Working"
                    },
                    "default": {
                        "description": "an \"unexpected\" error"
                    }
                }
            }
        },
        "/api/tahunakademik": {
            "get": {
                "tags": [
                    "tahun akademik"
                ],
                "summary": "Mendapatkan seluruh tahun akademik ",
                "operationId": "index",
                "responses": {
                    "200": {
                        "description": "Working"
                    },
                    "default": {
                        "description": "an \"unexpected\" error"
                    }
                }
            },
            "post": {
                "tags": [
                    "tahun akademik"
                ],
                "operationId": "store",
                "parameters": [
                    {
                        "name": "body",
                        "in": "body",
                        "description": "the item to create",
                        "schema": {
                            "properties": {
                                "tahun": {
                                    "type": "integer",
                                    "example": 2020
                                },
                                "semester": {
                                    "type": "integer",
                                    "example": 1
                                }
                            }
                        }
                    }
                ],
                "responses": {
                    "201": {
                        "description": "Resource Created"
                    },
                    "default": {
                        "description": "an \"unexpected\" error"
                    }
                }
            }
        }
    },
    "definitions": {}
}