<?xml version="1.0" encoding="UTF-8" standalone="no"?>
<svg
   xmlns:dc="http://purl.org/dc/elements/1.1/"
   xmlns:cc="http://creativecommons.org/ns#"
   xmlns:rdf="http://www.w3.org/1999/02/22-rdf-syntax-ns#"
   xmlns:svg="http://www.w3.org/2000/svg"
   xmlns="http://www.w3.org/2000/svg"
   width="304.30621mm"
   height="40.618668mm"
   viewBox="0 0 304.30621 40.618669"
   version="1.1"
   id="svg8">
  <defs
     id="defs2" />
  <metadata
     id="metadata5">
    <rdf:RDF>
      <cc:Work
         rdf:about="">
        <dc:format>image/svg+xml</dc:format>
        <dc:type
           rdf:resource="http://purl.org/dc/dcmitype/StillImage" />
        <dc:title></dc:title>
      </cc:Work>
    </rdf:RDF>
  </metadata>
  <g
     id="layer7"
     style="display:inline"
     transform="translate(44.41494,-176.80484)">
    <g
       id="g164"
       transform="translate(-0.52916667)">
      <path
         style="display:inline;fill:#087139;fill-opacity:1;stroke-width:0.15755539"
         d="m 37.505429,152.38623 -0.0134,-29.94095 62.767911,-55.572682 -0.0221,29.799203 -62.7324,55.714429 z"
         id="path4755-4" />
      <path
         style="display:inline;fill:#1abe67;fill-opacity:1;stroke-width:0.15755539"
         d="m 35.889195,151.63107 -0.0134,-29.94095 62.76791,-55.572658 -0.0221,29.799204 -62.7324,55.714404 z"
         id="path4755" />
    </g>
  </g>
  <g
     id="layer4"
     style="display:inline"
     transform="translate(44.41494,-176.80484)">
    <g
       id="g160">
      <path
         id="use3819-7"
         d="m 76.714227,151.9747 -0.0134,-29.94095 62.767783,-55.572655 -0.0221,29.799205 z"
         style="display:inline;fill:#087139;fill-opacity:1;stroke-width:0.15755539" />
      <path
         id="use3819"
         d="m 74.851025,151.63107 -0.0134,-29.94095 62.767805,-55.572659 -0.0221,29.799206 z"
         style="fill:#12954f;fill-opacity:1;stroke-width:0.15755539" />
    </g>
  </g>
  <g
     id="layer5"
     style="display:inline"
     transform="translate(44.41494,-176.80484)">
    <g
       id="g156"
       transform="translate(0.52916667)">
      <path
         id="use3819-0-7"
         d="m 115.03094,151.9747 -0.0134,-29.94095 62.76758,-55.572661 -0.0221,29.799206 z"
         style="display:inline;opacity:1;vector-effect:none;fill:#1abe67;fill-opacity:1;stroke-width:0.15755539;stroke-linecap:butt;stroke-linejoin:miter;stroke-miterlimit:4;stroke-dasharray:none;stroke-dashoffset:0;stroke-opacity:1" />
      <g
         id="g151">
        <path
           style="display:inline;opacity:1;vector-effect:none;fill:#087139;fill-opacity:1;stroke-width:0.15755539;stroke-linecap:butt;stroke-linejoin:miter;stroke-miterlimit:4;stroke-dasharray:none;stroke-dashoffset:0;stroke-opacity:1"
           d="m 113.4802,151.63107 -0.0134,-29.94095 62.76758,-55.572659 -0.0221,29.799206 z"
           id="use3819-0" />
      </g>
    </g>
  </g>
  <g
     id="layer6"
     style="display:inline"
     transform="translate(44.41494,-176.80484)">
    <g
       id="flowRoot3856"
       style="font-style:normal;font-weight:normal;font-size:40px;line-height:1.25;font-family:sans-serif;letter-spacing:0px;word-spacing:0px;fill:#000000;fill-opacity:1;stroke:none"
       transform="scale(0.26458333)" />
    <g
       id="text3866"
       style="font-style:normal;font-weight:normal;font-size:11.51540184px;line-height:1.25;font-family:sans-serif;letter-spacing:0px;word-spacing:0px;fill:#1abe67;fill-opacity:1;stroke:none;stroke-width:0.28788507"
       transform="scale(0.99867376,1.001328)"
       aria-label="Smart">
      <path
         id="path3733"
         style="font-style:normal;font-variant:normal;font-weight:bold;font-stretch:normal;font-size:55.27393341px;font-family:'Open Sans';-inkscape-font-specification:'Open Sans Bold';fill:#1abe67;fill-opacity:1;stroke-width:0.28788507"
         d="m -18.753191,205.63774 q 0,5.34387 -3.859459,8.42064 -3.83247,3.07677 -10.687734,3.07677 -6.315478,0 -11.173539,-2.37505 v -7.7729 q 3.994405,1.78129 6.747306,2.51 2.779891,0.72871 5.073975,0.72871 2.752901,0 4.210319,-1.05258 1.484407,-1.05258 1.484407,-3.13075 0,-1.16054 -0.647741,-2.05118 -0.647741,-0.91763 -1.916235,-1.7543 -1.241504,-0.83667 -5.100964,-2.67193 -3.616556,-1.70032 -5.424834,-3.2657 -1.808278,-1.56538 -2.887847,-3.64355 -1.079569,-2.07817 -1.079569,-4.85806 0,-5.23591 3.535588,-8.23171 3.562578,-2.9958 9.824078,-2.9958 3.076772,0 5.856662,0.72871 2.80688,0.7287 5.856662,2.05118 l -2.698922,6.5044 q -3.15774,-1.29548 -5.23591,-1.80828 -2.051181,-0.51279 -4.048384,-0.51279 -2.375052,0 -3.643545,1.10655 -1.268494,1.10656 -1.268494,2.88785 0,1.10656 0.512796,1.94323 0.512795,0.80967 1.619353,1.59236 1.133548,0.7557 5.316877,2.7529 5.532792,2.64495 7.583973,5.31688 2.051181,2.64494 2.051181,6.5044 z" />
      <path
         id="path3735"
         style="font-style:normal;font-variant:normal;font-weight:bold;font-stretch:normal;font-size:55.27393341px;font-family:'Open Sans';-inkscape-font-specification:'Open Sans Bold';fill:#1abe67;fill-opacity:1;stroke-width:0.28788507"
         d="M 14.767426,216.59537 H 6.5357126 V 198.9714 q 0,-3.26569 -1.1065583,-4.88505 -1.079569,-1.64634 -3.4276316,-1.64634 -3.1577393,0 -4.5881683,2.32107 -1.4304289,2.32108 -1.4304289,7.63795 v 14.19634 h -8.2317135 v -30.17396 h 6.2884893 l 1.1065582,3.85946 h 0.4588168 q 1.2145152,-2.07817 3.50859931,-3.2387 2.29408419,-1.18753 5.26289889,-1.18753 6.7742955,0 9.1763365,4.42623 h 0.728709 q 1.214515,-2.10516 3.562578,-3.26569 2.375052,-1.16054 5.343867,-1.16054 5.127952,0 7.745907,2.64494 2.644944,2.61796 2.644944,8.42064 v 19.67515 H 25.320213 V 198.9714 q 0,-3.26569 -1.106558,-4.88505 -1.079569,-1.64634 -3.427631,-1.64634 -3.022794,0 -4.53419,2.15914 -1.484408,2.15914 -1.484408,6.85526 z" />
      <path
         id="path3737"
         style="font-style:normal;font-variant:normal;font-weight:bold;font-stretch:normal;font-size:55.27393341px;font-family:'Open Sans';-inkscape-font-specification:'Open Sans Bold';fill:#1abe67;fill-opacity:1;stroke-width:0.28788507"
         d="m 61.215886,216.59537 -1.592364,-4.10236 h -0.215914 q -2.07817,2.61795 -4.291287,3.64354 -2.186127,0.9986 -5.721716,0.9986 -4.345265,0 -6.855263,-2.48301 -2.483009,-2.48301 -2.483009,-7.07117 0,-4.80409 3.346664,-7.07118 3.373653,-2.29408 10.147949,-2.53699 l 5.23591,-0.16193 v -1.32248 q 0,-4.58816 -4.696125,-4.58816 -3.616557,0 -8.501606,2.18612 l -2.725912,-5.55978 q 5.20892,-2.72591 11.551388,-2.72591 6.072576,0 9.311283,2.64495 3.238707,2.64494 3.238707,8.04278 v 20.10698 z m -2.42903,-13.98042 -3.184729,0.10796 q -3.589567,0.10795 -5.343866,1.29548 -1.7543,1.18752 -1.7543,3.61655 0,3.48161 3.994405,3.48161 2.860858,0 4.561179,-1.64634 1.727311,-1.64634 1.727311,-4.37225 z" />
      <path
         id="path3739"
         style="font-style:normal;font-variant:normal;font-weight:bold;font-stretch:normal;font-size:55.27393341px;font-family:'Open Sans';-inkscape-font-specification:'Open Sans Bold';fill:#1abe67;fill-opacity:1;stroke-width:0.28788507"
         d="m 92.253493,185.85464 q 1.673332,0 2.779891,0.2429 l -0.620753,7.71892 q -0.998601,-0.26989 -2.42903,-0.26989 -3.940427,0 -6.153543,2.02419 -2.186128,2.02419 -2.186128,5.66774 v 15.35687 h -8.231713 v -30.17396 h 6.234511 l 1.214515,5.07398 h 0.404838 q 1.40344,-2.53699 3.778492,-4.07538 2.402041,-1.56537 5.20892,-1.56537 z" />
      <path
         id="path3741"
         style="font-style:normal;font-variant:normal;font-weight:bold;font-stretch:normal;font-size:55.27393341px;font-family:'Open Sans';-inkscape-font-specification:'Open Sans Bold';fill:#1abe67;fill-opacity:1;stroke-width:0.28788507"
         d="m 113.2781,210.57677 q 2.15913,0 5.18193,-0.94462 v 6.12655 q -3.07677,1.37645 -7.55699,1.37645 -4.93902,0 -7.20612,-2.48301 -2.24011,-2.50999 -2.24011,-7.503 v -14.54719 h -3.940422 v -3.48161 l 4.534192,-2.7529 2.37505,-6.36946 h 5.2629 v 6.42343 h 8.44763 v 6.18054 h -8.44763 v 14.54719 q 0,1.7543 0.97161,2.59096 0.9986,0.83667 2.61796,0.83667 z" />
    </g>
    <g
       id="text64"
       style="font-style:normal;font-weight:normal;font-size:54.17668533px;line-height:1.25;font-family:sans-serif;letter-spacing:0px;word-spacing:0px;fill:#087139;fill-opacity:1;stroke:none;stroke-width:1.3544172"
       transform="scale(0.99841063,1.0015919)"
       aria-label="Farm">
      <path
         id="path3744"
         style="fill:#087139;fill-opacity:1;stroke-width:1.3544172"
         d="m 136.60862,176.69902 h 22.69707 v 4.49708 h -17.35347 v 11.63953 h 15.66045 v 4.49708 h -15.66045 v 18.86132 h -5.3436 z" />
      <path
         id="path3746"
         style="fill:#087139;fill-opacity:1;stroke-width:1.3544172"
         d="m 176.10363,201.30073 q -5.89912,0 -8.17411,1.34913 -2.275,1.34913 -2.275,4.6029 0,2.59244 1.69302,4.12674 1.71947,1.50785 4.65581,1.50785 4.04738,0 6.4811,-2.85698 2.46017,-2.88342 2.46017,-7.64505 v -1.08459 z m 9.70842,-2.01046 v 16.90376 h -4.86743 v -4.49709 q -1.66657,2.69826 -4.1532,3.99448 -2.48662,1.26976 -6.08429,1.26976 -4.55,0 -7.24825,-2.53953 -2.6718,-2.56599 -2.6718,-6.85145 0,-4.9997 3.33314,-7.53923 3.35959,-2.53954 9.99941,-2.53954 h 6.82499 v -0.47616 q 0,-3.35959 -2.22209,-5.18488 -2.19564,-1.85174 -6.19011,-1.85174 -2.53953,0 -4.9468,0.60843 -2.40726,0.60843 -4.62935,1.82529 v -4.49709 q 2.67179,-1.03168 5.18487,-1.5343 2.51308,-0.52907 4.89389,-0.52907 6.42819,0 9.60261,3.33314 3.17441,3.33313 3.17441,10.10522 z" />
      <path
         id="path3748"
         style="fill:#087139;fill-opacity:1;stroke-width:1.3544172"
         d="m 213.03266,191.11615 q -0.82005,-0.47616 -1.79883,-0.68779 -0.95233,-0.23808 -2.11628,-0.23808 -4.12674,0 -6.34883,2.69825 -2.19564,2.6718 -2.19564,7.69796 v 15.60754 h -4.89389 v -29.62787 h 4.89389 v 4.6029 q 1.5343,-2.69825 3.99448,-3.99447 2.46017,-1.32268 5.97848,-1.32268 0.50261,0 1.11104,0.0794 0.60843,0.0529 1.34913,0.18518 z" />
      <path
         id="path3750"
         style="fill:#087139;fill-opacity:1;stroke-width:1.3544172"
         d="m 240.30618,192.25365 q 1.82529,-3.28023 4.36482,-4.84098 2.53953,-1.56076 5.97848,-1.56076 4.62936,0 7.14244,3.25378 2.51308,3.22732 2.51308,9.2058 v 17.88254 h -4.89389 v -17.72382 q 0,-4.259 -1.50785,-6.32237 -1.50785,-2.06337 -4.6029,-2.06337 -3.78285,0 -5.97848,2.51307 -2.19564,2.51308 -2.19564,6.85145 v 16.74504 h -4.89389 v -17.72382 q 0,-4.28546 -1.50785,-6.32237 -1.50785,-2.06337 -4.65581,-2.06337 -3.72993,0 -5.92557,2.53953 -2.19564,2.51308 -2.19564,6.82499 v 16.74504 h -4.89389 v -29.62787 h 4.89389 v 4.6029 q 1.66657,-2.72471 3.99447,-4.02093 2.32791,-1.29622 5.52878,-1.29622 3.22732,0 5.47586,1.64012 2.275,1.64011 3.35959,4.76162 z" />
    </g>
  </g>
</svg>
