﻿{
  "dependencies": {
    "Microsoft.NETCore.UniversalWindowsPlatform": "5.1.0",
    "NepaliDateTool.UWP": "1.0.0",
    "NotificationsExtensions.Win10": "14332.0.2"
  },
  "frameworks": {
    "uap10.0.10586": {}
  },
  "runtimes": {
    "win10-arm": {},
    "win10-arm-aot": {},
    "win10-x86": {},
    "win10-x86-aot": {},
    "win10-x64": {},
    "win10-x64-aot": {}
  }
}