<svg width="100" height="100" viewBox="0 0 100 100" fill="none" xmlns="http://www.w3.org/2000/svg">
<rect x="16.4839" y="52.8925" width="6" height="39.5875" rx="3" transform="rotate(-37.4094 16.4839 52.8925)" fill="#21B561"/>
<rect x="42.0757" y="84.2221" width="6" height="76.8652" rx="3" transform="rotate(-147.771 42.0757 84.2221)" fill="#21B561"/>
</svg>
