<svg width="66" height="66" viewBox="0 0 66 66" fill="none" xmlns="http://www.w3.org/2000/svg">
<rect x="4.46638" y="9.14667" width="6" height="73.9729" rx="3" transform="rotate(-45.5906 4.46638 9.14667)" fill="#F25757"/>
<rect x="8.95515" y="61.1605" width="6" height="73.9729" rx="3" transform="rotate(-135 8.95515 61.1605)" fill="#F25757"/>
</svg>
