<svg width="196" height="196" viewBox="0 0 196 196" fill="none" xmlns="http://www.w3.org/2000/svg">
    <defs>
        <linearGradient id="paint0_linear" x1="40.9995" y1="98.0018" x2="154.997" y2="98.0018" gradientUnits="userSpaceOnUse">
            <stop stop-color="#FFCF42"/>
            <stop offset="1" stop-color="#FFB500"/>
        </linearGradient>
        <linearGradient id="paint1_linear" x1="148.386" y1="98.3643" x2="118.571" y2="90.9207" gradientUnits="userSpaceOnUse">
            <stop stop-color="#FFB500" stop-opacity="0"/>
            <stop offset="1" stop-color="#FF7000"/>
        </linearGradient>
        <linearGradient id="paint2_linear" x1="90.9986" y1="162.531" x2="90.9986" y2="173.513" gradientUnits="userSpaceOnUse">
            <stop stop-color="#3F3F3F"/>
            <stop offset="1" stop-color="#303030"/>
        </linearGradient>
    </defs>
<path d="M154.95 38.0345L139.973 169.141C139.489 173.381 135.635 176.432 131.371 175.95L47.8975 166.52C43.6335 166.038 40.5659 162.206 41.0503 157.965L56.0269 26.8592C56.5113 22.6189 60.3651 19.5683 64.6294 20.05L148.102 29.4798C152.367 29.9615 155.434 33.7939 154.95 38.0345Z" fill="url(#paint0_linear)"/>
<path d="M140 29L140.859 164L140.865 163.992L155 43.523L140 29Z" fill="url(#paint1_linear)"/>
<path d="M141 31.7623V164.238C141 168.522 137.502 172 133.191 172H48.8091C44.4985 172 41 168.523 41 164.238V31.7623C41 27.4775 44.4982 24 48.8091 24H133.191C137.502 24 141 27.4772 141 31.7623Z" fill="#3F3F3F"/>
<path d="M79.8409 80.1041C80.1417 80.0359 80.4491 80.001 80.7576 80H81.9154C82.0036 80 82.0895 80.0125 82.1772 80.0146L82.1796 80.0033L82.318 79.3146L82.849 76.6729L81.999 76.3861V75C81.999 74.7348 81.8936 74.4804 81.7061 74.2929C81.5185 74.1054 81.2642 74 80.999 74C80.7338 74 80.4794 74.1054 80.2919 74.2929C80.1043 74.4804 79.999 74.7348 79.999 75V76.3848L79.1572 76.6674L79.8409 80.1041Z" fill="#FFF2E8"/>
<path d="M99.823 80.0144C99.9105 80.012 99.9956 79.9999 100.083 79.9999H101.241C101.55 80.0009 101.858 80.036 102.159 80.1044L102.849 76.6728L101.999 76.386V75C101.999 74.7348 101.893 74.4804 101.706 74.2929C101.518 74.1054 101.264 74 100.999 74C100.734 74 100.479 74.1054 100.292 74.2929C100.104 74.4804 99.9989 74.7348 99.9989 75V76.3848L99.1572 76.6674L99.823 80.0144Z" fill="#FFF2E8"/>
<path d="M107.999 113.142V112C107.999 111.735 107.893 111.481 107.706 111.293C107.518 111.106 107.264 111 106.999 111C106.734 111 106.479 111.106 106.292 111.293C106.104 111.481 105.999 111.735 105.999 112V113.142C105.231 113.343 104.54 113.767 104.015 114.363C103.49 114.958 103.154 115.697 103.051 116.484L101.688 116.142L99.7355 112.238C99.4453 111.237 98.9074 110.326 98.1717 109.588L97.4617 108.878C97.1967 108.607 96.964 108.306 96.768 107.981C96.5181 108.164 96.2414 108.308 95.9476 108.406L91.3152 109.95C91.1099 110.018 90.8878 110.018 90.6825 109.95L86.0496 108.405C85.7558 108.307 85.4791 108.163 85.2292 107.98C85.0332 108.305 84.8004 108.605 84.5355 108.877L83.8255 109.587C83.0897 110.325 82.552 111.237 82.2621 112.238L80.3105 116.141L79.0676 116.452L76.5051 113.592C76.7393 113.229 76.8913 112.818 76.9502 112.39C77.0272 111.802 76.928 111.204 76.6652 110.672C76.4024 110.14 75.9878 109.698 75.4737 109.402C74.9597 109.105 74.3693 108.968 73.7773 109.007C73.1853 109.046 72.6182 109.26 72.1477 109.622C71.6772 109.983 71.3245 110.476 71.1342 111.038C70.9438 111.6 70.9244 112.206 71.0783 112.779C71.2322 113.352 71.5526 113.866 71.9989 114.257C72.4452 114.648 72.9974 114.898 73.5857 114.975C73.7156 114.992 73.8464 115 73.9773 115C74.3026 114.998 74.6252 114.942 74.9323 114.835L76.873 117L76.7561 117.029C76.4988 117.094 76.2776 117.258 76.1411 117.485C76.0047 117.713 75.9642 117.985 76.0286 118.242C76.093 118.5 76.2569 118.721 76.4844 118.857C76.7118 118.994 76.9842 119.034 77.2415 118.97L78.3823 118.685L79.2557 119.66C79.3436 119.757 79.4499 119.837 79.5685 119.893C79.687 119.95 79.8156 119.982 79.9467 119.989C80.0779 119.996 80.2091 119.977 80.3329 119.933C80.4567 119.889 80.5707 119.821 80.6683 119.733C80.7659 119.645 80.8452 119.539 80.9017 119.421C80.9582 119.302 80.9908 119.173 80.9977 119.042C81.0045 118.911 80.9855 118.78 80.9416 118.656C80.8977 118.532 80.8299 118.418 80.742 118.321L80.5767 118.136L81.2415 117.97C81.3814 117.935 81.5121 117.87 81.6246 117.78C81.7372 117.69 81.8288 117.576 81.8933 117.447L84.1172 113H84.409C85.1615 111.756 85.2376 110.763 86.5516 110.106C86.7696 109.997 87.0199 109.971 87.2555 110.034C87.4911 110.096 87.6957 110.243 87.8308 110.445L90.9988 115.197L94.1668 110.445C94.302 110.243 94.5066 110.096 94.7422 110.034C94.9778 109.971 95.2281 109.997 95.4461 110.106C96.7601 110.763 96.8362 111.756 97.5887 113H97.8807L100.104 117.447C100.169 117.576 100.26 117.69 100.373 117.78C100.485 117.87 100.616 117.935 100.756 117.97L103.349 118.62C103.622 119.239 104.048 119.779 104.586 120.189C105.125 120.599 105.759 120.865 106.429 120.963C107.099 121.06 107.783 120.986 108.416 120.747C109.049 120.507 109.612 120.111 110.05 119.595C110.488 119.079 110.787 118.46 110.921 117.796C111.054 117.132 111.016 116.446 110.811 115.8C110.606 115.155 110.24 114.573 109.749 114.108C109.257 113.643 108.655 113.31 107.999 113.142L107.999 113.142Z" fill="#FFF2E8"/>
<path d="M73.1094 96.9932L67.0924 97.6624C68.9071 98.6328 70.8683 99.2995 72.8984 99.636L75.1634 100.013C75.3717 100.048 75.5637 100.148 75.7118 100.298C75.8599 100.449 75.9566 100.642 75.988 100.851C76.0194 101.06 75.9838 101.273 75.8865 101.461C75.7892 101.648 75.6351 101.8 75.4462 101.894L74.6712 102.282C73.373 102.932 72.1969 103.801 71.1949 104.851C72.7149 104.598 74.1635 104.024 75.4449 103.168C75.5955 103.068 75.7705 103.01 75.9512 103.001C76.1319 102.993 76.3116 103.033 76.471 103.119C76.6305 103.204 76.7639 103.331 76.8569 103.486C76.9498 103.641 76.999 103.819 76.9991 104V105.586L78.2919 104.293C78.4795 104.105 78.7338 104 78.999 104C79.2642 104 79.5185 104.105 79.7061 104.293L80.8436 105.43L81.0576 105.109C81.7399 104.085 82.7953 103.367 83.9991 103.108V100.962C83.0072 101.566 81.8636 101.875 80.7025 101.851C79.5415 101.828 78.4112 101.474 77.4443 100.831C77.3351 100.758 77.2412 100.664 77.1681 100.555C77.0951 100.446 77.0442 100.324 77.0184 100.195C76.9927 100.066 76.9925 99.9336 77.018 99.8048C77.0435 99.6759 77.0941 99.5534 77.1669 99.4441C77.2398 99.3349 77.3334 99.241 77.4426 99.1679C77.5517 99.0949 77.6741 99.044 77.8029 99.0182C77.9316 98.9925 78.0642 98.9923 78.1931 99.0178C78.3219 99.0433 78.4444 99.0939 78.5537 99.1667C79.2591 99.6359 80.0926 99.8752 80.9395 99.8517C81.7864 99.8282 82.6052 99.5431 83.2836 99.0355L83.9991 98.4999V96.1624L83.2634 97.2092C83.2334 97.2522 83.2 97.2927 83.1634 97.3304C82.6155 97.8957 81.8867 98.2511 81.1038 98.3347C80.321 98.4183 79.5336 98.2249 78.8786 97.788L78.8398 97.7622C78.2518 97.371 77.8006 96.8061 77.5488 96.1462C77.2971 95.4864 77.2575 94.7644 77.4354 94.081C77.5318 93.7127 77.6309 93.3276 77.7201 92.9791C77.7659 92.7966 77.7591 92.6048 77.7004 92.4259C77.6417 92.2471 77.5335 92.0886 77.3883 91.9687L64.2471 81.146L64.6004 82.0882C65.4154 84.2585 66.7797 86.1801 68.5599 87.665L71.6392 90.231C71.8053 90.3694 71.922 90.5578 71.972 90.7681C72.0219 90.9784 72.0024 91.1992 71.9163 91.3975C71.8302 91.5958 71.6822 91.7608 71.4945 91.8679C71.3067 91.975 71.0893 92.0183 70.8748 91.9915L65.4278 91.3106C66.3875 92.1888 67.5073 92.8741 68.7261 93.3289L73.3498 95.063C73.5603 95.1419 73.7381 95.2894 73.8544 95.4818C73.9707 95.6741 74.0189 95.9001 73.9911 96.1231C73.9633 96.3462 73.8611 96.5534 73.7011 96.7112C73.541 96.8691 73.3325 96.9685 73.1091 96.9932H73.1094Z" fill="#FFF2E8"/>
<path d="M88.72 78H93.2785L94.4542 74.4727C94.5346 74.2308 94.5196 73.9673 94.4123 73.736C94.3051 73.5047 94.1136 73.3231 93.877 73.2281L91.9992 72.477V71C91.9992 70.7348 91.8939 70.4804 91.7063 70.2929C91.5188 70.1054 91.2644 70 90.9992 70C90.734 70 90.4796 70.1054 90.2921 70.2929C90.1046 70.4804 89.9992 70.7348 89.9992 71V72.4764L88.1216 73.2275C87.8849 73.3224 87.6934 73.504 87.5861 73.7353C87.4788 73.9666 87.4638 74.2302 87.5442 74.4721L88.72 78Z" fill="#FFF2E8"/>
<path d="M85.999 105.558C85.9988 105.768 86.0648 105.972 86.1875 106.143C86.3103 106.313 86.4836 106.44 86.6828 106.507L90.999 107.945L95.3153 106.507C95.5145 106.44 95.6878 106.313 95.8105 106.143C95.9333 105.972 95.9992 105.768 95.999 105.558V94H85.999V105.558ZM88.4721 101.182L88.1046 100.447C88.1039 100.445 88.1046 100.444 88.1034 100.442C88.0349 100.305 87.9992 100.153 87.999 99.9995V97C87.999 96.7348 88.1044 96.4804 88.2919 96.2929C88.4795 96.1054 88.7338 96 88.999 96C89.2642 96 89.5186 96.1054 89.7061 96.2929C89.8937 96.4804 89.999 96.7348 89.999 97V99H91.171C91.3784 98.4156 91.7615 97.9096 92.2678 97.5515C92.7742 97.1934 93.3789 97.0008 93.999 97C94.2642 97 94.5186 97.1054 94.7061 97.2929C94.8937 97.4804 94.999 97.7348 94.999 98C94.999 98.2652 94.8937 98.5196 94.7061 98.7071C94.5186 98.8946 94.2642 99 93.999 99C93.7895 99.0003 93.5854 99.0664 93.4154 99.1889C93.2454 99.3113 93.1182 99.484 93.0515 99.6826C93.6675 100.46 94.0015 101.423 93.999 102.414V103C93.999 103.265 93.8937 103.52 93.7061 103.707C93.5186 103.895 93.2642 104 92.999 104C92.7338 104 92.4795 103.895 92.2919 103.707C92.1044 103.52 91.999 103.265 91.999 103V102.414C92.0005 101.906 91.8405 101.411 91.5421 101H90.5103C90.6125 101.482 90.5925 101.983 90.452 102.456C90.3116 102.928 90.0552 103.359 89.7061 103.707C89.6135 103.801 89.5032 103.875 89.3817 103.926C89.2601 103.977 89.1296 104.004 88.9978 104.004C88.866 104.005 88.7354 103.979 88.6135 103.929C88.4916 103.878 88.3809 103.805 88.2877 103.711C88.1944 103.618 88.1206 103.507 88.0703 103.386C88.02 103.264 87.9943 103.133 87.9947 103.001C87.9951 102.869 88.0216 102.739 88.0726 102.617C88.1236 102.496 88.1981 102.386 88.2919 102.293C88.435 102.15 88.5294 101.966 88.5618 101.766C88.5941 101.567 88.5628 101.362 88.4721 101.182Z" fill="#FFF2E8"/>
<path d="M82.7656 83.5341C83.98 83.9411 85.0251 84.7393 85.7373 85.8039C86.1588 86.4324 86.4515 87.1383 86.5984 87.8807C86.7453 88.623 86.7435 89.3872 86.5931 90.1289L86.219 92H89.8461L89.3371 88.4375C89.1474 87.1115 88.6062 85.8604 87.7696 84.8143C87.5773 84.5748 87.3708 84.3472 87.1511 84.1326L89.4998 81H92.4998L94.8481 84.1315C94.628 84.3462 94.4211 84.5741 94.2287 84.8139C93.3921 85.86 92.8508 87.1111 92.6611 88.4371L92.1521 92H95.7793L95.4052 90.1299C95.2548 89.3882 95.253 88.624 95.3999 87.8817C95.5468 87.1393 95.8395 86.4334 96.261 85.8049C96.9731 84.7404 98.0182 83.9421 99.2326 83.5351C99.8167 83.3386 100.434 83.26 101.049 83.3037C101.663 83.3474 102.263 83.5126 102.814 83.7897L103.501 84.1336L103.387 83.675C103.267 83.1964 102.991 82.7717 102.602 82.4682C102.213 82.1647 101.734 81.9999 101.241 82H100.083C98.8126 81.9978 97.5623 82.3196 96.4506 82.9349L93.7998 79.4C93.7067 79.2758 93.5859 79.175 93.447 79.1056C93.3082 79.0361 93.1551 79 92.9998 79H88.9998C88.8446 79 88.6915 79.0361 88.5526 79.1056C88.4138 79.175 88.293 79.2758 88.1998 79.4L85.5487 82.9354C84.4367 82.3197 83.186 81.9978 81.915 82H80.7575C80.2641 81.9999 79.7849 82.1647 79.396 82.4682C79.007 82.7717 78.7307 83.1964 78.6108 83.675L78.4966 84.1322L79.1841 83.7884C79.7346 83.5112 80.3346 83.346 80.9494 83.3024C81.5641 83.2587 82.1815 83.3375 82.7656 83.5341Z" fill="#FFF2E8"/>
<path d="M110.359 90.231L113.438 87.665C115.218 86.1801 116.582 84.2585 117.398 82.0882L117.751 81.146L104.61 91.968C104.465 92.0878 104.356 92.2464 104.298 92.4252C104.239 92.604 104.232 92.7958 104.278 92.9784C104.367 93.3269 104.466 93.7121 104.563 94.0804C104.741 94.7637 104.701 95.4855 104.449 96.1453C104.198 96.805 103.747 97.3699 103.159 97.7611L103.12 97.7872C102.465 98.2241 101.677 98.4175 100.894 98.3339C100.111 98.2503 99.3826 97.8949 98.8346 97.3296C98.7982 97.2919 98.7648 97.2514 98.7346 97.2085L97.999 96.1616V98.4999L98.7146 99.0365C99.393 99.5441 100.212 99.8292 101.059 99.8527C101.906 99.8762 102.739 99.6369 103.444 99.1677C103.665 99.0206 103.935 98.9672 104.195 99.0192C104.455 99.0712 104.684 99.2244 104.831 99.4451C104.978 99.6658 105.032 99.9359 104.98 100.196C104.928 100.456 104.774 100.685 104.554 100.832C103.587 101.475 102.457 101.829 101.296 101.852C100.135 101.876 98.9909 101.567 97.999 100.963V103.108C99.2027 103.366 100.258 104.084 100.94 105.109L101.154 105.43L102.292 104.293C102.385 104.2 102.495 104.126 102.616 104.076C102.738 104.026 102.868 104 102.999 104C103.13 104 103.26 104.026 103.382 104.076C103.503 104.126 103.613 104.2 103.706 104.293L104.999 105.585V104C104.999 103.819 105.048 103.641 105.141 103.486C105.234 103.331 105.368 103.204 105.527 103.118C105.687 103.033 105.867 102.992 106.047 103.001C106.228 103.01 106.403 103.067 106.554 103.168C107.835 104.024 109.284 104.597 110.804 104.851C109.802 103.801 108.626 102.931 107.328 102.282L106.553 101.894C106.364 101.8 106.21 101.648 106.112 101.461C106.015 101.273 105.979 101.06 106.011 100.851C106.042 100.642 106.139 100.449 106.287 100.298C106.435 100.148 106.627 100.048 106.835 100.013L109.1 99.6359C111.13 99.2992 113.091 98.6326 114.905 97.6624L108.888 96.9939C108.665 96.9691 108.456 96.8697 108.296 96.7119C108.136 96.554 108.034 96.3468 108.006 96.1237C107.979 95.9007 108.027 95.6747 108.143 95.4824C108.259 95.2901 108.437 95.1425 108.648 95.0636L113.272 93.3295C114.49 92.8747 115.61 92.1895 116.57 91.3112L111.123 91.9921C110.908 92.0189 110.691 91.9755 110.503 91.8684C110.316 91.7613 110.168 91.5962 110.082 91.398C109.995 91.1997 109.976 90.9789 110.026 90.7687C110.076 90.5584 110.193 90.37 110.359 90.2316V90.231Z" fill="#FFF2E8"/>
<path d="M141 157V163.667C141 168.267 137.502 172 133.191 172H48.8091C44.4985 172 41 168.267 41 163.667V157H141Z" fill="url(#paint2_linear)"/>
<path d="M62.125 58H59.7734V48.75H54.8125V58H52.4453V46.7266H62.125V58ZM71.9656 58L71.1141 55.3125H67.1531L66.2859 58H63.9187L67.8328 46.7266H70.6062L74.5203 58H71.9656ZM69.075 49.0703L67.6609 53.4922H70.6141L69.2156 49.0703H69.075ZM80.5719 58.2891C78.9365 58.2891 77.6448 57.7604 76.6969 56.7031C75.7542 55.6406 75.2828 54.1927 75.2828 52.3594C75.2828 50.526 75.7542 49.0807 76.6969 48.0234C77.6448 46.9661 78.9365 46.4375 80.5719 46.4375C81.9052 46.4375 83.0302 46.8359 83.9469 47.6328C84.8687 48.4245 85.374 49.4349 85.4625 50.6641H83.1656C83.051 50.013 82.7568 49.4922 82.2828 49.1016C81.8141 48.7109 81.2437 48.5156 80.5719 48.5156C79.6865 48.5156 78.9859 48.8594 78.4703 49.5469C77.9547 50.2344 77.6969 51.1719 77.6969 52.3594C77.6969 53.5469 77.9547 54.487 78.4703 55.1797C78.9859 55.8672 79.6891 56.2109 80.5797 56.2109C81.2568 56.2109 81.8297 56.026 82.2984 55.6562C82.7672 55.2865 83.0589 54.7917 83.1734 54.1719H85.4703C85.3714 55.3906 84.8687 56.3828 83.9625 57.1484C83.0615 57.9089 81.9312 58.2891 80.5719 58.2891ZM97.1781 58H94.8266V48.75H89.8656V58H87.4984V46.7266H97.1781V58ZM104.706 46.4375C106.373 46.4375 107.691 46.9688 108.659 48.0312C109.633 49.0938 110.12 50.5365 110.12 52.3594C110.12 54.1875 109.633 55.6328 108.659 56.6953C107.691 57.7578 106.373 58.2891 104.706 58.2891C103.034 58.2891 101.711 57.7578 100.737 56.6953C99.7635 55.6328 99.2766 54.1875 99.2766 52.3594C99.2766 50.5365 99.7661 49.0938 100.745 48.0312C101.724 46.9688 103.045 46.4375 104.706 46.4375ZM106.894 49.5547C106.352 48.8568 105.623 48.5078 104.706 48.5078C103.79 48.5078 103.058 48.8568 102.511 49.5547C101.964 50.2474 101.691 51.1823 101.691 52.3594C101.691 53.5365 101.961 54.474 102.503 55.1719C103.05 55.8698 103.784 56.2188 104.706 56.2188C105.623 56.2188 106.352 55.8698 106.894 55.1719C107.441 54.474 107.714 53.5365 107.714 52.3594C107.714 51.1823 107.441 50.2474 106.894 49.5547ZM112.211 46.7266H116.914C118.076 46.7266 119.016 47.0859 119.734 47.8047C120.458 48.5182 120.82 49.4583 120.82 50.625C120.82 51.7812 120.448 52.7161 119.703 53.4297C118.958 54.1432 117.99 54.5 116.797 54.5H114.57V58H112.211V46.7266ZM114.57 48.6641V52.5859H116.281C116.964 52.5859 117.49 52.4193 117.859 52.0859C118.234 51.7474 118.422 51.263 118.422 50.6328C118.422 49.9974 118.237 49.5104 117.867 49.1719C117.497 48.8333 116.971 48.6641 116.289 48.6641H114.57ZM127.661 58H125.302V48.7422H121.919V46.7266H131.044V48.7422H127.661V58Z" fill="#FFF2E8"/>
<path d="M79.063 144.519H102.911C103.709 144.519 104.357 145.166 104.357 145.965V148.662C104.357 149.461 103.709 150.108 102.911 150.108H79.063C78.2645 150.108 77.6167 149.461 77.6167 148.662V145.965C77.6173 145.166 78.2645 144.519 79.063 144.519Z" fill="#FFF2E8"/>
<path d="M69.0693 133.714H112.905C113.592 133.714 114.149 134.272 114.149 134.959V138.058C114.149 138.746 113.592 139.303 112.905 139.303H69.0693C68.3817 139.303 67.8247 138.745 67.8247 138.058V134.959C67.8247 134.272 68.3817 133.714 69.0693 133.714Z" fill="#FFF2E8"/>
</svg>
