<svg width="36" height="36" viewBox="0 0 36 36" fill="none" xmlns="http://www.w3.org/2000/svg">
<path d="M26.7564 8.93492L18.1011 30.193C17.9332 30.6054 17.3506 30.6092 17.1774 30.199L13.7876 22.1699C13.7369 22.0499 13.6414 21.9544 13.5214 21.9037L5.49236 18.5139C5.08215 18.3408 5.08589 17.7581 5.49828 17.5902L26.7564 8.93492Z" stroke="#21B561" stroke-linecap="round" stroke-linejoin="round"/>
<rect x="6.78052" y="20.8057" width="0.881734" height="2.6452" rx="0.440867" transform="rotate(45 6.78052 20.8057)" fill="#21B561"/>
<rect x="14.2622" y="28.2874" width="0.881734" height="2.6452" rx="0.440867" transform="rotate(45 14.2622 28.2874)" fill="#21B561"/>
<rect x="11.7683" y="23.2996" width="0.881734" height="6.17214" rx="0.440867" transform="rotate(45 11.7683 23.2996)" fill="#21B561"/>
</svg>
