<svg width="25" height="24" viewBox="0 0 25 24" fill="none" xmlns="http://www.w3.org/2000/svg">
<circle cx="12.2188" cy="7.5" r="4.75" stroke="#F2F2F2" stroke-width="1.5"/>
<mask id="mask0" mask-type="alpha" maskUnits="userSpaceOnUse" x="2" y="14" width="21" height="9">
<rect x="2.71875" y="14.5" width="19" height="7.57143" fill="#C4C4C4" stroke="#9F9F9F"/>
</mask>
<g mask="url(#mask0)">
<rect x="2.96875" y="14.75" width="18.5" height="18.2143" rx="9.10714" stroke="#F2F2F2" stroke-width="1.5"/>
</g>
</svg>
