<svg width="196" height="196" viewBox="0 0 196 196" fill="none" xmlns="http://www.w3.org/2000/svg">
<path d="M164.238 148L31.7623 148C27.4775 148 24 144.502 24 140.191L24 55.8091C24 51.4985 27.4772 48 31.7623 48L164.238 48C168.523 48 172 51.4982 172 55.8091L172 140.191C172 144.502 168.523 148 164.238 148Z" fill="#C2C2C2"/>
<rect x="36" y="69" width="34" height="41" rx="3" fill="#FEFEFE"/>
<rect x="36" y="134" width="34" height="4" rx="2" fill="#FEFEFE"/>
<rect x="82" y="60" width="34" height="4" rx="2" fill="#249ED9"/>
<rect x="82" y="74" width="3" height="3" rx="1.5" fill="#249ED9"/>
<rect x="89" y="74" width="43" height="3" rx="1.5" fill="#3F3F3F"/>
<rect x="89" y="85" width="74" height="3" rx="1.5" fill="#3F3F3F"/>
<rect x="89" y="96" width="27" height="3" rx="1.5" fill="#3F3F3F"/>
<rect x="89" y="103" width="33" height="3" rx="1.5" fill="#3F3F3F"/>
<rect x="89" y="114" width="30" height="3" rx="1.5" fill="#3F3F3F"/>
<rect x="89" y="121" width="30" height="3" rx="1.5" fill="#3F3F3F"/>
<rect x="82" y="85" width="3" height="3" rx="1.5" fill="#249ED9"/>
<rect x="82" y="96" width="3" height="3" rx="1.5" fill="#249ED9"/>
<rect x="82" y="103" width="3" height="3" rx="1.5" fill="#249ED9"/>
<rect x="82" y="114" width="3" height="3" rx="1.5" fill="#249ED9"/>
<rect x="82" y="121" width="3" height="3" rx="1.5" fill="#249ED9"/>
<rect x="133" y="96" width="30" height="3" rx="1.5" fill="#3F3F3F"/>
<rect x="133" y="103" width="30" height="3" rx="1.5" fill="#3F3F3F"/>
<rect x="126" y="96" width="3" height="3" rx="1.5" fill="#249ED9"/>
<rect x="126" y="103" width="3" height="3" rx="1.5" fill="#249ED9"/>
<rect x="124" y="60" width="34" height="4" rx="2" fill="#249ED9"/>
<rect x="82" y="132" width="76" height="8" fill="#9F9F9F"/>
<mask id="mask0" mask-type="alpha" maskUnits="userSpaceOnUse" x="36" y="69" width="34" height="41">
<rect x="36" y="69" width="34" height="41" rx="3" fill="#FEFEFE"/>
</mask>
<g mask="url(#mask0)">
<path fill-rule="evenodd" clip-rule="evenodd" d="M55.3386 101.767C55.1646 101.568 54.8428 101.486 54.5886 101.446C54.3344 101.406 54.1465 101.406 53.8873 101.46C53.6294 101.514 53.2988 101.622 52.972 101.676C52.6464 101.73 52.3246 101.73 51.8926 101.681C51.4593 101.632 50.9146 101.532 50.5527 101.442C50.1908 101.353 50.0117 101.271 49.6423 101.195C49.2717 101.118 48.7082 101.046 48.3288 101.365C47.9494 101.685 47.7528 102.397 47.6062 105.591C47.4585 108.788 47.3608 114.467 47.2932 119.261C47.2268 124.054 47.1905 127.96 47.1642 130.427C47.1367 132.893 47.1191 133.92 47.1279 134.855C47.1367 135.792 47.173 136.637 47.2268 137.178C47.2794 137.718 47.3508 137.951 47.6225 138.261C47.8943 138.569 48.3651 138.952 48.9348 139.172C49.5046 139.392 50.1745 139.447 50.8983 139.47C51.6233 139.494 52.4047 139.484 53.0822 139.462C53.7596 139.441 54.3356 139.409 54.71 139.385C55.0844 139.36 55.2585 139.344 55.529 139.028C55.7982 138.713 56.1651 138.098 56.4368 136.863C56.7098 135.629 56.8876 133.775 56.9953 131.741C57.103 129.706 57.1381 127.492 57.227 124.666C57.3171 121.84 57.4599 118.401 57.2094 114.872C56.959 111.344 56.3166 107.725 55.9773 105.663C55.6379 103.602 55.6029 103.098 55.5715 102.688C55.5402 102.279 55.5127 101.964 55.3386 101.767Z" fill="#FCFCFC"/>
<path fill-rule="evenodd" clip-rule="evenodd" d="M54.7914 141C54.9767 141.001 55.3448 140.993 55.9735 140.949C56.6021 140.904 57.4899 140.821 58.5217 140.673C59.5523 140.526 60.7269 140.314 61.6848 140.078C62.6428 139.842 63.3841 139.581 63.9438 139.369C64.5048 139.158 64.8843 138.995 65.161 138.856C65.4377 138.716 65.6118 138.6 65.7408 138.5C65.871 138.402 65.9549 138.321 66.0175 138.247C66.0801 138.172 66.1202 138.104 66.1402 137.956C66.1603 137.807 66.1603 137.578 66.1227 136.467C66.0851 135.355 66.0087 133.36 65.9261 131.572C65.8435 129.783 65.7545 128.199 65.6556 126.776C65.5579 125.354 65.4503 124.094 65.29 122.555C65.1297 121.015 64.9156 119.197 64.7903 118.036C64.6651 116.875 64.6288 116.371 64.5975 116.061C64.5662 115.75 64.5399 115.633 64.5261 115.542C64.5136 115.452 64.5136 115.389 64.5624 115.438C64.6113 115.489 64.7102 115.65 64.8254 115.826C64.9419 116.001 65.0758 116.191 65.1961 116.357C65.3163 116.524 65.424 116.668 65.5003 116.771C65.5755 116.875 65.6206 116.938 66.1603 117.05C66.7012 117.163 67.7368 117.324 68.8175 117.091C69.8981 116.857 71.0226 116.226 71.6575 115.273C72.2911 114.319 72.4339 113.04 72.2461 111.951C72.0582 110.861 71.5411 109.961 71.099 109.214C70.657 108.467 70.2901 107.873 70.0234 107.459C69.7554 107.045 69.5851 106.811 69.3134 106.405C69.0404 106.001 68.666 105.425 68.1651 104.714C67.6654 104.002 67.0406 103.156 66.447 102.423C65.8522 101.689 65.29 101.068 64.7503 100.56C64.2093 100.051 63.6921 99.6546 63.2676 99.3807C62.8431 99.1055 62.5126 98.9528 62.187 98.8228C61.8614 98.6915 61.5396 98.5842 61.2678 98.5161C60.9949 98.4492 60.772 98.4214 60.5666 98.4125C60.3612 98.4037 60.1734 98.4125 60.0044 98.4353C59.8341 98.458 59.6825 98.4933 59.5573 98.5337C59.4321 98.5741 59.3344 98.6196 59.258 98.6473C59.1816 98.6738 59.1291 98.6827 58.9675 98.6284C58.8072 98.5741 58.5393 98.458 58.3164 98.3722C58.0922 98.2863 57.9144 98.2333 57.3559 98.2283C56.7974 98.2232 55.8608 98.2686 54.7939 98.2459C53.7257 98.2232 52.5299 98.1336 51.6721 97.9266C50.8156 97.7195 50.2971 97.3951 49.8689 97.3598C49.4406 97.3232 49.1013 97.5756 48.7394 97.688C48.3775 97.8003 47.9931 97.7738 47.7163 97.7776C47.4396 97.7827 47.2705 97.818 47.1403 97.8546C47.0113 97.89 46.9224 97.9266 46.851 97.9632C46.7784 97.9985 46.7258 98.0351 46.6407 98.0528C46.5555 98.0705 46.4403 98.0705 46.2926 98.0389C46.1448 98.0074 45.967 97.9442 45.7516 97.9001C45.5375 97.8546 45.2883 97.8281 45.0153 97.8281C44.7436 97.8281 44.448 97.8546 44.1225 97.9177C43.7969 97.9808 43.4387 98.0793 42.9792 98.2775C42.5196 98.4757 41.9574 98.7723 41.4966 99.074C41.037 99.3757 40.6801 99.6824 40.4209 99.8983C40.1617 100.114 40.0014 100.24 39.6796 100.563C39.359 100.888 38.8769 101.41 38.4925 101.86C38.108 102.311 37.8225 102.688 37.5721 103.039C37.3229 103.391 37.1088 103.714 36.8496 104.065C36.5904 104.416 36.2873 104.795 35.9204 105.586C35.5548 106.379 35.1253 107.586 34.6256 108.765C34.126 109.944 33.5537 111.096 33.2958 112.247C33.0366 113.4 33.0904 114.552 33.3133 115.345C33.5362 116.136 33.9294 116.568 34.2149 116.901C34.5004 117.235 34.6795 117.468 35.0814 117.505C35.4834 117.54 36.1083 117.378 36.6079 117.145C37.1088 116.91 37.4832 116.605 37.9027 116.478C38.3222 116.352 38.7868 116.407 39.1975 116.577C39.6082 116.749 39.9663 117.036 40.1216 117.437C40.2781 117.838 40.2331 118.35 40.1842 118.805C40.1354 119.261 40.0815 119.656 40.0239 120.277C39.9651 120.898 39.9037 121.745 39.8273 122.743C39.751 123.743 39.6621 124.895 39.5544 126.501C39.4479 128.108 39.3227 130.169 39.2463 131.61C39.1712 133.05 39.1436 133.869 39.1086 134.634C39.0723 135.399 39.0284 136.111 39.0096 136.549C38.9921 136.988 39.0009 137.155 39.0209 137.285C39.0397 137.416 39.0685 137.511 39.1286 137.637C39.1887 137.765 39.2801 137.925 39.4078 138.065C39.5343 138.206 39.6984 138.328 39.9451 138.474C40.1917 138.62 40.5211 138.791 40.9055 138.957C41.2899 139.124 41.727 139.286 42.2779 139.48C42.8302 139.673 43.4951 139.898 44.2076 140.096C44.9189 140.294 45.679 140.465 46.25 140.582C46.821 140.699 47.2054 140.762 47.6212 140.814C48.0356 140.866 48.4827 140.906 48.9397 140.93C49.3981 140.956 49.8664 140.964 50.1456 140.972C50.4249 140.978 50.5138 140.982 50.5589 140.895C50.6027 140.807 50.6027 140.627 50.619 140.159C50.634 139.691 50.6653 138.935 50.768 135.766C50.8707 132.598 51.0447 127.017 51.1236 123.619C51.2013 120.221 51.1837 119.006 51.1574 117.416C51.1299 115.828 51.0948 113.866 50.9959 111.732C50.8982 109.599 50.7367 107.295 50.6127 105.643C50.4875 103.991 50.3973 102.992 50.2771 102.285C50.1569 101.578 50.0054 101.164 49.7812 100.813C49.5583 100.463 49.2641 100.175 49.0812 99.8465C48.8972 99.5171 48.8258 99.1485 48.7857 98.8872C48.7457 98.6259 48.7369 98.4731 48.817 98.3873C48.8972 98.3027 49.0675 98.2838 49.5007 98.3608C49.934 98.4378 50.6302 98.6082 51.2601 98.7294C51.8887 98.8518 52.4522 98.9238 53.027 98.9768C53.603 99.0311 54.1928 99.0677 54.5146 99.0942C54.8364 99.122 54.889 99.1396 54.9391 99.1661C54.988 99.1939 55.0318 99.2293 55.0368 99.2924C55.0418 99.3555 55.0055 99.4451 54.9517 99.5802C54.8978 99.7152 54.8264 99.8957 54.7425 100.134C54.6574 100.373 54.5585 100.67 54.5059 100.966C54.452 101.264 54.4432 101.561 54.4658 101.908C54.4871 102.254 54.5409 102.65 54.5898 103.285C54.6398 103.919 54.6837 104.792 54.7112 105.49C54.7375 106.187 54.7463 106.71 54.7776 107.857C54.8089 109.004 54.8627 110.778 54.8978 112.655C54.9341 114.532 54.9517 116.513 54.9567 118.362C54.9604 120.212 54.9517 121.932 54.9391 123.956C54.9254 125.982 54.9078 128.312 54.8715 130.568C54.8364 132.823 54.7826 135.001 54.735 136.652C54.6887 138.305 54.6486 139.429 54.6261 140.049C54.6035 140.668 54.5998 140.78 54.5985 140.851C54.5973 140.923 54.5998 140.952 54.601 140.972C54.6035 140.991 54.606 140.999 54.7914 141Z" fill="#4ECDC4"/>
<path fill-rule="evenodd" clip-rule="evenodd" d="M55.3938 99.5817C55.2686 99.9276 55.0357 100.522 54.8641 100.951C54.6913 101.38 54.5786 101.644 54.2305 101.788C53.8811 101.932 53.2976 101.956 52.7165 101.95C52.1343 101.945 51.5532 101.908 50.9885 101.769C50.4237 101.629 49.874 101.385 49.3643 101.048C48.8559 100.711 48.3876 100.278 48.1848 99.766C47.9819 99.2535 48.0445 98.659 48.1597 98.245C48.2762 97.8309 48.4465 97.5962 48.8973 97.5924C49.3481 97.5873 50.0806 97.8133 50.7493 98.0556C51.4192 98.2992 52.0266 98.5593 52.7103 98.6628C53.3927 98.7663 54.1516 98.7133 54.5849 98.6994C55.0181 98.6855 55.1258 98.7133 55.2322 98.7764C55.3399 98.8395 55.4464 98.9379 55.4915 99.0364C55.5365 99.1361 55.5178 99.2346 55.3938 99.5817Z" fill="#FAAD91"/>
<path fill-rule="evenodd" clip-rule="evenodd" d="M54.4985 102.261C54.5022 102.263 54.5085 102.256 54.6324 102.125C54.7577 101.994 55.0019 101.738 55.3074 101.474C55.6117 101.211 55.9786 100.941 56.219 100.786C56.4607 100.631 56.5759 100.59 56.7086 100.619C56.8401 100.648 56.9879 100.747 57.1907 100.933C57.3936 101.12 57.6528 101.395 57.8644 101.635C58.0761 101.876 58.2414 102.083 58.3428 102.258C58.443 102.431 58.478 102.569 58.5006 102.66C58.5231 102.75 58.5319 102.79 58.5519 102.704C58.5719 102.62 58.6032 102.408 58.592 101.965C58.5807 101.522 58.5281 100.846 58.4142 100.312C58.3002 99.7798 58.1262 99.3885 57.9809 99.0956C57.8356 98.8028 57.7192 98.6096 57.5902 98.4809C57.46 98.3534 57.3172 98.2903 57.1707 98.2613C57.0229 98.231 56.8714 98.2335 56.6748 98.2575C56.4782 98.2815 56.2378 98.3282 55.9648 98.4531C55.6931 98.5781 55.3888 98.7801 55.2147 98.9808C55.0407 99.1815 54.9968 99.3809 54.9292 99.6005C54.8629 99.8202 54.7739 100.059 54.7001 100.29C54.6249 100.521 54.5661 100.744 54.5285 100.917C54.4909 101.089 54.4759 101.211 54.4697 101.369C54.4621 101.525 54.4634 101.716 54.4697 101.868C54.4747 102.019 54.4847 102.13 54.4897 102.191C54.4947 102.251 54.4947 102.26 54.4985 102.261Z" fill="#50DED5"/>
<path fill-rule="evenodd" clip-rule="evenodd" d="M50.2622 102.357C50.2308 102.331 50.1595 102.227 50.0468 102.101C49.9328 101.975 49.7763 101.823 49.611 101.695C49.4457 101.565 49.2717 101.457 49.0851 101.365C48.8997 101.273 48.7006 101.196 48.5516 101.151C48.4039 101.106 48.305 101.093 48.2035 101.09C48.1021 101.087 47.9969 101.098 47.8855 101.142C47.774 101.187 47.6563 101.268 47.5148 101.369C47.3746 101.47 47.2118 101.592 47.0703 101.709C46.9275 101.826 46.8073 101.938 46.6971 102.043C46.5869 102.148 46.4855 102.245 46.4054 102.337C46.3252 102.429 46.2651 102.516 46.2113 102.585C46.1574 102.651 46.1111 102.699 46.0835 102.733C46.0572 102.766 46.051 102.787 46.0472 102.771C46.0435 102.755 46.0435 102.703 46.0372 102.559C46.0309 102.415 46.0172 102.179 46.0021 101.856C45.9884 101.533 45.9721 101.124 45.9984 100.721C46.0234 100.319 46.091 99.9224 46.2401 99.4642C46.3891 99.0047 46.6195 98.4834 46.8111 98.1097C47.0039 97.7373 47.1567 97.5114 47.2644 97.3612C47.3721 97.2122 47.4347 97.1403 47.5148 97.1251C47.5949 97.1087 47.6939 97.1504 47.8166 97.2665C47.9381 97.3839 48.0858 97.5783 48.2035 97.7083C48.3225 97.8396 48.4114 97.9065 48.4815 97.9759C48.5504 98.0453 48.6005 98.1173 48.6243 98.2031C48.6493 98.289 48.6493 98.3874 48.6531 98.5452C48.6581 98.703 48.6668 98.9189 48.7395 99.1448C48.8108 99.372 48.9461 99.6093 49.0688 99.8315C49.1915 100.055 49.3017 100.263 49.4407 100.463C49.5797 100.662 49.7462 100.853 49.8564 101.016C49.9679 101.178 50.023 101.313 50.0718 101.456C50.1194 101.599 50.1607 101.749 50.1933 101.888C50.2271 102.028 50.2521 102.157 50.2684 102.245C50.2859 102.335 50.2935 102.384 50.2622 102.357Z" fill="#50DED5"/>
<path fill-rule="evenodd" clip-rule="evenodd" d="M60.8597 85.9879C60.7507 86.0977 60.8534 85.9512 60.7708 86.1696L60.6643 86.4751C60.6556 85.1472 60.7382 84.0225 60.4878 82.7311C60.2786 81.6557 59.8191 80.5852 59.1992 80.098C58.6395 79.9124 55.4726 80.9223 51.9814 79.9478C51.6408 79.8531 51.3102 79.7534 50.9696 79.6259C50.6841 79.5199 50.2546 79.3141 49.9816 79.2636C47.8103 80.7317 45.9345 88.953 48.4339 91.4599C48.6367 91.3614 48.9235 91.0509 49.1702 90.8742C50.0755 90.2279 51.1675 89.8227 52.3746 89.8858C52.3871 89.901 52.4034 89.906 52.4097 89.9338C52.4147 89.9615 52.436 89.9704 52.4435 89.9817C52.7891 90.5056 53.1272 90.8893 53.9937 90.8527C55.1621 90.8048 54.4583 90.108 55.8132 90.8515C56.3241 91.1317 56.9653 91.6177 57.2758 91.9307C57.5864 92.245 57.8806 92.6288 58.0635 93.0529L58.2087 93.4076C58.2638 93.5073 58.2388 93.4745 58.3026 93.5414C58.7384 93.0453 59.0903 92.9393 59.5636 91.9168C59.8717 91.2491 60.047 90.4715 60.2361 89.7154L60.1735 90.7808C60.1396 91.6783 60.1384 92.3776 60.2536 93.2523C60.4464 94.7229 60.1446 96.1304 59.3232 97.2803L58.3928 98.2599C58.2513 98.3836 58.1599 98.4202 58.0109 98.5691L57.535 98.8986C57.1756 98.9983 56.7449 99.2861 56.3454 99.4565C55.8733 99.6572 55.4651 99.7481 55.0143 99.921C54.5435 100.138 51.9839 100.575 51.433 100.382C51.0711 100.254 50.3773 99.8339 50.053 99.6408C49.5797 99.3593 49.1827 99.0185 48.7833 98.7963C48.5992 98.5489 48.3274 98.3974 48.1171 98.1854C47.9055 97.9708 47.6638 97.6792 47.4384 97.5227C47.0978 96.8612 46.1448 96.1329 45.7742 94.088C45.6327 93.3066 45.5926 92.5278 45.6665 91.7098C45.7291 91.0282 45.9971 90.0966 46.0133 89.5387C46.1361 89.391 46.6445 87.8131 46.7271 87.4887C46.925 86.7238 47.089 85.9083 47.1754 85.0803C47.1654 83.7044 46.786 82.7135 46.9976 81.1596C47.3169 78.8319 47.6738 78.8887 47.9317 77.9433C47.3182 77.7312 47.3282 78.2778 46.9963 78.3295C46.2087 72.6593 52.7453 70.3178 57.1731 73.3018C57.669 73.6363 57.9946 73.9367 58.3815 74.2826C58.7084 74.5742 59.1178 74.4808 59.893 75.0299C60.6869 75.5916 61.4532 76.705 60.9761 78.2273C60.6205 79.3596 60.5166 78.5542 60.8784 79.7812C61.2641 81.0864 61.2466 82.615 61.1038 83.9657C61.0412 84.5488 60.8434 85.4892 60.8597 85.9879Z" fill="#673301"/>
<path fill-rule="evenodd" clip-rule="evenodd" d="M60.8597 85.9879L60.8046 86.3199C63.9965 85.5688 63.1262 90.9714 60.1735 90.7808L60.2361 89.7155C60.047 90.4716 59.8717 91.2491 59.5637 91.9169C59.0903 92.9394 58.7385 93.0454 58.3027 93.5415C58.2388 93.4746 58.2639 93.5074 58.2088 93.4077L58.0635 93.053C57.8807 92.6288 57.5864 92.2451 57.2759 91.9308C56.9653 91.6177 56.3242 91.1318 55.8133 90.8515C54.4584 90.108 55.1621 90.8048 53.9938 90.8528C53.1273 90.8894 52.7892 90.5057 52.4436 89.9818C52.4361 89.9704 52.4148 89.9616 52.4098 89.9338C52.4035 89.9061 52.3872 89.901 52.3747 89.8859C51.1676 89.8228 50.0757 90.2279 49.1703 90.8742C48.9236 91.051 48.6369 91.3615 48.434 91.4599C45.9346 88.953 47.8104 80.7317 49.9817 79.2637C50.2547 79.3142 50.6842 79.5199 50.9697 79.6259C51.3103 79.7534 51.6409 79.8532 51.9815 79.9478C55.4727 80.9223 58.6395 79.9125 59.1993 80.098C59.8191 80.5853 60.2787 81.6557 60.4878 82.7312C60.7382 84.0225 60.6556 85.1472 60.6644 86.4752L60.7708 86.1697C60.8534 85.9513 60.7508 86.0977 60.8597 85.9879Z" fill="#FCAE92"/>
<path fill-rule="evenodd" clip-rule="evenodd" d="M47.1754 85.0803C47.089 85.9083 46.925 86.7238 46.7272 87.4887C46.6445 87.8131 46.1361 89.391 46.0134 89.5387C45.6991 89.3279 45.1206 89.4099 44.5746 88.4165C43.5466 86.5496 44.6548 83.9354 46.369 84.5488C46.8148 84.7092 46.8925 84.9667 47.1754 85.0803Z" fill="#EDA385"/>
<path fill-rule="evenodd" clip-rule="evenodd" d="M53.8047 94.8099C52.6927 94.7279 51.2426 94.2987 50.6378 93.7218C50.2546 93.3545 50.1557 92.4292 50.743 92.332C51.2714 92.2436 52.4498 93.3343 53.9713 93.4252C54.8941 93.4794 56.3217 92.6337 56.1476 93.968C56.1 94.3277 55.9648 94.4678 55.7068 94.5915C55.1596 94.8528 54.4371 94.8566 53.8047 94.8099Z" fill="#F2A386"/>
<path fill-rule="evenodd" clip-rule="evenodd" d="M52.2558 84.4588C49.8343 83.809 50.1385 84.1315 48.3934 83.969C48.8779 82.9859 49.5352 82.9082 50.4063 82.8233C50.8971 82.7761 52.4501 82.7161 52.8766 82.8771L52.2558 84.4588Z" fill="#673301"/>
<path fill-rule="evenodd" clip-rule="evenodd" d="M59.8437 85.3588L58.1334 84.9146C57.5988 84.8024 56.8794 84.6472 56.3033 84.7246C56.221 84.2973 56.1568 83.5106 56.2696 83.1629C56.9622 83.1186 57.772 83.3983 58.3482 83.6651C59.5783 84.236 59.6264 84.3487 59.8437 85.3588Z" fill="#653202"/>
<path fill-rule="evenodd" clip-rule="evenodd" d="M52.3998 86.7125C52.0842 86.4663 51.2365 85.6799 50.7882 86.2303C50.9522 86.4613 51.0311 86.3818 51.3529 86.4537C51.5883 88.0997 49.6061 87.7349 50.0469 85.9223C49.7701 85.9703 49.5097 86.1079 49.3394 86.2215C49.1465 86.349 49.0676 86.5408 48.9462 86.7049C48.9374 86.7163 48.9211 86.7365 48.9099 86.7516C48.975 84.2435 52.1355 85.2975 52.3998 86.7125Z" fill="#4E2701"/>
<path fill-rule="evenodd" clip-rule="evenodd" d="M58.791 88.1275C58.7584 87.4093 58.1687 86.6658 57.4599 86.7529C57.4361 87.1518 57.5864 87.0407 57.7917 87.2944C57.4712 88.5681 55.9823 88.1098 56.512 86.5938C56.1463 86.5938 55.9485 86.6999 55.6542 86.7655C55.6504 86.1924 57.1606 85.9109 57.9558 86.1407C58.3941 86.2682 58.7034 86.4916 58.8924 86.821C59.0665 87.1265 59.1191 87.9117 58.791 88.1275Z" fill="#4E2701"/>
<path fill-rule="evenodd" clip-rule="evenodd" d="M52.7089 72.0509C52.7102 72.0622 52.7202 72.0648 52.9569 72.138C53.1935 72.2099 53.6568 72.3526 54.0901 72.5406C54.5221 72.7287 54.9241 72.9622 55.2008 73.2324C55.4776 73.5025 55.6291 73.8092 55.7005 74.2144C55.7719 74.6184 55.7631 75.1233 55.688 75.6585C55.6116 76.1937 55.4688 76.7617 55.2672 77.3323C55.0668 77.9041 54.8076 78.481 54.5772 78.972C54.3468 79.463 54.144 79.8695 54.04 80.079C53.9348 80.2873 53.9286 80.2999 53.9336 80.3075C53.9373 80.3138 53.9511 80.3151 54.0025 80.3189C54.0525 80.3239 54.1377 80.3302 54.2416 80.3403C54.3443 80.3504 54.4658 80.3631 54.5835 80.3694C54.7012 80.3769 54.8139 80.3782 54.8991 80.3706C54.9842 80.3618 55.0418 80.3441 55.2835 80.0563C55.5264 79.7673 55.9559 79.2093 56.3278 78.6716C56.701 78.1339 57.0178 77.6163 57.2507 77.22C57.4824 76.8249 57.6302 76.5497 57.7391 76.2619C57.848 75.9741 57.9194 75.6724 57.9557 75.4578C57.9908 75.2445 57.9908 75.1182 57.9495 74.8595C57.9069 74.6007 57.8217 74.2094 57.7316 73.9607C57.6427 73.712 57.5475 73.606 57.4135 73.4937C57.2795 73.3826 57.1067 73.2639 56.8751 73.1289C56.6434 72.9925 56.3541 72.8373 56.0887 72.7123C55.8244 72.5886 55.584 72.4927 55.3273 72.4081C55.0719 72.3235 54.8001 72.2478 54.5146 72.1821C54.2304 72.1152 53.9323 72.0572 53.6769 72.0281C53.4202 71.9991 53.206 72.0004 53.0545 72.0004C52.903 72.0016 52.8128 72.0016 52.7653 72.0117C52.7164 72.0218 52.7077 72.0408 52.7089 72.0509Z" fill="#793D01"/>
</g>
</svg>
