<svg xmlns="http://www.w3.org/2000/svg" width="26.594" height="26.195" viewBox="0 0 26.594 26.195">
  <g id="Groupe_8363" data-name="Groupe 8363" transform="translate(0 0)">
    <path id="Tracé_3003" data-name="Tracé 3003" d="M5978.243,3182.131a2.086,2.086,0,0,0,1.48-.613l6.588-6.588c.047-.048.092-.1.134-.15a10.364,10.364,0,1,0-2.855-3.011,2,2,0,0,0-.237.2l-6.588,6.588a2.092,2.092,0,0,0,1.479,3.572Zm14.14-23.8a7.97,7.97,0,1,1-7.971,7.97A7.98,7.98,0,0,1,5992.383,3158.326Z" transform="translate(-5976.151 -3155.935)" fill="#5793ce"/>
    <path id="Tracé_3004" data-name="Tracé 3004" d="M6029.237,3205.111h9.716a1.063,1.063,0,1,0,0-2.127h-9.716a1.063,1.063,0,1,0,0,2.127Z" transform="translate(-6017.806 -3193.609)" fill="#5793ce"/>
  </g>
</svg>
