<svg xmlns="http://www.w3.org/2000/svg" width="12.833" height="12.808" viewBox="0 0 12.833 12.808">
  <g id="people_1_" data-name="people (1)" transform="translate(0 -0.501)">
    <path id="Path_11170" data-name="Path 11170" d="M169.278,5.741h3.66a.36.36,0,0,0,.36-.361V4.986a1.92,1.92,0,0,0-1.937-1.924,1.288,1.288,0,1,0-.506,0,1.92,1.92,0,0,0-1.937,1.924v.394A.36.36,0,0,0,169.278,5.741Z" transform="translate(-164.684)" fill="#354360"/>
    <path id="Path_11171" data-name="Path 11171" d="M52.523,108.595a.375.375,0,0,0,.437-.3,5.017,5.017,0,0,1,1.429-2.677.376.376,0,0,0-.521-.543,5.772,5.772,0,0,0-1.647,3.085A.377.377,0,0,0,52.523,108.595Z" transform="translate(-50.906 -101.846)" fill="#354360"/>
    <path id="Path_11172" data-name="Path 11172" d="M370.046,106.817a4.952,4.952,0,0,1,.52,1.473.376.376,0,1,0,.739-.135,5.772,5.772,0,0,0-1.647-3.085.374.374,0,0,0-.531.01.378.378,0,0,0,.01.533A4.943,4.943,0,0,1,370.046,106.817Z" transform="translate(-359.772 -101.845)" fill="#354360"/>
    <path id="Path_11173" data-name="Path 11173" d="M180.131,363.943a4.884,4.884,0,0,1-1.517.244h-.021a4.91,4.91,0,0,1-1.488-.228.377.377,0,0,0-.226.719,5.654,5.654,0,0,0,1.714.263h.021a5.647,5.647,0,0,0,1.752-.282.377.377,0,0,0-.234-.716Z" transform="translate(-172.19 -354.314)" fill="#354360"/>
    <path id="Path_11174" data-name="Path 11174" d="M2.443,305a1.288,1.288,0,1,0-.506,0A1.92,1.92,0,0,0,0,306.927v.394a.361.361,0,0,0,.36.361H4.02a.361.361,0,0,0,.36-.361v-.394A1.919,1.919,0,0,0,2.443,305Z" transform="translate(0 -294.373)" fill="#354360"/>
    <path id="Path_11175" data-name="Path 11175" d="M339.7,305a1.288,1.288,0,1,0-.506,0,1.919,1.919,0,0,0-1.937,1.924v.394a.361.361,0,0,0,.36.361h3.66a.361.361,0,0,0,.36-.361v-.394A1.92,1.92,0,0,0,339.7,305Z" transform="translate(-328.804 -294.373)" fill="#354360"/>
  </g>
</svg>
