<svg id="Group_15547" data-name="Group 15547" xmlns="http://www.w3.org/2000/svg" width="22.97" height="22.97" viewBox="0 0 22.97 22.97">
  <path id="Path_1762" data-name="Path 1762" d="M63.806,15.7a9.354,9.354,0,0,1-7.536,11.32v-4.7c0-.114.008-.214.011-.322A4.453,4.453,0,0,0,59.1,17.85a4.373,4.373,0,0,0-.028-.461c.32-.107.638-.2.929-.3Zm-18.316,0L49.076,17c.37.137.757.254,1.141.393-.015.151-.023.3-.024.456a4.456,4.456,0,0,0,2.817,4.138c.009.2.018.4.018.62V27.02A9.358,9.358,0,0,1,45.49,15.7Zm9.158-7.32a9.391,9.391,0,0,1,7.9,4.332c-2.154.784-3.475,1.412-5.619,1.324a4.415,4.415,0,0,0-4.533-.02,7.835,7.835,0,0,1-3.368-.473l-2.284-.831A9.389,9.389,0,0,1,54.648,8.376Zm0-2.088A11.485,11.485,0,1,0,66.133,17.773,11.5,11.5,0,0,0,54.648,6.288Z" transform="translate(-43.163 -6.288)" fill="#ffc107"/>
</svg>
