<svg xmlns="http://www.w3.org/2000/svg" width="24.432" height="18.789" viewBox="0 0 24.432 18.789">
  <g id="Groupe_8350" data-name="Groupe 8350" transform="translate(1)">
    <path id="Tracé_1764" data-name="Tracé 1764" d="M1052.854,1034.22v18.187" transform="translate(-1052.854 -1034.22)" fill="none" stroke="#4d65e0" stroke-width="2"/>
    <path id="Tracé_1765" data-name="Tracé 1765" d="M1052.854,1042.537h22.432" transform="translate(-1052.854 -1031.103)" fill="none" stroke="#4d65e0" stroke-width="2"/>
    <path id="Tracé_1766" data-name="Tracé 1766" d="M1069.172,1038.233V1051.5" transform="translate(-1046.74 -1032.716)" fill="none" stroke="#4d65e0" stroke-width="2"/>
  </g>
</svg>
