<svg id="Group_8726" data-name="Group 8726" xmlns="http://www.w3.org/2000/svg" width="28.503" height="34.021" viewBox="0 0 28.503 34.021">
  <g id="Group_8656" data-name="Group 8656" transform="translate(0 0)">
    <g id="Group_8655" data-name="Group 8655" transform="translate(0)">
      <path id="Path_3039" data-name="Path 3039" d="M5277.563,1286.606a.659.659,0,0,1,0-1.317h8.96l1.746-2.635a.654.654,0,0,1-.184.029h-10.521a.659.659,0,0,1,0-1.317h10.521a.656.656,0,0,1,.651.583l4.167-6.292h-15.758a2.146,2.146,0,0,0-2.14,2.14v16.732a2.146,2.146,0,0,0,2.14,2.14h1.843l6.664-10.063Z" transform="translate(-5275.005 -1269.09)" fill="rgba(84,167,248,0)"/>
      <path id="Path_3040" data-name="Path 3040" d="M5335.372,1282.449a3.643,3.643,0,0,1-5.123,3.332l-1.954,2.951a5.626,5.626,0,0,1,6.483-.266,5.687,5.687,0,0,1,1.873,1.991,5.609,5.609,0,0,1,.72,2.754h-.006c0,.06.006.118.006.178h-11.29c0-.06,0-.119,0-.178h0a5.619,5.619,0,0,1,.176-1.4l-3.219,4.86h14.776a2.146,2.146,0,0,0,2.14-2.14V1277.8a2.146,2.146,0,0,0-2.14-2.14h-.86l-2.738,4.134A3.631,3.631,0,0,1,5335.372,1282.449Z" transform="translate(-5311.45 -1269.09)" fill="rgba(84,167,248,0)"/>
      <path id="Path_3041" data-name="Path 3041" d="M5288.866,1367.385l3.066-4.63h-2.173l-2.4,3.63a1.812,1.812,0,1,0,3.021,2l3.729-5.63h-2.173Z" transform="translate(-5284.147 -1335.176)" fill="rgba(84,167,248,0)"/>
      <path id="Path_3042" data-name="Path 3042" d="M5361.271,1250.248l-3.149,4.755h2.173l2.487-3.755a1.812,1.812,0,1,0-3.021-2l-3.812,5.755h2.173Z" transform="translate(-5336.421 -1248.437)" fill="rgba(84,167,248,0)"/>
      <path id="Path_3043" data-name="Path 3043" d="M5307.275,1320.386h2.173l7.722-11.66a3.639,3.639,0,0,1-.974-1.811Z" transform="translate(-5299.49 -1292.807)" fill="rgba(84,167,248,0)"/>
      <path id="Path_3044" data-name="Path 3044" d="M5356.13,1278.872a3.617,3.617,0,0,1,2.048.19l2.254-3.405h-2.173Z" transform="translate(-5336.559 -1269.09)" fill="rgba(84,167,248,0)"/>
      <path id="Path_3045" data-name="Path 3045" d="M5306.395,1285.948a.658.658,0,0,1-.658.658h-.8l-6.665,10.063h2.173l8.922-13.471a3.646,3.646,0,0,1,2.865-4.326l2.129-3.215h-2.173l-6.383,9.639A.657.657,0,0,1,5306.395,1285.948Z" transform="translate(-5292.656 -1269.09)" fill="rgba(84,167,248,0)"/>
      <path id="Path_3046" data-name="Path 3046" d="M5347.121,1288.767l-2.865,4.326a3.636,3.636,0,0,0,.974,1.811l3.938-5.947a3.616,3.616,0,0,0-2.047-.19Z" transform="translate(-5327.549 -1278.985)" fill="rgba(84,167,248,0)"/>
      <path id="Path_3047" data-name="Path 3047" d="M5343.934,1292.562a3.64,3.64,0,0,0,.078.749l2.865-4.326A3.646,3.646,0,0,0,5343.934,1292.562Z" transform="translate(-5327.305 -1279.203)" fill="rgba(84,167,248,0)"/>
      <path id="Path_3048" data-name="Path 3048" d="M5327.354,1316.263a.657.657,0,0,0-.595-.652l-.868,1.31h.8A.658.658,0,0,0,5327.354,1316.263Z" transform="translate(-5313.616 -1299.405)" fill="rgba(84,167,248,0)"/>
    </g>
  </g>
</svg>
