<svg xmlns="http://www.w3.org/2000/svg" width="25.798" height="34.393" viewBox="0 0 25.798 34.393">
  <g id="Group_7694" data-name="Group 7694" transform="translate(-2294 -266)">
    <g id="Group_7653" data-name="Group 7653" transform="translate(-3385.204 -741.73)">
      <path id="Path_2796" data-name="Path 2796" d="M5743.933,1074.534h3.4a.666.666,0,0,0,.621-.907l-.6-1.547a.665.665,0,0,0-.564-.423l-2.8-.237a.665.665,0,0,0-.722.663v1.784A.666.666,0,0,0,5743.933,1074.534Z" transform="translate(-47.44 -47.162)" fill="#fff"/>
      <path id="Path_2797" data-name="Path 2797" d="M5682.317,1042.123h19.57a3.123,3.123,0,0,0,3.114-3.114v-28.166a3.123,3.123,0,0,0-3.114-3.114h-19.57a3.123,3.123,0,0,0-3.113,3.114v28.166A3.123,3.123,0,0,0,5682.317,1042.123Zm6.128-8.7a2.006,2.006,0,0,1-1.8,1.959,2.057,2.057,0,0,1-.206.01,2.006,2.006,0,0,1-2-1.806c-.005-.053-.007-.112-.008-.163,0-.014,0-.027,0-.042a2,2,0,0,1,.09-.6,1.87,1.87,0,0,1,.068-.185,2.01,2.01,0,0,1,1.853-1.228,2.039,2.039,0,0,1,.455.051c.048.011.1.024.144.039a2.044,2.044,0,0,1,.273.108,2.092,2.092,0,0,1,.252.145,2.012,2.012,0,0,1,.7.818,1.975,1.975,0,0,1,.188.852C5688.447,1033.4,5688.446,1033.409,5688.445,1033.422Zm10.261,2.043a2.012,2.012,0,0,1-2.012-2,.255.255,0,0,0,0-.033,2.018,2.018,0,0,1,.241-.934,2.076,2.076,0,0,1,.217-.321,2.043,2.043,0,0,1,.273-.273c.05-.041.1-.08.154-.116a2.032,2.032,0,0,1,.343-.186,2.006,2.006,0,0,1,1.906.186c.053.036.1.075.155.116a2.011,2.011,0,0,1,.272.273h0a2.029,2.029,0,0,1,.217.32,1.987,1.987,0,0,1,.239.906c0,.014,0,.028,0,.042v.011A2.014,2.014,0,0,1,5698.706,1035.465Zm-11.1-24.287h9a.778.778,0,1,1,0,1.557h-9a.778.778,0,0,1,0-1.557Zm-5.984,11.261a1.331,1.331,0,0,1,1.331-1.332h9.127a1.332,1.332,0,0,1,1.332,1.332v8.55h1.016v-6.7a1.332,1.332,0,0,1,1.432-1.328l4.088.306a1.331,1.331,0,0,1,1.136.831l1.507,3.744a1.317,1.317,0,0,1,.1.49l.021,3.718a1.331,1.331,0,0,1-1.1,1.319,2.9,2.9,0,0,0-5.8.06h-.038l-.037,0v0h-6.4c0-.016,0-.032,0-.049a2.9,2.9,0,0,0-5.8,0c0,.016,0,.032,0,.049h-.586a1.331,1.331,0,0,1-1.331-1.332Z" fill="#fff"/>
    </g>
  </g>
</svg>
