<svg xmlns="http://www.w3.org/2000/svg" width="23.355" height="23.469" viewBox="0 0 23.355 23.469">
  <g id="Group_7622" data-name="Group 7622" transform="translate(3842 -6582)">
    <rect id="Rectangle_1173" data-name="Rectangle 1173" width="3.321" height="3.321" transform="translate(-3824.65 6593.313)" fill="none"/>
    <rect id="Rectangle_1174" data-name="Rectangle 1174" width="3.321" height="3.321" transform="translate(-3829.564 6593.313)" fill="none"/>
    <rect id="Rectangle_1175" data-name="Rectangle 1175" width="3.321" height="3.321" transform="translate(-3824.65 6598.355)" fill="none"/>
    <rect id="Rectangle_1176" data-name="Rectangle 1176" width="3.321" height="3.321" transform="translate(-3834.477 6593.313)" fill="none"/>
    <rect id="Rectangle_1177" data-name="Rectangle 1177" width="3.321" height="3.321" transform="translate(-3834.477 6598.355)" fill="none"/>
    <rect id="Rectangle_1178" data-name="Rectangle 1178" width="3.321" height="3.321" transform="translate(-3829.564 6598.355)" fill="none"/>
    <rect id="Rectangle_1179" data-name="Rectangle 1179" width="3.321" height="3.321" transform="translate(-3839.39 6593.313)" fill="none"/>
    <rect id="Rectangle_1180" data-name="Rectangle 1180" width="3.321" height="3.321" transform="translate(-3839.39 6598.355)" fill="none"/>
    <path id="Path_2670" data-name="Path 2670" d="M937.068,3005.17a2.121,2.121,0,0,0,2.115,2.115h19.126a2.121,2.121,0,0,0,2.115-2.115v-12.113H937.068Zm17.349-10.041h3.321v3.321h-3.321Zm0,5.042h3.321v3.321h-3.321Zm-4.913-5.042h3.322v3.321H949.5Zm0,5.042h3.322v3.321H949.5Zm-4.913-5.042h3.321v3.321h-3.321Zm0,5.042h3.321v3.321h-3.321Zm-4.913-5.042H943v3.321h-3.322Zm0,5.042H943v3.321h-3.322Z" transform="translate(-4779.068 3598.185)" fill="#333"/>
    <path id="Path_2671" data-name="Path 2671" d="M937.068,2951.235v4.57h23.355v-4.57a2.121,2.121,0,0,0-2.115-2.115h-2.9v1.93a1.717,1.717,0,1,1-2.115,0v-1.929h-9.035v1.93a1.717,1.717,0,1,1-2.115,0v-1.929h-2.966A2.12,2.12,0,0,0,937.068,2951.235Z" transform="translate(-4779.068 3634.379)" fill="#333"/>
    <path id="Path_2672" data-name="Path 2672" d="M1030.536,2963.336a.841.841,0,1,0,.7-.376A.837.837,0,0,0,1030.536,2963.336Z" transform="translate(-4855.95 3622.978)" fill="#333"/>
    <path id="Path_2673" data-name="Path 2673" d="M967.258,2963.335a.841.841,0,1,0,.7-.375A.84.84,0,0,0,967.258,2963.335Z" transform="translate(-4803.822 3622.978)" fill="#333"/>
    <path id="Path_2674" data-name="Path 2674" d="M969.429,2944.049a.527.527,0,0,0,.478-.306.522.522,0,0,0,.05-.222v-2.382a.529.529,0,1,0-1.057,0v2.382a.532.532,0,0,0,.529.528Z" transform="translate(-4805.291 3641.39)" fill="#333"/>
    <path id="Path_2675" data-name="Path 2675" d="M1032.7,2944.049a.533.533,0,0,0,.529-.528v-2.382a.529.529,0,1,0-1.057,0v2.382a.532.532,0,0,0,.529.528Z" transform="translate(-4857.416 3641.39)" fill="#333"/>
  </g>
</svg>
