<?xml version="1.0" encoding="utf-8"?>
<!-- Generator: Adobe Illustrator 22.1.0, SVG Export Plug-In . SVG Version: 6.00 Build 0)  -->
<svg version="1.1" id="Calque_1" xmlns="http://www.w3.org/2000/svg" xmlns:xlink="http://www.w3.org/1999/xlink" x="0px" y="0px"
	 viewBox="0 0 40 40" style="enable-background:new 0 0 40 40;" xml:space="preserve">
<style type="text/css">
	.st0{clip-path:url(#SVGID_2_);}
	.st1{fill:white;}
	.st2{fill:white;}
</style>
<g>
	<defs>
		<rect id="SVGID_1_" y="0" width="40" height="40"/>
	</defs>
	<clipPath id="SVGID_2_">
		<use xlink:href="#SVGID_1_"  style="overflow:visible;"/>
	</clipPath>
	<g id="Plan_de_travail_1" class="st0">
		<g id="Groupe_15991" transform="translate(-6684.325 -3441.472)">
			<path id="Tracé_14343" class="st1" d="M6724,3463.9c0.4-0.4,0.5-1,0.1-1.4c0,0-0.1-0.1-0.1-0.1
				C6724.4,3462.7,6724.4,3463.4,6724,3463.9C6724.1,3463.8,6724,3463.8,6724,3463.9z"/>
			<path id="Tracé_14344" class="st2" d="M6708.9,3466.6c-1,0-1.8-0.8-1.8-1.8v-3.3c0-1,0.8-1.8,1.8-1.8h7.1v-7.6
				c0-1.4-1.2-2.6-2.6-2.6h-26.5c-1.4,0-2.6,1.2-2.6,2.6v19.6c0,1.4,1.2,2.6,2.6,2.6h26.5c1.4,0,2.6-1.2,2.6-2.6v-5.1L6708.9,3466.6
				L6708.9,3466.6z M6700,3461.1c-0.2,0-0.3,0-0.5-0.1l-12.3-7c-0.5-0.3-0.6-0.9-0.4-1.3c0.3-0.5,0.9-0.6,1.3-0.4l11.8,6.7l12.2-6.9
				c0.5-0.3,1.1-0.1,1.3,0.4c0.2,0.5,0.1,1-0.4,1.3l-12.7,7.1C6700.4,3461.1,6700.2,3461.1,6700,3461.1L6700,3461.1z"/>
			<path id="Tracé_14345" class="st2" d="M6708.2,3465.5c-0.2-0.2-0.3-0.4-0.3-0.7C6707.9,3465,6708,3465.3,6708.2,3465.5z"/>
			<path id="Tracé_14346" class="st2" d="M6717.4,3465.8v1.6c0,0.1,0,0.1,0,0.2c0,0,0,0,0,0.1c0,0,0,0.1,0,0.1c0,0,0,0,0,0
				c0,0.1,0.1,0.1,0.1,0.1l0,0c0,0,0.1,0.1,0.1,0.1l0,0c0,0,0.1,0.1,0.1,0.1l0,0c0,0,0.1,0.1,0.1,0.1l0,0c0,0,0.1,0,0.1,0l0,0
				c0.1,0,0.1,0,0.2,0h0c0,0,0.1,0,0.1,0l0.1,0c0,0,0.1,0,0.1,0l0.1,0c0,0,0.1,0,0.1,0c0,0,0,0,0,0c0,0,0.1-0.1,0.1-0.1l0,0l4.9-4.3
				c0.4-0.4,0.5-1,0.1-1.4c0,0-0.1-0.1-0.1-0.1l-4.9-4.3l0,0c0,0-0.1-0.1-0.1-0.1c0,0,0,0,0,0c0,0-0.1,0-0.1,0l-0.1,0
				c0,0-0.1,0-0.1,0l-0.1,0c0,0-0.1,0-0.1,0h0c-0.1,0-0.1,0-0.2,0l0,0c0,0-0.1,0-0.1,0l0,0c-0.1,0-0.1,0-0.1,0.1l0,0
				c0,0-0.1,0.1-0.1,0.1c0,0,0,0,0,0c0,0-0.1,0.1-0.1,0.1l0,0c0,0-0.1,0.1-0.1,0.1c0,0,0,0,0,0c0,0,0,0.1,0,0.1c0,0,0,0,0,0.1
				c0,0.1,0,0.1,0,0.2v1.6h-1.4v5.2L6717.4,3465.8z"/>
			<path id="Tracé_14347" class="st2" d="M6708.9,3460.5c-0.5,0-1,0.4-1,1c0,0,0,0,0,0v3.3c0,0.5,0.4,1,1,1h7.1v-5.2L6708.9,3460.5
				L6708.9,3460.5z"/>
		</g>
	</g>
</g>
</svg>
