<svg id="Group_7610" data-name="Group 7610" xmlns="http://www.w3.org/2000/svg" width="27" height="22.675" viewBox="0 0 27 22.675">
  <path id="Path_2466" data-name="Path 2466" d="M866.216,214.4H864.01V210.7a2.107,2.107,0,0,0-2.1-2.1H847.691a2.107,2.107,0,0,0-2.1,2.1V214.4H843.4a2.107,2.107,0,0,0-2.1,2.1V223.9a2.107,2.107,0,0,0,2.1,2.1h5.1V222.31a2.636,2.636,0,0,1,1.051-2.1,2.584,2.584,0,0,1,1.576-.525h7.354a2.627,2.627,0,0,1,2.627,2.626V226h5.1a2.107,2.107,0,0,0,2.1-2.1V216.5A2.081,2.081,0,0,0,866.216,214.4Zm-5.1,0a.523.523,0,0,1-.525.508H849.039a.523.523,0,0,1-.525-.508v-.018a.516.516,0,0,1,.525-.525H860.6a.531.531,0,0,1,.525.543Z" transform="translate(-841.3 -208.6)" fill="#333"/>
  <path id="Path_2467" data-name="Path 2467" d="M889.731,288.441a1.569,1.569,0,0,0,1.576-1.576v-7.389a1.569,1.569,0,0,0-1.576-1.576h.245a1.569,1.569,0,0,0-1.576,1.576v7.389a1.569,1.569,0,0,0,1.576,1.576Z" transform="translate(-880.153 -265.766)" fill="#333"/>
  <path id="Path_2468" data-name="Path 2468" d="M933.031,288.441a1.569,1.569,0,0,0,1.576-1.576v-7.389a1.569,1.569,0,0,0-1.576-1.576h.245a1.569,1.569,0,0,0-1.576,1.576v7.389a1.569,1.569,0,0,0,1.576,1.576Z" transform="translate(-915.871 -265.766)" fill="#333"/>
  <path id="Path_2469" data-name="Path 2469" d="M911.031,288.441a1.569,1.569,0,0,0,1.576-1.576v-7.389a1.569,1.569,0,0,0-1.576-1.576h.245a1.569,1.569,0,0,0-1.576,1.576v7.389a1.569,1.569,0,0,0,1.576,1.576Z" transform="translate(-897.723 -265.766)" fill="#333"/>
</svg>
