<svg xmlns="http://www.w3.org/2000/svg" width="43.724" height="38.906" viewBox="0 0 43.724 38.906">
  <g id="Groupe_5561" data-name="Groupe 5561" transform="translate(0 0)">
    <path id="Tracé_1995" data-name="Tracé 1995" d="M873.929,1553.306H909.95a3.853,3.853,0,0,0,3.333-5.769l-18.011-31.214a3.85,3.85,0,0,0-6.666,0L870.6,1547.537A3.842,3.842,0,0,0,873.929,1553.306Zm16.088-30.477a1.923,1.923,0,1,1,3.846,0v15.639a1.923,1.923,0,1,1-3.846,0Zm1.923,19.966a1.955,1.955,0,1,1-1.955,1.955A1.942,1.942,0,0,1,891.94,1542.794Z" transform="translate(-870.075 -1514.4)" fill="#fff"/>
  </g>
</svg>
