<svg xmlns="http://www.w3.org/2000/svg" width="24.5" height="22.731" viewBox="0 0 24.5 22.731">
  <path id="Tracé_3622" data-name="Tracé 3622" d="M637.7,3092.425a1.033,1.033,0,0,0,1.033,1.033h4.722a11.362,11.362,0,0,0,18.405,4.821,1.033,1.033,0,0,0-1.387-1.531,9.3,9.3,0,0,1-14.814-3.289H651.7a1.033,1.033,0,1,0,0-2.066H645.06a9.18,9.18,0,0,1,.008-3.12H651.7a1.033,1.033,0,1,0,0-2.066h-6.027a9.3,9.3,0,0,1,14.794-3.244,1.033,1.033,0,1,0,1.387-1.531,11.362,11.362,0,0,0-18.39,4.775h-4.737a1.033,1.033,0,1,0,0,2.066h4.246a11.135,11.135,0,0,0-.006,3.12h-4.24A1.033,1.033,0,0,0,637.7,3092.425Z" transform="translate(-637.698 -3078.489)" fill="#cfcfff"/>
</svg>
