<svg id="Groupe_14601" data-name="Groupe 14601" xmlns="http://www.w3.org/2000/svg" width="36.004" height="36.004" viewBox="0 0 36.004 36.004">
  <path id="_Color" data-name="🎨 Color" d="M4.5,0h27A4.5,4.5,0,0,1,36,4.5v27A4.5,4.5,0,0,1,31.5,36H4.5A4.5,4.5,0,0,1,0,31.5V4.5A4.5,4.5,0,0,1,4.5,0Z" transform="translate(0 0)" fill="#354360"/>
  <g id="Groupe_9671" data-name="Groupe 9671" transform="translate(13.501 10.801)">
    <path id="Tracé_3643" data-name="Tracé 3643" d="M2757.776,1284.37a1.2,1.2,0,0,0,1.2,1.2h7.5a1.2,1.2,0,0,0,1.2-1.2v-8.98a1.2,1.2,0,0,0-1.2-1.2h-7.5a1.2,1.2,0,0,0-1.2,1.2Zm7.659-8.3a.3.3,0,1,1,.6,0v7.87a.3.3,0,1,1-.6,0Zm-2.006,0a.3.3,0,1,1,.6,0v7.87a.3.3,0,0,1-.6,0Zm-2.005,0a.3.3,0,0,1,.6,0v7.87a.3.3,0,0,1-.6,0Zm-2.005,0a.3.3,0,0,1,.6,0v7.87a.3.3,0,0,1-.6,0Z" transform="translate(-2757.776 -1270.672)" fill="#fff"/>
    <path id="Tracé_3644" data-name="Tracé 3644" d="M2767.15,1241.637a1,1,0,0,0,1-1h0a1,1,0,0,0-1-1h-1.776a1,1,0,0,0-.916-.6h-2.463a1,1,0,0,0-.916.6H2759.3a1,1,0,0,0-1,1h0a1,1,0,0,0,1,1Z" transform="translate(-2758.25 -1239.036)" fill="#fff"/>
  </g>
</svg>
