<svg id="planing" xmlns="http://www.w3.org/2000/svg" width="16" height="16" viewBox="0 0 16 16">
  <rect id="Rectangle_1173" data-name="Rectangle 1173" width="2.219" height="2.219" transform="translate(11.987 7.738)" fill="none"/>
  <rect id="Rectangle_1174" data-name="Rectangle 1174" width="2.219" height="2.219" transform="translate(8.554 7.738)" fill="none"/>
  <rect id="Rectangle_1175" data-name="Rectangle 1175" width="2.219" height="2.219" transform="translate(11.987 11.187)" fill="none"/>
  <rect id="Rectangle_1176" data-name="Rectangle 1176" width="2.219" height="2.219" transform="translate(5.175 7.738)" fill="none"/>
  <rect id="Rectangle_1177" data-name="Rectangle 1177" width="2.219" height="2.219" transform="translate(5.175 11.187)" fill="none"/>
  <rect id="Rectangle_1178" data-name="Rectangle 1178" width="2.219" height="2.219" transform="translate(8.554 11.187)" fill="none"/>
  <rect id="Rectangle_1179" data-name="Rectangle 1179" width="2.219" height="2.219" transform="translate(1.744 7.738)" fill="none"/>
  <rect id="Rectangle_1180" data-name="Rectangle 1180" width="2.219" height="2.219" transform="translate(1.744 11.187)" fill="none"/>
  <path id="Path_2670" data-name="Path 2670" d="M937.068,3001.151a1.435,1.435,0,0,0,1.448,1.413h13.1a1.435,1.435,0,0,0,1.449-1.413v-8.094h-16Zm11.885-6.709h2.275v2.219h-2.275Zm0,3.369h2.275v2.219h-2.275Zm-3.366-3.369h2.276v2.219h-2.276Zm0,3.369h2.276v2.219h-2.276Zm-3.366-3.369H944.5v2.219h-2.275Zm0,3.369H944.5v2.219h-2.275Zm-3.366-3.369h2.276v2.219h-2.276Zm0,3.369h2.276v2.219h-2.276Z" transform="translate(-937.068 -2986.563)" fill="#354360"/>
  <path id="Path_2671" data-name="Path 2671" d="M937.068,2950.533v3.054h16v-3.054a1.435,1.435,0,0,0-1.449-1.413h-1.984v1.289a1.134,1.134,0,0,1,.452.9,1.177,1.177,0,0,1-2.353,0,1.134,1.134,0,0,1,.452-.9v-1.289H942v1.29a1.134,1.134,0,0,1,.451.9,1.177,1.177,0,0,1-2.352,0,1.135,1.135,0,0,1,.453-.9v-1.289h-2.032A1.435,1.435,0,0,0,937.068,2950.533Z" transform="translate(-937.068 -2948.118)" fill="#354360"/>
  <path id="Path_2672" data-name="Path 2672" d="M1030.489,2963.211a.562.562,0,1,0,.468-.251A.559.559,0,0,0,1030.489,2963.211Z" transform="translate(-1019.107 -2960.271)" fill="#354360"/>
  <path id="Path_2673" data-name="Path 2673" d="M967.212,2963.211a.562.562,0,1,0,.468-.251A.562.562,0,0,0,967.212,2963.211Z" transform="translate(-963.483 -2960.271)" fill="#354360"/>
  <path id="Path_2674" data-name="Path 2674" d="M969.253,2942.908a.356.356,0,0,0,.353-.353v-1.592a.353.353,0,1,0-.706,0v1.592a.356.356,0,0,0,.353.353Z" transform="translate(-965.053 -2940.61)" fill="#354360"/>
  <path id="Path_2675" data-name="Path 2675" d="M1032.527,2942.908a.352.352,0,0,0,.32-.205.348.348,0,0,0,.034-.148v-1.592a.353.353,0,1,0-.706,0v1.592a.348.348,0,0,0,.033.148A.353.353,0,0,0,1032.527,2942.908Z" transform="translate(-1020.68 -2940.61)" fill="#354360"/>
</svg>
