<svg xmlns="http://www.w3.org/2000/svg" width="25" height="31.179" viewBox="0 0 25 31.179">
  <g id="Group_14688" data-name="Group 14688" transform="translate(-1973.2 -1769.2)">
    <path id="Path_10240" data-name="Path 10240" d="M1973.2,1821h25a12,12,0,0,0-1.616-6.084,12.311,12.311,0,0,0-4.135-4.42A12.479,12.479,0,0,0,1973.2,1821Z" transform="translate(0 -20.621)" fill="#354360"/>
    <circle id="Ellipse_61" data-name="Ellipse 61" cx="8.08" cy="8.08" r="8.08" transform="translate(1977.573 1769.2)" fill="#354360"/>
  </g>
</svg>
