<svg xmlns="http://www.w3.org/2000/svg" width="18.535" height="17" viewBox="0 0 18.535 17">
  <g id="Group_18974" data-name="Group 18974" transform="translate(0)">
    <rect id="Rectangle_5600" data-name="Rectangle 5600" width="2.232" height="2.232" transform="translate(11.688 7.561)" fill="#fff"/>
    <rect id="Rectangle_5601" data-name="Rectangle 5601" width="2.232" height="2.232" transform="translate(8.368 7.561)" fill="#fff"/>
    <rect id="Rectangle_5602" data-name="Rectangle 5602" width="2.232" height="2.232" transform="translate(11.688 10.964)" fill="#fff"/>
    <rect id="Rectangle_5603" data-name="Rectangle 5603" width="2.232" height="2.232" transform="translate(5.072 7.561)" fill="#fff"/>
    <rect id="Rectangle_5604" data-name="Rectangle 5604" width="2.232" height="2.232" transform="translate(5.072 10.964)" fill="#fff"/>
    <rect id="Rectangle_5605" data-name="Rectangle 5605" width="2.232" height="2.232" transform="translate(8.368 10.964)" fill="#fff"/>
    <rect id="Rectangle_5606" data-name="Rectangle 5606" width="2.232" height="2.232" transform="translate(1.752 7.561)" fill="#fff"/>
    <rect id="Rectangle_5607" data-name="Rectangle 5607" width="2.232" height="2.232" transform="translate(1.752 10.964)" fill="#fff"/>
    <path id="Path_11018" data-name="Path 11018" d="M-474.106,160.64a1.421,1.421,0,0,0,1.419,1.419h12.9a1.421,1.421,0,0,0,1.419-1.419v-8.154h-15.736Zm11.688-6.782h2.232v2.232h-2.232Zm0,3.4h2.232v2.232h-2.232Zm-3.318-3.4h2.232v2.232h-2.232Zm0,3.4h2.232v2.232h-2.232Zm-3.3-3.4h2.232v2.232h-2.232Zm0,3.4h2.232v2.232h-2.232Zm-3.318-3.4h2.233v2.232h-2.233Zm0,3.4h2.233v2.232h-2.233Z" transform="translate(474.106 -146.298)" fill="#5793ce"/>
    <path id="Path_11019" data-name="Path 11019" d="M-474.106,16.667v3.08h15.765v-3.08a1.421,1.421,0,0,0-1.419-1.419H-461.7v1.316a1.152,1.152,0,0,1,.207,1.616,1.152,1.152,0,0,1-1.617.207,1.154,1.154,0,0,1-.447-.906,1.212,1.212,0,0,1,.439-.917V15.248h-6.094v1.316a1.152,1.152,0,0,1,.207,1.616,1.152,1.152,0,0,1-1.617.207,1.153,1.153,0,0,1-.448-.906,1.212,1.212,0,0,1,.439-.917V15.27h-2.013a1.414,1.414,0,0,0-1.46,1.365C-474.106,16.646-474.106,16.656-474.106,16.667Z" transform="translate(474.106 -14.303)" fill="#5793ce"/>
    <path id="Path_11020" data-name="Path 11020" d="M-183.947,58.662a.625.625,0,0,0-.105.314.563.563,0,0,0,.563.564.563.563,0,0,0,.564-.564.516.516,0,0,0-.1-.314.583.583,0,0,0-.48-.25A.567.567,0,0,0-183.947,58.662Z" transform="translate(195.135 -55.818)" fill="#5793ce"/>
    <path id="Path_11021" data-name="Path 11021" d="M-381.33,58.662a.623.623,0,0,0-.105.314.563.563,0,0,0,.564.564.564.564,0,0,0,.564-.564.512.512,0,0,0-.1-.314.581.581,0,0,0-.48-.25A.51.51,0,0,0-381.33,58.662Z" transform="translate(384.976 -55.818)" fill="#5793ce"/>
    <path id="Path_11022" data-name="Path 11022" d="M-374.871-7.225a.32.32,0,0,0,.313-.208.376.376,0,0,0,.042-.147V-9.188a.362.362,0,0,0-.427-.283.362.362,0,0,0-.283.283V-7.58a.3.3,0,0,0,.042.147A.32.32,0,0,0-374.871-7.225Z" transform="translate(379.004 9.478)" fill="#5793ce"/>
    <path id="Path_11023" data-name="Path 11023" d="M-177.821-7.225a.32.32,0,0,0,.313-.208.387.387,0,0,0,.042-.147V-9.188a.362.362,0,0,0-.427-.283.362.362,0,0,0-.283.283V-7.58a.3.3,0,0,0,.042.147A.32.32,0,0,0-177.821-7.225Z" transform="translate(189.483 9.478)" fill="#5793ce"/>
    <g id="Group_18920" data-name="Group 18920" transform="translate(10.074 4.015)">
      <g id="Group_18919" data-name="Group 18919" transform="translate(0)">
        <path id="Path_18472" data-name="Path 18472" d="M-198.8,110.582a1.342,1.342,0,0,1,.646-1.148v-.254a2.586,2.586,0,0,1,2.583-2.583,2.586,2.586,0,0,1,2.583,2.583v.347a1.34,1.34,0,0,1,.513,1.055,1.342,1.342,0,0,1-1.016,1.3.82.82,0,0,1-.161.255,1.288,1.288,0,0,1-.815.361.179.179,0,0,1-.17.126h-.343a.181.181,0,0,1-.181-.181.181.181,0,0,1,.181-.181h.343a.178.178,0,0,1,.15.086,1.143,1.143,0,0,0,.723-.314.7.7,0,0,0,.086-.117,1.346,1.346,0,0,1-.14.007V109.24a1.341,1.341,0,0,1,.412.065v-.125a2.167,2.167,0,0,0-2.165-2.165,2.167,2.167,0,0,0-2.165,2.165v.089a1.35,1.35,0,0,1,.278-.029v2.685A1.342,1.342,0,0,1-198.8,110.582Zm3.812,1.549h.343a.325.325,0,0,1,.208.076,1.321,1.321,0,0,0,.279-.078c.038-.034.076-.067.111-.1V108.9h.01a2.227,2.227,0,0,0-1.6-.678,2.227,2.227,0,0,0-1.6.678h.01v3.126a2.228,2.228,0,0,0,1.591.666,2.224,2.224,0,0,0,.379-.035.331.331,0,0,1-.063-.194A.334.334,0,0,1-194.984,112.132Zm.3.714h-1.9a2.865,2.865,0,0,0-2.862,2.862v2.32l.006.036.16.05a13.036,13.036,0,0,0,3.891.628,7.993,7.993,0,0,0,3.4-.638l.15-.076h.016v-2.32A2.865,2.865,0,0,0-194.685,112.846Z" transform="translate(199.863 -106.177)" fill="#5793ce"/>
        <path id="Path_18473" data-name="Path 18473" d="M-206.146,96.017a2.586,2.586,0,0,1,2.583,2.583v.347A1.34,1.34,0,0,1-203.05,100a1.342,1.342,0,0,1-1.016,1.3.821.821,0,0,1-.161.255,1.288,1.288,0,0,1-.815.361.179.179,0,0,1-.17.126h-.343a.181.181,0,0,1-.181-.181.181.181,0,0,1,.181-.181h.343a.178.178,0,0,1,.15.086,1.143,1.143,0,0,0,.723-.314.707.707,0,0,0,.086-.117,1.353,1.353,0,0,1-.14.007V98.66a1.34,1.34,0,0,1,.412.065V98.6a2.167,2.167,0,0,0-2.165-2.165,2.167,2.167,0,0,0-2.165,2.165v.089a1.35,1.35,0,0,1,.278-.029v2.685A1.342,1.342,0,0,1-209.375,100a1.342,1.342,0,0,1,.647-1.148V98.6a2.586,2.586,0,0,1,2.583-2.583m-.067,1.626a2.227,2.227,0,0,1,1.6.678h-.01v3.126c-.035.036-.073.069-.111.1a1.318,1.318,0,0,1-.28.078.325.325,0,0,0-.208-.076h-.343a.334.334,0,0,0-.334.333.332.332,0,0,0,.063.194,2.224,2.224,0,0,1-.379.035,2.228,2.228,0,0,1-1.591-.666V98.321h-.01a2.227,2.227,0,0,1,1.6-.678m.948,4.623a2.865,2.865,0,0,1,2.862,2.862v2.32h-.016l-.15.076a7.993,7.993,0,0,1-3.4.638,13.036,13.036,0,0,1-3.891-.628l-.16-.05-.006-.036v-2.32a2.865,2.865,0,0,1,2.862-2.862h1.9m-.882-6.669a3.006,3.006,0,0,0-3,3v.038A1.749,1.749,0,0,0-209.8,100a1.765,1.765,0,0,0,1.714,1.762q.088.087.182.165a3.288,3.288,0,0,0-2.544,3.2v2.32a.425.425,0,0,0,.006.068l.006.036a.42.42,0,0,0,.289.333l.16.05a13.507,13.507,0,0,0,4.017.647,8.366,8.366,0,0,0,3.587-.683l.093-.047a.42.42,0,0,0,.3-.4v-2.32a3.288,3.288,0,0,0-2.165-3.086,1.35,1.35,0,0,0,.23-.2,1.228,1.228,0,0,0,.145-.192A1.759,1.759,0,0,0-202.63,100a1.751,1.751,0,0,0-.513-1.243V98.6a3.006,3.006,0,0,0-3-3Zm-1.428,2a1.744,1.744,0,0,1,1.427-.742,1.746,1.746,0,0,1,1.525.9,2.628,2.628,0,0,0-1.592-.53,2.632,2.632,0,0,0-1.361.375Z" transform="translate(210.443 -95.597)" fill="#fff"/>
      </g>
    </g>
  </g>
</svg>
