<svg xmlns="http://www.w3.org/2000/svg" width="32.425" height="22.605" viewBox="0 0 32.425 22.605">
  <path id="Tracé_3735" data-name="Tracé 3735" d="M160.18,170.012a1.86,1.86,0,0,0-2.631,0l-16.427,16.427-8.647-8.647a1.86,1.86,0,0,0-2.631,2.631l9.962,9.962a1.86,1.86,0,0,0,2.631,0l9.281-9.281,8.461-8.461A1.86,1.86,0,0,0,160.18,170.012Z" transform="translate(-128.801 -168.824)" fill="#5793ce" stroke="#5793ce" stroke-width="1"/>
</svg>
