<svg id="Layer_35" data-name="Layer 35" xmlns="http://www.w3.org/2000/svg" viewBox="0 0 227 227">
  <defs>
    <style>
      .cls-1 {
        fill: #354360;
      }
    </style>
  </defs>
  <title>setings</title>
  <g>
    <path class="cls-1" d="M258.46,129.81l-10.87-2.72A98.29,98.29,0,0,0,235,96.73l5.77-9.59a6.66,6.66,0,0,0-1-8.12L221,60.21a6.68,6.68,0,0,0-8.12-1L203.27,65a98.31,98.31,0,0,0-30.36-12.55L170.2,41.54a6.66,6.66,0,0,0-6.46-5H136.26a6.66,6.66,0,0,0-6.46,5l-2.71,10.87A98.31,98.31,0,0,0,96.73,65l-9.6-5.75a6.68,6.68,0,0,0-8.12,1L60.21,79a6.64,6.64,0,0,0-1,8.12L65,96.73a98.29,98.29,0,0,0-12.56,30.36l-10.87,2.72a6.64,6.64,0,0,0-5,6.45v27.48a6.64,6.64,0,0,0,5,6.45l10.87,2.72A98.29,98.29,0,0,0,65,203.27l-5.77,9.59a6.66,6.66,0,0,0,1,8.12L79,239.79a6.67,6.67,0,0,0,8.12,1l9.6-5.75a98.31,98.31,0,0,0,30.36,12.55l2.71,10.87a6.66,6.66,0,0,0,6.46,5h27.48a6.66,6.66,0,0,0,6.46-5l2.71-10.87A98.31,98.31,0,0,0,203.27,235l9.6,5.75a6.67,6.67,0,0,0,8.12-1L239.8,221a6.66,6.66,0,0,0,1-8.12L235,203.27a98.29,98.29,0,0,0,12.56-30.36l10.87-2.72a6.64,6.64,0,0,0,5-6.45V136.26A6.64,6.64,0,0,0,258.46,129.81ZM149.56,223.6A73.27,73.27,0,0,1,76.4,150.44,75.05,75.05,0,0,1,97.83,97.88s0,0,0,0A73,73,0,0,1,149.56,76.4a75,75,0,0,1,52.59,21.45s0,0,0,0a75.05,75.05,0,0,1,21.43,52.56C223.6,190.59,190.07,223.6,149.56,223.6Z" transform="translate(-36.5 -36.5)"/>
    <circle class="cls-1" cx="113.5" cy="113.5" r="61.33"/>
  </g>
</svg>
