<svg xmlns="http://www.w3.org/2000/svg" width="12.981" height="14" viewBox="0 0 12.981 14">
  <path id="Path_18613" data-name="Path 18613" d="M7058.343,760.558a7.129,7.129,0,0,1,1.237-5.3,7.155,7.155,0,1,0,7.917,10.995,7.005,7.005,0,0,1-.947.222A7.155,7.155,0,0,1,7058.343,760.558Z" transform="translate(-7054.515 -755.263)" fill="#1923f9"/>
</svg>
