<svg id="Groupe_17097" data-name="Groupe 17097" xmlns="http://www.w3.org/2000/svg" width="6.816" height="6.811" viewBox="0 0 6.816 6.811">
  <path id="Tracé_3645" data-name="Tracé 3645" d="M1.014,4.342H2.469V5.8a1.019,1.019,0,0,0,.937,1.014A1.019,1.019,0,0,0,4.341,5.8V4.342H5.8A1.019,1.019,0,0,0,6.81,3.406,1.019,1.019,0,0,0,5.8,2.469H4.341V1.014A1.019,1.019,0,0,0,3.405,0a1.019,1.019,0,0,0-.937,1.014V2.469H1.014A1.019,1.019,0,0,0,0,3.406,1.019,1.019,0,0,0,1.014,4.342Z" transform="translate(0.006 0)" fill="#5793ce"/>
  <path id="Tracé_3646" data-name="Tracé 3646" d="M0,0V.224C0,.187,0,.149.006.112S0,.038,0,0Z" transform="translate(0 3.293)" fill="#5793ce"/>
</svg>
