<svg xmlns="http://www.w3.org/2000/svg" width="222.099" height="54.577" viewBox="0 0 222.099 54.577">
  <g id="Groupe_15873" data-name="Groupe 15873" transform="translate(-464.648 -1548)">
    <circle id="Ellipse_213" data-name="Ellipse 213" cx="6.557" cy="6.557" r="6.557" transform="translate(473.174 1575.083)" fill="#cb0017"/>
    <path id="Tracé_10622" data-name="Tracé 10622" d="M14476.057,3147.286c.013.015,0-.011,0,0Z" transform="translate(-13789.498 -1573.954)" fill="#1a1818"/>
    <path id="Tracé_10623" data-name="Tracé 10623" d="M12057.915,2210.164c-.092-1.737-.67-6.812-4.223-10.365-7.392-7.39-22.11-4.029-24.254-3.489l-2.9,5.854c2.66-.5,22.057-3.8,22.858,4.855a43.52,43.52,0,0,0-9.98-1.234c-12.982,0-20.419,6.271-20.419,16.748,0,13.21,11.16,16.748,19.537,16.748,7.87,0,19.537-4.246,19.537-16.748C12058.075,2217.249,12058.2,2215.153,12057.915,2210.164Zm-8.108,12.014c0,7.554-4.946,10.547-11.047,10.547-6.485,0-11.047-2.993-11.047-10.12,0-5.561,4.205-10.405,11.547-10.405,5.528,0,10.547.712,10.547,1Z" transform="translate(-11371.356 -636.832)" fill="#1a1818"/>
    <path id="Tracé_10624" data-name="Tracé 10624" d="M6637.594,2159.271c-4.422-4.9-14.817-5.555-22.195-5.334l-.015.031-3.072,6.209-.024.05,2.9-.136c7.488-.1,17.666.81,18.117,6.4a43.494,43.494,0,0,0-9.984-1.235c-12.982,0-20.419,6.272-20.419,16.749,0,13.21,11.161,16.748,19.538,16.748,7.87,0,19.537-4.246,19.537-16.748,0-5.285-.157-12.37-.182-12.4A18.416,18.416,0,0,0,6637.594,2159.271Zm-3.884,22.379c0,7.555-4.946,10.548-11.047,10.548-6.484,0-11.046-2.994-11.046-10.121,0-5.561,4.2-10.405,11.545-10.405,5.529,0,10.548.713,10.548,1Z" transform="translate(-6041.038 -596.304)" fill="#1a1818"/>
    <path id="Tracé_10625" data-name="Tracé 10625" d="M9349,1699h-8.124v16.917a28.948,28.948,0,0,0-10.46-2.061c-12.847,0-20.419,6.058-20.419,20.241,0,13.21,11.83,16.962,19.537,16.962,7.871,0,19.536-4.094,19.536-16.6,0-3.168-.022-7.6-.07-12.369Zm-8.249,34.954c0,7.555-4.946,10.549-11.048,10.549-6.486,0-11.424-3.564-11.493-10.691-.087-9.408,4.65-13.256,11.993-13.256,5.541,0,10.548,1.711,10.548,2Z" transform="translate(-8705.262 -148.609)" fill="#1a1818"/>
    <path id="Tracé_10626" data-name="Tracé 10626" d="M5588.991,2148.5c-8.569.116-14.263,1.819-17.433,4.316-4.72,3.718-5.517,8.361-5.56,11.972v28.082l8.554.143v-28.365a9.351,9.351,0,0,1,5.844-8.553,22.118,22.118,0,0,1,5.286-.906Z" transform="translate(-5020.557 -590.989)" fill="#1a1818"/>
    <path id="Tracé_10627" data-name="Tracé 10627" d="M534.527,1557.153q-1.126-.007-2.243.03-.583.019-1.162.05v-8.989l-9.076-.244v10.532a38.246,38.246,0,0,0-12.493,5.383,34.325,34.325,0,0,0-12.548,15.631,34.262,34.262,0,0,1-4.22,7.519,23.886,23.886,0,0,1-4.795,4.8,21.452,21.452,0,0,1-10.117,4.018,25.68,25.68,0,0,1-2.858.21q-.5-.008-1-.031a36.891,36.891,0,0,1-4.447-.478c-.809-.136-1.526-.286-2.128-.425l-.025.054-2.751,5.873-.015.031a35.838,35.838,0,0,0,9.875,1.406q.246,0,.5,0,.288,0,.581,0a38.275,38.275,0,0,0,4.216-.229,30.847,30.847,0,0,0,14.175-5.1,30.027,30.027,0,0,0,6.541-6.118,37.887,37.887,0,0,0,5.258-9.068,32.34,32.34,0,0,1,4.395-7.606,26.854,26.854,0,0,1,5.346-5.147,27.856,27.856,0,0,1,6.517-3.48v25.553s-.266,6.129,4.3,9.123c4.661,3.059,11.546,2,14.539,1.711v-5.987a18.678,18.678,0,0,1-6.557-.285,4.024,4.024,0,0,1-3.2-4.148v-28q1.019-.094,2.058-.137.7-.029,1.4-.034c.986.008,1.976.044,2.961.108,1.236.081,2.291.195,3.107.3l.011-.024,2.828-6.036,0,0A45.645,45.645,0,0,0,534.527,1557.153Z" transform="translate(0 0)" fill="#1a1818"/>
  </g>
</svg>
