<svg id="Layer_35" data-name="Layer 35" xmlns="http://www.w3.org/2000/svg" viewBox="0 0 162 126">
  <defs>
    <style>
      .cls-1 {
        fill: #354360;
      }
    </style>
  </defs>
  <title>platform</title>
  <g>
    <path class="cls-1" d="M175,220H337V193H175Zm45-18h9v9h-9Zm-18,0h9v9h-9Zm-18,0h9v9h-9Z" transform="translate(-175 -193)"/>
    <path class="cls-1" d="M175,319H337V229H175Zm117-18h-9v-9h9Zm18,0h-9v-9h9Zm18,0h-9v-9h9Zm-63-63h63v9H265Zm0,18h63v9H265Zm0,18h63v9H265Zm-81,31.5A31.53,31.53,0,0,1,204,276.22a22.5,22.5,0,1,1,32.1,0A31.53,31.53,0,0,1,256,305.5V310H184Z" transform="translate(-175 -193)"/>
    <path class="cls-1" d="M224.5,283h-9a22.53,22.53,0,0,0-22.05,18h53.1A22.53,22.53,0,0,0,224.5,283Z" transform="translate(-175 -193)"/>
    <circle class="cls-1" cx="45" cy="67.5" r="13.5"/>
  </g>
</svg>
