<svg width="25" height="49" viewBox="0 0 25 49" fill="none" xmlns="http://www.w3.org/2000/svg">
<path fill-rule="evenodd" clip-rule="evenodd" d="M3 0H5H15H25V2H23V4H21V6H19V8H17V10H19V12H21V14H23V16H25V18H15H5V41H8V49H0V41H3V0Z" fill="currentColor"/>
</svg>
