%YAML 1.1
%TAG !u! tag:unity3d.com,2011:
--- !u!1 &2125256225301689408
GameObject:
  m_ObjectHideFlags: 0
  m_CorrespondingSourceObject: {fileID: 0}
  m_PrefabInstance: {fileID: 0}
  m_PrefabAsset: {fileID: 0}
  serializedVersion: 6
  m_Component:
  - component: {fileID: 2125256225301689409}
  m_Layer: 0
  m_Name: Level1
  m_TagString: Untagged
  m_Icon: {fileID: 0}
  m_NavMeshLayer: 0
  m_StaticEditorFlags: 0
  m_IsActive: 1
--- !u!4 &2125256225301689409
Transform:
  m_ObjectHideFlags: 0
  m_CorrespondingSourceObject: {fileID: 0}
  m_PrefabInstance: {fileID: 0}
  m_PrefabAsset: {fileID: 0}
  m_GameObject: {fileID: 2125256225301689408}
  m_LocalRotation: {x: 0, y: 0, z: 0, w: 1}
  m_LocalPosition: {x: 0, y: 0, z: 0}
  m_LocalScale: {x: 1, y: 1, z: 1}
  m_Children:
  - {fileID: 2125256225771537444}
  - {fileID: 2125256225332305533}
  - {fileID: 6044992980802891381}
  m_Father: {fileID: 0}
  m_RootOrder: 0
  m_LocalEulerAnglesHint: {x: 0, y: 0, z: 0}
--- !u!1001 &2991317397382035845
PrefabInstance:
  m_ObjectHideFlags: 0
  serializedVersion: 2
  m_Modification:
    m_TransformParent: {fileID: 2125256225301689409}
    m_Modifications:
    - target: {fileID: 3818249932904671139, guid: 418226e2f77a861419c3b090944b79b5, type: 3}
      propertyPath: m_IsActive
      value: 0
      objectReference: {fileID: 0}
    - target: {fileID: 3818249934457038840, guid: 418226e2f77a861419c3b090944b79b5, type: 3}
      propertyPath: m_RootOrder
      value: 1
      objectReference: {fileID: 0}
    - target: {fileID: 3818249934457038840, guid: 418226e2f77a861419c3b090944b79b5, type: 3}
      propertyPath: m_LocalPosition.x
      value: 0
      objectReference: {fileID: 0}
    - target: {fileID: 3818249934457038840, guid: 418226e2f77a861419c3b090944b79b5, type: 3}
      propertyPath: m_LocalPosition.y
      value: 6.88
      objectReference: {fileID: 0}
    - target: {fileID: 3818249934457038840, guid: 418226e2f77a861419c3b090944b79b5, type: 3}
      propertyPath: m_LocalPosition.z
      value: -6.96
      objectReference: {fileID: 0}
    - target: {fileID: 3818249934457038840, guid: 418226e2f77a861419c3b090944b79b5, type: 3}
      propertyPath: m_LocalRotation.w
      value: 1
      objectReference: {fileID: 0}
    - target: {fileID: 3818249934457038840, guid: 418226e2f77a861419c3b090944b79b5, type: 3}
      propertyPath: m_LocalRotation.x
      value: -0
      objectReference: {fileID: 0}
    - target: {fileID: 3818249934457038840, guid: 418226e2f77a861419c3b090944b79b5, type: 3}
      propertyPath: m_LocalRotation.y
      value: -0
      objectReference: {fileID: 0}
    - target: {fileID: 3818249934457038840, guid: 418226e2f77a861419c3b090944b79b5, type: 3}
      propertyPath: m_LocalRotation.z
      value: -0
      objectReference: {fileID: 0}
    - target: {fileID: 3818249934457038840, guid: 418226e2f77a861419c3b090944b79b5, type: 3}
      propertyPath: m_LocalEulerAnglesHint.x
      value: 0
      objectReference: {fileID: 0}
    - target: {fileID: 3818249934457038840, guid: 418226e2f77a861419c3b090944b79b5, type: 3}
      propertyPath: m_LocalEulerAnglesHint.y
      value: 0
      objectReference: {fileID: 0}
    - target: {fileID: 3818249934457038840, guid: 418226e2f77a861419c3b090944b79b5, type: 3}
      propertyPath: m_LocalEulerAnglesHint.z
      value: 0
      objectReference: {fileID: 0}
    - target: {fileID: 3818249934457038841, guid: 418226e2f77a861419c3b090944b79b5, type: 3}
      propertyPath: m_Name
      value: Planet
      objectReference: {fileID: 0}
    - target: {fileID: 4033891108481638881, guid: 418226e2f77a861419c3b090944b79b5, type: 3}
      propertyPath: m_RootOrder
      value: 2
      objectReference: {fileID: 0}
    m_RemovedComponents: []
  m_SourcePrefab: {fileID: 100100000, guid: 418226e2f77a861419c3b090944b79b5, type: 3}
--- !u!4 &2125256225332305533 stripped
Transform:
  m_CorrespondingSourceObject: {fileID: 3818249934457038840, guid: 418226e2f77a861419c3b090944b79b5, type: 3}
  m_PrefabInstance: {fileID: 2991317397382035845}
  m_PrefabAsset: {fileID: 0}
--- !u!1001 &4135079061878275347
PrefabInstance:
  m_ObjectHideFlags: 0
  serializedVersion: 2
  m_Modification:
    m_TransformParent: {fileID: 2125256225301689409}
    m_Modifications:
    - target: {fileID: 7676070456307520358, guid: ad18a7ffa6986a44c9b62b56ed6cf068, type: 3}
      propertyPath: m_RootOrder
      value: 2
      objectReference: {fileID: 0}
    - target: {fileID: 7676070456307520358, guid: ad18a7ffa6986a44c9b62b56ed6cf068, type: 3}
      propertyPath: m_LocalPosition.x
      value: 0
      objectReference: {fileID: 0}
    - target: {fileID: 7676070456307520358, guid: ad18a7ffa6986a44c9b62b56ed6cf068, type: 3}
      propertyPath: m_LocalPosition.y
      value: -3.41
      objectReference: {fileID: 0}
    - target: {fileID: 7676070456307520358, guid: ad18a7ffa6986a44c9b62b56ed6cf068, type: 3}
      propertyPath: m_LocalPosition.z
      value: -1.64
      objectReference: {fileID: 0}
    - target: {fileID: 7676070456307520358, guid: ad18a7ffa6986a44c9b62b56ed6cf068, type: 3}
      propertyPath: m_LocalRotation.w
      value: 1
      objectReference: {fileID: 0}
    - target: {fileID: 7676070456307520358, guid: ad18a7ffa6986a44c9b62b56ed6cf068, type: 3}
      propertyPath: m_LocalRotation.x
      value: -0
      objectReference: {fileID: 0}
    - target: {fileID: 7676070456307520358, guid: ad18a7ffa6986a44c9b62b56ed6cf068, type: 3}
      propertyPath: m_LocalRotation.y
      value: -0
      objectReference: {fileID: 0}
    - target: {fileID: 7676070456307520358, guid: ad18a7ffa6986a44c9b62b56ed6cf068, type: 3}
      propertyPath: m_LocalRotation.z
      value: -0
      objectReference: {fileID: 0}
    - target: {fileID: 7676070456307520358, guid: ad18a7ffa6986a44c9b62b56ed6cf068, type: 3}
      propertyPath: m_LocalEulerAnglesHint.x
      value: 0
      objectReference: {fileID: 0}
    - target: {fileID: 7676070456307520358, guid: ad18a7ffa6986a44c9b62b56ed6cf068, type: 3}
      propertyPath: m_LocalEulerAnglesHint.y
      value: 0
      objectReference: {fileID: 0}
    - target: {fileID: 7676070456307520358, guid: ad18a7ffa6986a44c9b62b56ed6cf068, type: 3}
      propertyPath: m_LocalEulerAnglesHint.z
      value: 0
      objectReference: {fileID: 0}
    - target: {fileID: 7676070456307520359, guid: ad18a7ffa6986a44c9b62b56ed6cf068, type: 3}
      propertyPath: m_Name
      value: Finish
      objectReference: {fileID: 0}
    m_RemovedComponents: []
  m_SourcePrefab: {fileID: 100100000, guid: ad18a7ffa6986a44c9b62b56ed6cf068, type: 3}
--- !u!4 &6044992980802891381 stripped
Transform:
  m_CorrespondingSourceObject: {fileID: 7676070456307520358, guid: ad18a7ffa6986a44c9b62b56ed6cf068, type: 3}
  m_PrefabInstance: {fileID: 4135079061878275347}
  m_PrefabAsset: {fileID: 0}
--- !u!1001 &8796626469757771136
PrefabInstance:
  m_ObjectHideFlags: 0
  serializedVersion: 2
  m_Modification:
    m_TransformParent: {fileID: 2125256225301689409}
    m_Modifications:
    - target: {fileID: 7452762956182919586, guid: f626dcd7f98d42e4a966accda4478024, type: 3}
      propertyPath: playerFuel
      value: 
      objectReference: {fileID: 0}
    - target: {fileID: 7452762956182919588, guid: f626dcd7f98d42e4a966accda4478024, type: 3}
      propertyPath: m_RootOrder
      value: 0
      objectReference: {fileID: 0}
    - target: {fileID: 7452762956182919588, guid: f626dcd7f98d42e4a966accda4478024, type: 3}
      propertyPath: m_LocalPosition.x
      value: 0
      objectReference: {fileID: 0}
    - target: {fileID: 7452762956182919588, guid: f626dcd7f98d42e4a966accda4478024, type: 3}
      propertyPath: m_LocalPosition.y
      value: 7.99
      objectReference: {fileID: 0}
    - target: {fileID: 7452762956182919588, guid: f626dcd7f98d42e4a966accda4478024, type: 3}
      propertyPath: m_LocalPosition.z
      value: -26.44
      objectReference: {fileID: 0}
    - target: {fileID: 7452762956182919588, guid: f626dcd7f98d42e4a966accda4478024, type: 3}
      propertyPath: m_LocalRotation.w
      value: 1
      objectReference: {fileID: 0}
    - target: {fileID: 7452762956182919588, guid: f626dcd7f98d42e4a966accda4478024, type: 3}
      propertyPath: m_LocalRotation.x
      value: -0
      objectReference: {fileID: 0}
    - target: {fileID: 7452762956182919588, guid: f626dcd7f98d42e4a966accda4478024, type: 3}
      propertyPath: m_LocalRotation.y
      value: -0
      objectReference: {fileID: 0}
    - target: {fileID: 7452762956182919588, guid: f626dcd7f98d42e4a966accda4478024, type: 3}
      propertyPath: m_LocalRotation.z
      value: -0
      objectReference: {fileID: 0}
    - target: {fileID: 7452762956182919588, guid: f626dcd7f98d42e4a966accda4478024, type: 3}
      propertyPath: m_LocalEulerAnglesHint.x
      value: 0
      objectReference: {fileID: 0}
    - target: {fileID: 7452762956182919588, guid: f626dcd7f98d42e4a966accda4478024, type: 3}
      propertyPath: m_LocalEulerAnglesHint.y
      value: 0
      objectReference: {fileID: 0}
    - target: {fileID: 7452762956182919588, guid: f626dcd7f98d42e4a966accda4478024, type: 3}
      propertyPath: m_LocalEulerAnglesHint.z
      value: 0
      objectReference: {fileID: 0}
    - target: {fileID: 7452762956182919591, guid: f626dcd7f98d42e4a966accda4478024, type: 3}
      propertyPath: m_Name
      value: Player
      objectReference: {fileID: 0}
    m_RemovedComponents: []
  m_SourcePrefab: {fileID: 100100000, guid: f626dcd7f98d42e4a966accda4478024, type: 3}
--- !u!4 &2125256225771537444 stripped
Transform:
  m_CorrespondingSourceObject: {fileID: 7452762956182919588, guid: f626dcd7f98d42e4a966accda4478024, type: 3}
  m_PrefabInstance: {fileID: 8796626469757771136}
  m_PrefabAsset: {fileID: 0}
