<?xml version="1.0" encoding="UTF-8" standalone="no"?>
<!DOCTYPE svg PUBLIC "-//W3C//DTD SVG 1.1//EN" "http://www.w3.org/Graphics/SVG/1.1/DTD/svg11.dtd">
<svg width="650px" height="192px" version="1.1" xmlns="http://www.w3.org/2000/svg" xmlns:xlink="http://www.w3.org/1999/xlink" xml:space="preserve" xmlns:serif="http://www.serif.com/" style="fill-rule:evenodd;clip-rule:evenodd;stroke-linejoin:round;stroke-miterlimit:2;">
    <g transform="matrix(1,0,0,1,-1388.07,-6344.06)">
        <g id="SY" transform="matrix(0.5625,0,0,1,1180,5900)">
            <g id="Camp" transform="matrix(1.54751,0,0,0.870472,249.656,-8.33755)">
                <path d="M129.699,563.68C134.882,563.68 139.099,559.464 139.099,554.28C139.099,549.097 134.882,544.88 129.699,544.88C124.515,544.88 120.298,549.097 120.298,554.28C120.298,559.464 124.515,563.68 129.699,563.68Z" style="fill:rgb(242,212,146);fill-rule:nonzero;"/>
                <path d="M101.801,565.803C101.801,561.448 105.332,557.919 109.685,557.919C114.04,557.919 117.569,561.448 117.569,565.803C117.569,570.156 114.04,573.687 109.685,573.687C105.332,573.687 101.801,570.156 101.801,565.803ZM109.685,535.479C114.04,535.479 117.569,539.01 117.569,543.364C117.569,547.718 114.04,551.248 109.685,551.248C105.332,551.248 101.801,547.718 101.801,543.364C101.801,539.01 105.332,535.479 109.685,535.479ZM129.699,542.454C136.219,542.454 141.524,547.76 141.524,554.28C141.524,560.801 136.219,566.105 129.699,566.105C123.178,566.105 117.873,560.801 117.873,554.28C117.873,547.76 123.178,542.454 129.699,542.454ZM129.699,523.957C134.053,523.957 137.583,527.486 137.583,531.841C137.583,536.194 134.053,539.726 129.699,539.726C125.344,539.726 121.814,536.194 121.814,531.841C121.814,527.486 125.344,523.957 129.699,523.957ZM149.105,536.087C153.459,536.087 156.989,539.616 156.989,543.971C156.989,548.324 153.459,551.854 149.105,551.854C144.751,551.854 141.221,548.324 141.221,543.971C141.221,539.616 144.751,536.087 149.105,536.087ZM149.105,573.99C144.751,573.99 141.221,570.46 141.221,566.105C141.221,561.752 144.751,558.222 149.105,558.222C153.459,558.222 156.989,561.752 156.989,566.105C156.989,570.46 153.459,573.99 149.105,573.99ZM129.396,585.816C125.041,585.816 121.511,582.286 121.511,577.933C121.511,573.578 125.041,570.048 129.396,570.048C133.75,570.048 137.279,573.578 137.279,577.933C137.279,582.286 133.75,585.816 129.396,585.816ZM130.002,588.849C149.094,588.849 164.57,573.372 164.57,554.28C164.57,535.188 149.094,519.712 130.002,519.712C110.91,519.712 95.433,535.188 95.433,554.28C95.433,573.372 110.91,588.849 130.002,588.849Z" style="fill:rgb(242,212,146);fill-rule:nonzero;"/>
                <path d="M211.143,564.728C216.327,564.728 220.543,560.511 220.543,555.327C220.543,550.145 216.327,545.928 211.143,545.928C205.96,545.928 201.743,550.145 201.743,555.327C201.743,560.511 205.96,564.728 211.143,564.728Z" style="fill:rgb(242,212,146);fill-rule:nonzero;"/>
                <path d="M183.246,566.851C183.246,562.495 186.776,558.966 191.13,558.966C195.484,558.966 199.014,562.495 199.014,566.851C199.014,571.204 195.484,574.734 191.13,574.734C186.776,574.734 183.246,571.204 183.246,566.851ZM191.13,536.527C195.484,536.527 199.014,540.058 199.014,544.411C199.014,548.766 195.484,552.296 191.13,552.296C186.776,552.296 183.246,548.766 183.246,544.411C183.246,540.058 186.776,536.527 191.13,536.527ZM211.143,543.502C217.664,543.502 222.969,548.808 222.969,555.327C222.969,561.848 217.664,567.153 211.143,567.153C204.623,567.153 199.317,561.848 199.317,555.327C199.317,548.808 204.623,543.502 211.143,543.502ZM211.143,525.005C215.498,525.005 219.027,528.534 219.027,532.889C219.027,537.241 215.498,540.772 211.143,540.772C206.789,540.772 203.259,537.241 203.259,532.889C203.259,528.534 206.789,525.005 211.143,525.005ZM230.55,537.134C234.904,537.134 238.434,540.663 238.434,545.019C238.434,549.372 234.904,552.901 230.55,552.901C226.196,552.901 222.666,549.372 222.666,545.019C222.666,540.663 226.196,537.134 230.55,537.134ZM230.55,575.038C226.196,575.038 222.666,571.508 222.666,567.153C222.666,562.8 226.196,559.269 230.55,559.269C234.904,559.269 238.434,562.8 238.434,567.153C238.434,571.508 234.904,575.038 230.55,575.038ZM210.84,586.863C206.486,586.863 202.956,583.333 202.956,578.979C202.956,574.626 206.486,571.096 210.84,571.096C215.194,571.096 218.724,574.626 218.724,578.979C218.724,583.333 215.194,586.863 210.84,586.863ZM211.447,589.896C230.538,589.896 246.015,574.419 246.015,555.327C246.015,536.236 230.538,520.76 211.447,520.76C192.355,520.76 176.878,536.236 176.878,555.327C176.878,574.419 192.355,589.896 211.447,589.896Z" style="fill:rgb(242,212,146);fill-rule:nonzero;"/>
                <rect x="130.429" y="608.024" width="52.917" height="31.169" style="fill:rgb(242,212,146);fill-rule:nonzero;"/>
                <rect x="104.655" y="609.456" width="8.645" height="18.816" style="fill:rgb(242,212,146);fill-rule:nonzero;"/>
                <path d="M99.4,609.796L77.702,598.947L77.872,636.917L99.4,628.611L99.4,609.796Z" style="fill:rgb(242,212,146);fill-rule:nonzero;"/>
                <path d="M122.834,691.22L97.563,739.318L104.825,739.472L148.389,691.33L122.834,691.22Z" style="fill:rgb(242,212,146);fill-rule:nonzero;"/>
                <path d="M153.644,691.5L197.209,739.642L204.541,739.581L179.226,691.568L153.644,691.5Z" style="fill:rgb(242,212,146);fill-rule:nonzero;"/>
                <path d="M141.948,703.875L148.499,740.137L153.305,740.15L159.408,703.535L149.915,694.043L141.948,703.875Z" style="fill:rgb(242,212,146);fill-rule:nonzero;"/>
                <path d="M128.334,605.93L185.441,605.93L185.441,641.289L128.334,641.289L128.334,605.93ZM244.021,689.135L202.162,674.628C199.187,673.597 196.189,673.928 194.292,675.269L166.614,665.675C166.666,665.136 166.697,664.592 166.697,664.039C166.697,658.766 164.31,654.056 160.562,650.915L195.127,650.915L195.127,596.057L115.417,596.057L115.417,650.915L138.59,650.915C134.842,654.056 132.455,658.766 132.455,664.039C132.455,668.078 133.862,671.784 136.202,674.712L132.611,674.722L131.869,675.682L123.979,685.829L175.472,685.896L165.521,674.635L163.003,674.641C164.094,673.261 164.97,671.708 165.598,670.031L192.324,679.292C192.516,681.889 194.865,684.539 198.313,685.734L240.171,700.24C244.418,701.714 248.721,700.418 249.783,697.354C250.846,694.286 248.267,690.608 244.021,689.135Z" style="fill:rgb(242,212,146);fill-rule:nonzero;"/>
                <path d="M189.072,590.132L170.087,563.519C170.087,563.519 153.475,586.063 150.932,589.962L189.072,590.132Z" style="fill:rgb(242,212,146);fill-rule:nonzero;"/>
            </g>
            <g id="Clap" transform="matrix(1.59948,0,0,0.899707,689.964,211.751)">
                <path d="M100.259,343.242C100.259,349.526 95.166,354.62 88.88,354.62C82.594,354.62 77.502,349.526 77.502,343.242C77.502,336.956 82.594,331.862 88.88,331.862C95.166,331.862 100.259,336.956 100.259,343.242Z" style="fill:rgb(242,212,146);fill-rule:nonzero;"/>
                <path d="M112.977,343.911L97.582,369.122L133.876,369.048L149.791,344.357L112.977,343.911Z" style="fill:rgb(242,212,146);fill-rule:nonzero;"/>
                <path d="M172.102,343.911L156.707,369.122L193.001,369.048L208.916,344.357L172.102,343.911Z" style="fill:rgb(242,212,146);fill-rule:nonzero;"/>
                <path d="M244.223,343.939L244.055,369.122L215.385,369.234L232.23,343.911L244.223,343.939Z" style="fill:rgb(242,212,146);fill-rule:nonzero;"/>
                <path d="M182.641,292.462L203.088,313.782L167.623,321.502L146.775,300.802L182.641,292.462Z" style="fill:rgb(242,212,146);fill-rule:nonzero;"/>
                <path d="M124.067,304.849L145.57,325.105L110.543,334.61L88.673,314.995L124.067,304.849Z" style="fill:rgb(242,212,146);fill-rule:nonzero;"/>
                <path d="M237.184,303.95L230.874,279.567L203.045,286.456L225.56,306.903L237.184,303.95Z" style="fill:rgb(242,212,146);fill-rule:nonzero;"/>
                <path d="M218.955,432.71L110.969,432.71L110.969,396.565L218.955,396.565L218.955,432.71ZM234.572,378.271L95.796,378.271C87.095,379.386 86.872,382.266 86.872,387.195L86.872,441.188C86.872,446.115 90.867,450.112 95.796,450.112L234.572,450.112C239.502,450.112 243.497,446.115 243.497,441.188L243.497,387.195C243.497,382.266 244.166,378.493 234.572,378.271Z" style="fill:rgb(242,212,146);fill-rule:nonzero;"/>
            </g>
            <g id="Pop" transform="matrix(2.57254,0,0,1.44705,343.819,287.863)">
                <path d="M436.826,157.063C435.668,155.27 433.054,152.104 428.97,152.002C425.236,151.908 423.039,155.109 421.959,157.335C421.392,158.509 421.129,159.415 421.129,159.415L418.848,239.393L430.252,239.393L437.523,158.274C437.523,158.274 437.286,157.773 436.826,157.063Z" style="fill:rgb(242,212,146);fill-rule:nonzero;"/>
                <path d="M457.711,151.134C456.551,149.806 454.353,148.432 450.164,148.153C449.551,148.112 448.978,148.117 448.425,148.144C444.253,148.349 441.76,150.343 440.406,151.979C439.437,153.153 439.043,154.141 439.043,154.141L438.813,156.664L431.25,239.49L443.891,239.678L459.002,153.855C459.002,153.855 458.921,152.519 457.711,151.134Z" style="fill:rgb(242,212,146);fill-rule:nonzero;"/>
                <path d="M448.477,132.945C446.617,132.945 444.906,133.594 443.473,134.677C443.429,134.561 443.382,134.446 443.331,134.331C444.053,132.856 444.5,131.186 444.5,129.382C444.5,123.686 440.408,119.07 435.361,119.07C434.574,119.07 433.822,119.217 433.092,119.429C433.092,119.42 433.095,119.411 433.095,119.402C433.095,113.706 429.002,109.091 423.956,109.091C419.82,109.091 416.366,112.212 415.24,116.469C413.808,115.417 412.105,114.793 410.27,114.793C408.362,114.793 406.592,115.457 405.128,116.587C404.124,112.122 400.567,108.806 396.299,108.806C391.347,108.806 387.336,113.259 387.189,118.81C385.67,117.215 383.65,116.219 381.411,116.219C376.714,116.219 372.906,120.516 372.906,125.817C372.906,126.563 372.998,127.283 373.141,127.98C372.176,127.588 371.151,127.339 370.068,127.339C365.022,127.339 360.93,131.954 360.93,137.65C360.93,139.755 361.495,141.706 362.453,143.337C363.438,143.047 364.583,142.827 365.967,142.735C367.781,142.615 369.29,142.84 370.594,143.232C373.285,143.878 373.666,144.069 375.443,145.959C375.395,145.999 375.354,146.046 375.306,146.083C376.589,147.456 377.086,148.723 377.086,148.723L377.419,152.087C378.104,152.278 378.836,152.456 379.596,152.623C380.094,151.741 381.289,149.922 383.153,148.561C387.542,148.44 389.443,148.44 393.9,150.482C394.964,152.063 395.521,153.664 395.668,154.134C395.772,154.134 395.875,154.132 395.978,154.129C396.267,153.24 396.946,152.044 397.941,150.844C401.418,149.202 404.284,148.821 406.741,148.821C411.098,148.821 413.013,148.821 417.565,150.329C417.525,150.352 417.498,150.374 417.456,150.396C417.86,150.853 418.212,151.294 418.511,151.71C419.462,151.904 420.461,152.066 421.495,152.202C421.915,151.336 422.509,150.327 423.292,149.418C426.699,147.87 427.84,147.3 431.065,147.382C433.698,148.362 435.468,150.548 436.361,151.931C437.046,151.813 437.707,151.679 438.348,151.532L438.579,149.008C438.579,149.008 438.972,148.021 439.941,146.848C441.295,145.21 443.788,143.217 447.96,143.012C448.512,142.985 449.086,142.98 449.699,143.021C453.888,143.299 456.086,144.673 457.247,146.001C457.463,145.121 457.615,144.215 457.615,143.257C457.615,137.561 453.523,132.945 448.477,132.945Z" style="fill:rgb(242,212,146);fill-rule:nonzero;"/>
                <path d="M394.18,159.167C394.18,159.167 394.162,159.105 394.133,159.016C393.812,157.996 391.586,151.623 386.339,151.754C381.653,151.872 378.896,156.026 378.061,157.506C377.88,157.826 377.786,158.027 377.786,158.027L385.056,239.145L396.461,239.145L394.18,159.167Z" style="fill:rgb(242,212,146);fill-rule:nonzero;"/>
                <path d="M375.634,157.219L375.301,153.855C375.301,153.855 374.804,152.588 373.521,151.216C372.887,150.536 372.049,149.841 370.997,149.253C369.333,148.322 367.118,147.672 364.182,147.868C362.798,147.959 361.652,148.18 360.667,148.469C355.563,149.973 355.343,153.57 355.343,153.57L370.455,239.393L383.76,239.299L375.634,157.219Z" style="fill:rgb(242,212,146);fill-rule:nonzero;"/>
                <path d="M418.226,156.843C417.927,156.426 417.575,155.985 417.171,155.528C415.28,153.398 412.223,151.1 407.785,151.1C407.718,151.1 407.656,151.108 407.589,151.111C400.624,151.211 396.556,156.606 395.693,159.262C395.612,159.511 395.549,159.745 395.525,159.938C395.24,162.22 398.662,239.393 398.662,239.393L417.052,239.488L419.571,159.083C419.571,159.083 419.132,158.105 418.226,156.843Z" style="fill:rgb(242,212,146);fill-rule:nonzero;"/>
            </g>
        </g>
    </g>
</svg>
