<?xml version="1.0" encoding="utf-8"?>
<svg xmlns="http://www.w3.org/2000/svg" xmlns:xlink="http://www.w3.org/1999/xlink" width="600" height="400" viewBox="0 0 2400 1600">
<defs>
  <clipPath id="clip500">
    <rect x="0" y="0" width="2400" height="1600"/>
  </clipPath>
</defs>
<path clip-path="url(#clip500)" d="
M0 1600 L2400 1600 L2400 0 L0 0  Z
  " fill="#ffffff" fill-rule="evenodd" fill-opacity="1"/>
<defs>
  <clipPath id="clip501">
    <rect x="480" y="0" width="1681" height="1600"/>
  </clipPath>
</defs>
<path clip-path="url(#clip500)" d="
M156.598 1410.22 L2352.76 1410.22 L2352.76 47.2441 L156.598 47.2441  Z
  " fill="#ffffff" fill-rule="evenodd" fill-opacity="1"/>
<defs>
  <clipPath id="clip502">
    <rect x="156" y="47" width="2197" height="1364"/>
  </clipPath>
</defs>
<polyline clip-path="url(#clip500)" style="stroke:#000000; stroke-linecap:butt; stroke-linejoin:round; stroke-width:4; stroke-opacity:1; fill:none" points="
  156.598,1410.22 2352.76,1410.22 
  "/>
<polyline clip-path="url(#clip500)" style="stroke:#000000; stroke-linecap:butt; stroke-linejoin:round; stroke-width:4; stroke-opacity:1; fill:none" points="
  156.598,47.2441 2352.76,47.2441 
  "/>
<polyline clip-path="url(#clip500)" style="stroke:#000000; stroke-linecap:butt; stroke-linejoin:round; stroke-width:4; stroke-opacity:1; fill:none" points="
  156.598,1410.22 156.598,1391.32 
  "/>
<polyline clip-path="url(#clip500)" style="stroke:#000000; stroke-linecap:butt; stroke-linejoin:round; stroke-width:4; stroke-opacity:1; fill:none" points="
  888.651,1410.22 888.651,1391.32 
  "/>
<polyline clip-path="url(#clip500)" style="stroke:#000000; stroke-linecap:butt; stroke-linejoin:round; stroke-width:4; stroke-opacity:1; fill:none" points="
  1620.7,1410.22 1620.7,1391.32 
  "/>
<polyline clip-path="url(#clip500)" style="stroke:#000000; stroke-linecap:butt; stroke-linejoin:round; stroke-width:4; stroke-opacity:1; fill:none" points="
  2352.76,1410.22 2352.76,1391.32 
  "/>
<path clip-path="url(#clip500)" d="M146.98 1468.68 L154.619 1468.68 L154.619 1442.32 L146.309 1443.99 L146.309 1439.73 L154.573 1438.06 L159.249 1438.06 L159.249 1468.68 L166.888 1468.68 L166.888 1472.62 L146.98 1472.62 L146.98 1468.68 Z" fill="#000000" fill-rule="evenodd" fill-opacity="1" /><path clip-path="url(#clip500)" d="M883.304 1468.68 L899.623 1468.68 L899.623 1472.62 L877.679 1472.62 L877.679 1468.68 Q880.341 1465.93 884.924 1461.3 Q889.53 1456.65 890.711 1455.31 Q892.956 1452.78 893.836 1451.05 Q894.739 1449.29 894.739 1447.6 Q894.739 1444.84 892.794 1443.11 Q890.873 1441.37 887.771 1441.37 Q885.572 1441.37 883.118 1442.13 Q880.688 1442.9 877.91 1444.45 L877.91 1439.73 Q880.734 1438.59 883.188 1438.01 Q885.642 1437.43 887.679 1437.43 Q893.049 1437.43 896.243 1440.12 Q899.438 1442.81 899.438 1447.3 Q899.438 1449.43 898.628 1451.35 Q897.841 1453.24 895.734 1455.84 Q895.155 1456.51 892.054 1459.73 Q888.952 1462.92 883.304 1468.68 Z" fill="#000000" fill-rule="evenodd" fill-opacity="1" /><path clip-path="url(#clip500)" d="M1624.95 1453.99 Q1628.31 1454.7 1630.18 1456.97 Q1632.08 1459.24 1632.08 1462.57 Q1632.08 1467.69 1628.56 1470.49 Q1625.04 1473.29 1618.56 1473.29 Q1616.39 1473.29 1614.07 1472.85 Q1611.78 1472.43 1609.33 1471.58 L1609.33 1467.06 Q1611.27 1468.2 1613.59 1468.78 Q1615.9 1469.36 1618.42 1469.36 Q1622.82 1469.36 1625.11 1467.62 Q1627.43 1465.88 1627.43 1462.57 Q1627.43 1459.52 1625.28 1457.81 Q1623.15 1456.07 1619.33 1456.07 L1615.3 1456.07 L1615.3 1452.23 L1619.51 1452.23 Q1622.96 1452.23 1624.79 1450.86 Q1626.62 1449.47 1626.62 1446.88 Q1626.62 1444.22 1624.72 1442.81 Q1622.84 1441.37 1619.33 1441.37 Q1617.4 1441.37 1615.21 1441.79 Q1613.01 1442.2 1610.37 1443.08 L1610.37 1438.92 Q1613.03 1438.18 1615.34 1437.81 Q1617.68 1437.43 1619.74 1437.43 Q1625.07 1437.43 1628.17 1439.87 Q1631.27 1442.27 1631.27 1446.39 Q1631.27 1449.26 1629.63 1451.25 Q1627.98 1453.22 1624.95 1453.99 Z" fill="#000000" fill-rule="evenodd" fill-opacity="1" /><path clip-path="url(#clip500)" d="M2355.77 1442.13 L2343.96 1460.58 L2355.77 1460.58 L2355.77 1442.13 M2354.54 1438.06 L2360.42 1438.06 L2360.42 1460.58 L2365.35 1460.58 L2365.35 1464.47 L2360.42 1464.47 L2360.42 1472.62 L2355.77 1472.62 L2355.77 1464.47 L2340.16 1464.47 L2340.16 1459.96 L2354.54 1438.06 Z" fill="#000000" fill-rule="evenodd" fill-opacity="1" /><path clip-path="url(#clip500)" d="M1272.32 1512.14 L1272.32 1520.12 Q1267.66 1517.89 1263.53 1516.8 Q1259.4 1515.71 1255.55 1515.71 Q1248.86 1515.71 1245.22 1518.3 Q1241.61 1520.89 1241.61 1525.67 Q1241.61 1529.68 1244 1531.75 Q1246.43 1533.77 1253.16 1535.03 L1258.1 1536.04 Q1267.26 1537.78 1271.59 1542.2 Q1275.96 1546.57 1275.96 1553.95 Q1275.96 1562.74 1270.05 1567.27 Q1264.18 1571.81 1252.79 1571.81 Q1248.5 1571.81 1243.64 1570.84 Q1238.82 1569.87 1233.63 1567.96 L1233.63 1559.54 Q1238.62 1562.33 1243.4 1563.75 Q1248.18 1565.17 1252.79 1565.17 Q1259.8 1565.17 1263.61 1562.41 Q1267.42 1559.66 1267.42 1554.55 Q1267.42 1550.1 1264.66 1547.59 Q1261.95 1545.07 1255.71 1543.82 L1250.73 1542.85 Q1241.57 1541.02 1237.48 1537.13 Q1233.39 1533.25 1233.39 1526.32 Q1233.39 1518.3 1239.02 1513.68 Q1244.69 1509.06 1254.62 1509.06 Q1258.87 1509.06 1263.29 1509.83 Q1267.7 1510.6 1272.32 1512.14 Z" fill="#000000" fill-rule="evenodd" fill-opacity="1" /><polyline clip-path="url(#clip500)" style="stroke:#000000; stroke-linecap:butt; stroke-linejoin:round; stroke-width:4; stroke-opacity:1; fill:none" points="
  156.598,1410.22 156.598,47.2441 
  "/>
<polyline clip-path="url(#clip500)" style="stroke:#000000; stroke-linecap:butt; stroke-linejoin:round; stroke-width:4; stroke-opacity:1; fill:none" points="
  2352.76,1410.22 2352.76,47.2441 
  "/>
<polyline clip-path="url(#clip500)" style="stroke:#000000; stroke-linecap:butt; stroke-linejoin:round; stroke-width:4; stroke-opacity:1; fill:none" points="
  156.598,1242.45 175.496,1242.45 
  "/>
<polyline clip-path="url(#clip500)" style="stroke:#000000; stroke-linecap:butt; stroke-linejoin:round; stroke-width:4; stroke-opacity:1; fill:none" points="
  156.598,981.374 175.496,981.374 
  "/>
<polyline clip-path="url(#clip500)" style="stroke:#000000; stroke-linecap:butt; stroke-linejoin:round; stroke-width:4; stroke-opacity:1; fill:none" points="
  156.598,720.297 175.496,720.297 
  "/>
<polyline clip-path="url(#clip500)" style="stroke:#000000; stroke-linecap:butt; stroke-linejoin:round; stroke-width:4; stroke-opacity:1; fill:none" points="
  156.598,459.22 175.496,459.22 
  "/>
<polyline clip-path="url(#clip500)" style="stroke:#000000; stroke-linecap:butt; stroke-linejoin:round; stroke-width:4; stroke-opacity:1; fill:none" points="
  156.598,198.143 175.496,198.143 
  "/>
<path clip-path="url(#clip500)" d="M65.0198 1228.25 Q61.4087 1228.25 59.58 1231.81 Q57.7745 1235.36 57.7745 1242.49 Q57.7745 1249.59 59.58 1253.16 Q61.4087 1256.7 65.0198 1256.7 Q68.6541 1256.7 70.4596 1253.16 Q72.2883 1249.59 72.2883 1242.49 Q72.2883 1235.36 70.4596 1231.81 Q68.6541 1228.25 65.0198 1228.25 M65.0198 1224.55 Q70.83 1224.55 73.8855 1229.15 Q76.9642 1233.74 76.9642 1242.49 Q76.9642 1251.21 73.8855 1255.82 Q70.83 1260.4 65.0198 1260.4 Q59.2097 1260.4 56.131 1255.82 Q53.0754 1251.21 53.0754 1242.49 Q53.0754 1233.74 56.131 1229.15 Q59.2097 1224.55 65.0198 1224.55 Z" fill="#000000" fill-rule="evenodd" fill-opacity="1" /><path clip-path="url(#clip500)" d="M85.1818 1253.85 L90.066 1253.85 L90.066 1259.73 L85.1818 1259.73 L85.1818 1253.85 Z" fill="#000000" fill-rule="evenodd" fill-opacity="1" /><path clip-path="url(#clip500)" d="M104.279 1255.8 L120.598 1255.8 L120.598 1259.73 L98.6539 1259.73 L98.6539 1255.8 Q101.316 1253.04 105.899 1248.41 Q110.506 1243.76 111.686 1242.42 Q113.932 1239.89 114.811 1238.16 Q115.714 1236.4 115.714 1234.71 Q115.714 1231.95 113.77 1230.22 Q111.848 1228.48 108.746 1228.48 Q106.547 1228.48 104.094 1229.25 Q101.663 1230.01 98.8854 1231.56 L98.8854 1226.84 Q101.709 1225.7 104.163 1225.12 Q106.617 1224.55 108.654 1224.55 Q114.024 1224.55 117.219 1227.23 Q120.413 1229.92 120.413 1234.41 Q120.413 1236.54 119.603 1238.46 Q118.816 1240.36 116.709 1242.95 Q116.131 1243.62 113.029 1246.84 Q109.927 1250.03 104.279 1255.8 Z" fill="#000000" fill-rule="evenodd" fill-opacity="1" /><path clip-path="url(#clip500)" d="M62.9365 967.173 Q59.3254 967.173 57.4967 970.738 Q55.6912 974.279 55.6912 981.409 Q55.6912 988.515 57.4967 992.08 Q59.3254 995.622 62.9365 995.622 Q66.5707 995.622 68.3763 992.08 Q70.205 988.515 70.205 981.409 Q70.205 974.279 68.3763 970.738 Q66.5707 967.173 62.9365 967.173 M62.9365 963.469 Q68.7467 963.469 71.8022 968.076 Q74.8809 972.659 74.8809 981.409 Q74.8809 990.136 71.8022 994.742 Q68.7467 999.325 62.9365 999.325 Q57.1264 999.325 54.0477 994.742 Q50.9921 990.136 50.9921 981.409 Q50.9921 972.659 54.0477 968.076 Q57.1264 963.469 62.9365 963.469 Z" fill="#000000" fill-rule="evenodd" fill-opacity="1" /><path clip-path="url(#clip500)" d="M83.0984 992.774 L87.9827 992.774 L87.9827 998.654 L83.0984 998.654 L83.0984 992.774 Z" fill="#000000" fill-rule="evenodd" fill-opacity="1" /><path clip-path="url(#clip500)" d="M111.015 968.168 L99.2095 986.617 L111.015 986.617 L111.015 968.168 M109.788 964.094 L115.668 964.094 L115.668 986.617 L120.598 986.617 L120.598 990.506 L115.668 990.506 L115.668 998.654 L111.015 998.654 L111.015 990.506 L95.4132 990.506 L95.4132 985.992 L109.788 964.094 Z" fill="#000000" fill-rule="evenodd" fill-opacity="1" /><path clip-path="url(#clip500)" d="M63.2606 706.096 Q59.6495 706.096 57.8208 709.661 Q56.0152 713.202 56.0152 720.332 Q56.0152 727.438 57.8208 731.003 Q59.6495 734.545 63.2606 734.545 Q66.8948 734.545 68.7004 731.003 Q70.5291 727.438 70.5291 720.332 Q70.5291 713.202 68.7004 709.661 Q66.8948 706.096 63.2606 706.096 M63.2606 702.392 Q69.0707 702.392 72.1263 706.999 Q75.205 711.582 75.205 720.332 Q75.205 729.059 72.1263 733.665 Q69.0707 738.248 63.2606 738.248 Q57.4504 738.248 54.3717 733.665 Q51.3162 729.059 51.3162 720.332 Q51.3162 711.582 54.3717 706.999 Q57.4504 702.392 63.2606 702.392 Z" fill="#000000" fill-rule="evenodd" fill-opacity="1" /><path clip-path="url(#clip500)" d="M83.4225 731.697 L88.3067 731.697 L88.3067 737.577 L83.4225 737.577 L83.4225 731.697 Z" fill="#000000" fill-rule="evenodd" fill-opacity="1" /><path clip-path="url(#clip500)" d="M109.071 718.434 Q105.922 718.434 104.071 720.586 Q102.242 722.739 102.242 726.489 Q102.242 730.216 104.071 732.392 Q105.922 734.545 109.071 734.545 Q112.219 734.545 114.047 732.392 Q115.899 730.216 115.899 726.489 Q115.899 722.739 114.047 720.586 Q112.219 718.434 109.071 718.434 M118.353 703.781 L118.353 708.04 Q116.594 707.207 114.788 706.767 Q113.006 706.327 111.246 706.327 Q106.617 706.327 104.163 709.452 Q101.733 712.577 101.385 718.897 Q102.751 716.883 104.811 715.818 Q106.871 714.73 109.348 714.73 Q114.557 714.73 117.566 717.901 Q120.598 721.049 120.598 726.489 Q120.598 731.813 117.45 735.031 Q114.302 738.248 109.071 738.248 Q103.075 738.248 99.9039 733.665 Q96.7326 729.059 96.7326 720.332 Q96.7326 712.137 100.621 707.276 Q104.51 702.392 111.061 702.392 Q112.82 702.392 114.603 702.739 Q116.408 703.087 118.353 703.781 Z" fill="#000000" fill-rule="evenodd" fill-opacity="1" /><path clip-path="url(#clip500)" d="M63.5152 445.019 Q59.9041 445.019 58.0754 448.584 Q56.2699 452.125 56.2699 459.255 Q56.2699 466.361 58.0754 469.926 Q59.9041 473.468 63.5152 473.468 Q67.1494 473.468 68.955 469.926 Q70.7837 466.361 70.7837 459.255 Q70.7837 452.125 68.955 448.584 Q67.1494 445.019 63.5152 445.019 M63.5152 441.315 Q69.3254 441.315 72.3809 445.921 Q75.4596 450.505 75.4596 459.255 Q75.4596 467.982 72.3809 472.588 Q69.3254 477.171 63.5152 477.171 Q57.7051 477.171 54.6264 472.588 Q51.5708 467.982 51.5708 459.255 Q51.5708 450.505 54.6264 445.921 Q57.7051 441.315 63.5152 441.315 Z" fill="#000000" fill-rule="evenodd" fill-opacity="1" /><path clip-path="url(#clip500)" d="M83.6771 470.62 L88.5614 470.62 L88.5614 476.5 L83.6771 476.5 L83.6771 470.62 Z" fill="#000000" fill-rule="evenodd" fill-opacity="1" /><path clip-path="url(#clip500)" d="M108.746 460.088 Q105.413 460.088 103.492 461.87 Q101.594 463.653 101.594 466.778 Q101.594 469.903 103.492 471.685 Q105.413 473.468 108.746 473.468 Q112.08 473.468 114.001 471.685 Q115.922 469.88 115.922 466.778 Q115.922 463.653 114.001 461.87 Q112.103 460.088 108.746 460.088 M104.071 458.097 Q101.061 457.357 99.3715 455.296 Q97.7048 453.236 97.7048 450.273 Q97.7048 446.13 100.645 443.722 Q103.608 441.315 108.746 441.315 Q113.908 441.315 116.848 443.722 Q119.788 446.13 119.788 450.273 Q119.788 453.236 118.098 455.296 Q116.432 457.357 113.445 458.097 Q116.825 458.884 118.7 461.176 Q120.598 463.468 120.598 466.778 Q120.598 471.801 117.52 474.486 Q114.464 477.171 108.746 477.171 Q103.029 477.171 99.9502 474.486 Q96.8947 471.801 96.8947 466.778 Q96.8947 463.468 98.7928 461.176 Q100.691 458.884 104.071 458.097 M102.358 450.713 Q102.358 453.398 104.024 454.903 Q105.714 456.408 108.746 456.408 Q111.756 456.408 113.445 454.903 Q115.158 453.398 115.158 450.713 Q115.158 448.028 113.445 446.523 Q111.756 445.019 108.746 445.019 Q105.714 445.019 104.024 446.523 Q102.358 448.028 102.358 450.713 Z" fill="#000000" fill-rule="evenodd" fill-opacity="1" /><path clip-path="url(#clip500)" d="M54.2328 211.488 L61.8717 211.488 L61.8717 185.122 L53.5616 186.789 L53.5616 182.53 L61.8254 180.863 L66.5013 180.863 L66.5013 211.488 L74.1402 211.488 L74.1402 215.423 L54.2328 215.423 L54.2328 211.488 Z" fill="#000000" fill-rule="evenodd" fill-opacity="1" /><path clip-path="url(#clip500)" d="M83.5845 209.543 L88.4688 209.543 L88.4688 215.423 L83.5845 215.423 L83.5845 209.543 Z" fill="#000000" fill-rule="evenodd" fill-opacity="1" /><path clip-path="url(#clip500)" d="M108.654 183.942 Q105.043 183.942 103.214 187.506 Q101.409 191.048 101.409 198.178 Q101.409 205.284 103.214 208.849 Q105.043 212.391 108.654 212.391 Q112.288 212.391 114.094 208.849 Q115.922 205.284 115.922 198.178 Q115.922 191.048 114.094 187.506 Q112.288 183.942 108.654 183.942 M108.654 180.238 Q114.464 180.238 117.52 184.844 Q120.598 189.428 120.598 198.178 Q120.598 206.905 117.52 211.511 Q114.464 216.094 108.654 216.094 Q102.844 216.094 99.765 211.511 Q96.7095 206.905 96.7095 198.178 Q96.7095 189.428 99.765 184.844 Q102.844 180.238 108.654 180.238 Z" fill="#000000" fill-rule="evenodd" fill-opacity="1" /><polyline clip-path="url(#clip502)" style="stroke:#0000ff; stroke-linecap:butt; stroke-linejoin:round; stroke-width:36; stroke-opacity:0.8; fill:none" points="
  156.598,1371.65 156.696,1371.64 156.844,1371.64 157.062,1371.64 157.385,1371.64 157.862,1371.64 158.57,1371.63 159.616,1371.63 161.166,1371.62 163.459,1371.61 
  166.565,1371.59 169.671,1371.57 172.777,1371.55 175.883,1371.53 178.989,1371.51 182.094,1371.49 185.2,1371.48 188.306,1371.46 191.412,1371.44 194.518,1371.42 
  197.623,1371.4 200.729,1371.38 203.835,1371.36 206.941,1371.34 210.047,1371.32 213.153,1371.3 216.258,1371.27 219.364,1371.25 222.47,1371.23 225.576,1371.21 
  228.682,1371.19 231.787,1371.17 234.893,1371.15 237.999,1371.12 241.105,1371.1 244.211,1371.08 247.316,1371.06 250.422,1371.03 253.528,1371.01 256.634,1370.99 
  259.74,1370.96 262.846,1370.94 265.951,1370.92 269.057,1370.89 272.163,1370.87 275.269,1370.84 278.375,1370.82 281.48,1370.79 284.586,1370.77 287.692,1370.74 
  290.798,1370.72 293.904,1370.69 297.009,1370.66 300.115,1370.64 303.221,1370.61 306.327,1370.58 309.433,1370.56 312.538,1370.53 315.644,1370.5 318.75,1370.48 
  321.856,1370.45 324.962,1370.42 328.067,1370.39 331.173,1370.36 334.279,1370.33 337.385,1370.31 340.491,1370.28 343.596,1370.25 346.702,1370.22 349.808,1370.19 
  352.914,1370.16 356.019,1370.13 359.125,1370.1 362.231,1370.06 365.337,1370.03 368.443,1370 371.548,1369.97 374.654,1369.94 377.76,1369.91 380.866,1369.87 
  383.972,1369.84 387.077,1369.81 390.183,1369.78 393.289,1369.74 396.395,1369.71 399.5,1369.67 402.606,1369.64 405.712,1369.61 408.818,1369.57 411.924,1369.54 
  415.029,1369.5 418.135,1369.46 421.241,1369.43 424.347,1369.39 427.452,1369.36 430.558,1369.32 433.664,1369.28 436.77,1369.24 439.875,1369.21 442.981,1369.17 
  446.087,1369.13 449.193,1369.09 452.299,1369.05 455.404,1369.01 458.51,1368.97 461.616,1368.93 464.722,1368.89 467.827,1368.85 470.933,1368.81 474.039,1368.77 
  477.145,1368.73 480.25,1368.69 483.356,1368.65 486.462,1368.61 489.568,1368.56 492.673,1368.52 495.779,1368.48 498.885,1368.43 501.99,1368.39 505.096,1368.34 
  508.202,1368.3 511.308,1368.25 514.413,1368.21 517.519,1368.16 520.625,1368.12 523.731,1368.07 526.836,1368.02 529.942,1367.98 533.048,1367.93 536.153,1367.88 
  539.259,1367.83 542.365,1367.79 545.471,1367.74 548.576,1367.69 551.682,1367.64 554.788,1367.59 557.893,1367.54 560.999,1367.49 564.105,1367.43 567.211,1367.38 
  570.316,1367.33 573.422,1367.28 576.528,1367.23 579.633,1367.17 582.739,1367.12 585.845,1367.06 588.95,1367.01 592.056,1366.95 595.162,1366.9 598.267,1366.84 
  601.373,1366.79 604.479,1366.73 607.584,1366.67 610.69,1366.61 613.796,1366.56 616.901,1366.5 620.007,1366.44 623.113,1366.38 626.218,1366.32 629.324,1366.26 
  632.43,1366.2 635.535,1366.14 638.641,1366.08 641.747,1366.01 644.852,1365.95 647.958,1365.89 651.064,1365.82 654.169,1365.76 657.275,1365.69 660.38,1365.63 
  663.486,1365.56 666.592,1365.5 669.697,1365.43 672.803,1365.36 675.908,1365.29 679.014,1365.23 682.12,1365.16 685.225,1365.09 688.331,1365.02 691.436,1364.95 
  694.542,1364.87 697.648,1364.8 700.753,1364.73 703.859,1364.66 706.964,1364.58 710.07,1364.51 713.175,1364.43 716.281,1364.36 719.386,1364.28 722.492,1364.2 
  725.598,1364.13 728.703,1364.05 731.809,1363.97 734.914,1363.89 738.02,1363.81 741.125,1363.73 744.231,1363.65 747.336,1363.57 750.442,1363.48 753.547,1363.4 
  756.653,1363.32 759.758,1363.23 762.864,1363.15 765.969,1363.06 769.074,1362.97 772.18,1362.88 775.285,1362.8 778.391,1362.71 781.496,1362.62 784.602,1362.53 
  787.707,1362.43 790.812,1362.34 793.918,1362.25 797.023,1362.15 800.129,1362.06 803.234,1361.96 806.339,1361.87 809.445,1361.77 812.55,1361.67 815.655,1361.57 
  818.761,1361.47 821.866,1361.37 824.971,1361.27 828.077,1361.17 831.182,1361.06 834.287,1360.96 837.392,1360.85 840.498,1360.75 843.603,1360.64 846.708,1360.53 
  849.813,1360.42 852.919,1360.31 856.024,1360.2 859.129,1360.09 862.234,1359.97 865.339,1359.86 868.445,1359.74 871.55,1359.62 874.655,1359.51 877.76,1359.39 
  880.865,1359.27 883.97,1359.14 887.075,1359.02 890.18,1358.9 893.285,1358.77 896.39,1358.65 899.495,1358.52 902.6,1358.39 905.705,1358.26 908.81,1358.13 
  911.915,1357.99 915.02,1357.86 918.125,1357.72 921.23,1357.59 924.335,1357.45 927.44,1357.31 930.544,1357.17 933.649,1357.02 936.754,1356.88 939.859,1356.73 
  942.964,1356.59 946.068,1356.44 949.173,1356.29 952.278,1356.13 955.382,1355.98 958.487,1355.82 961.591,1355.67 964.696,1355.51 967.8,1355.34 970.905,1355.18 
  974.009,1355.02 977.114,1354.85 980.218,1354.68 983.323,1354.51 986.427,1354.34 989.531,1354.16 992.635,1353.99 995.74,1353.81 998.844,1353.62 1001.95,1353.44 
  1005.05,1353.25 1008.16,1353.07 1011.26,1352.88 1014.36,1352.68 1017.47,1352.49 1020.57,1352.29 1023.68,1352.09 1026.78,1351.88 1029.88,1351.68 1032.99,1351.47 
  1036.09,1351.26 1039.19,1351.04 1042.3,1350.83 1045.4,1350.61 1048.5,1350.38 1051.61,1350.15 1054.71,1349.92 1057.81,1349.69 1060.92,1349.45 1064.02,1349.21 
  1067.12,1348.97 1070.22,1348.72 1073.33,1348.47 1076.43,1348.21 1079.53,1347.95 1082.63,1347.69 1085.74,1347.42 1088.84,1347.14 1091.94,1346.87 1095.04,1346.58 
  1098.14,1346.3 1101.25,1346 1104.35,1345.71 1107.45,1345.4 1110.55,1345.09 1113.65,1344.78 1116.75,1344.46 1119.85,1344.13 1122.95,1343.8 1126.05,1343.46 
  1129.15,1343.11 1132.25,1342.76 1135.35,1342.39 1138.45,1342.02 1141.55,1341.65 1144.65,1341.26 1147.74,1340.86 1150.84,1340.46 1153.94,1340.04 1157.03,1339.62 
  1160.13,1339.18 1163.23,1338.74 1166.32,1338.28 1169.42,1337.8 1172.51,1337.32 1175.6,1336.82 1178.7,1336.3 1181.79,1335.77 1184.88,1335.22 1187.97,1334.66 
  1191.06,1334.07 1194.14,1333.46 1197.23,1332.83 1200.31,1332.18 1203.39,1331.49 1206.47,1330.78 1209.55,1330.04 1212.63,1329.26 1215.7,1328.44 1218.77,1327.57 
  1221.83,1326.66 1224.89,1325.68 1227.94,1324.65 1230.98,1323.53 1234.01,1322.32 1237.03,1321.01 1240.02,1319.55 1242.99,1317.92 1245.91,1316.05 1248.76,1313.85 
  1251.47,1311.14 1253.83,1307.54 1255.13,1302.46 
  "/>
<polyline clip-path="url(#clip502)" style="stroke:#ff0000; stroke-linecap:butt; stroke-linejoin:round; stroke-width:36; stroke-opacity:0.8; fill:none" stroke-dasharray="18, 36" points="
  1255.13,1302.46 1255.14,1301.86 1254.16,1296.57 1252.38,1292.79 1249.74,1288.87 1247.43,1286.08 1244.46,1282.95 1242,1280.61 1238.9,1277.88 1236.37,1275.78 
  1233.2,1273.29 1230.64,1271.36 1227.43,1269.03 1224.84,1267.2 1221.61,1264.99 1219,1263.25 1215.75,1261.12 1213.13,1259.44 1209.86,1257.38 1207.23,1255.75 
  1203.96,1253.74 1201.32,1252.14 1198.04,1250.18 1195.39,1248.61 1192.11,1246.68 1189.46,1245.14 1186.16,1243.23 1183.51,1241.71 1180.21,1239.83 1177.56,1238.32 
  1174.26,1236.46 1171.6,1234.96 1168.3,1233.11 1165.64,1231.62 1162.34,1229.78 1159.68,1228.3 1156.37,1226.47 1153.71,1225 1150.4,1223.17 1147.74,1221.7 
  1144.44,1219.88 1141.77,1218.41 1138.47,1216.59 1135.8,1215.12 1132.5,1213.3 1129.83,1211.83 1126.53,1210.01 1123.86,1208.54 1120.56,1206.71 1117.9,1205.24 
  1114.59,1203.41 1111.93,1201.93 1108.63,1200.1 1105.96,1198.62 1102.66,1196.78 1100,1195.29 1096.7,1193.44 1094.04,1191.95 1090.74,1190.1 1088.08,1188.6 
  1084.78,1186.73 1082.13,1185.22 1078.83,1183.35 1076.18,1181.83 1072.88,1179.95 1070.23,1178.43 1066.93,1176.53 1064.28,1175 1060.99,1173.09 1058.34,1171.54 
  1055.05,1169.62 1052.41,1168.07 1049.12,1166.13 1046.47,1164.57 1043.19,1162.62 1040.55,1161.04 1037.27,1159.08 1034.63,1157.49 1031.35,1155.51 1028.71,1153.91 
  1025.43,1151.91 1022.8,1150.29 1019.53,1148.28 1016.89,1146.65 1013.63,1144.62 1011,1142.98 1007.73,1140.93 1005.1,1139.27 1001.84,1137.2 999.218,1135.53 
  995.961,1133.44 993.339,1131.75 990.086,1129.65 987.468,1127.94 984.22,1125.82 981.605,1124.09 978.361,1121.94 975.75,1120.2 972.51,1118.03 969.903,1116.28 
  966.668,1114.08 964.065,1112.31 960.835,1110.09 958.236,1108.3 955.011,1106.06 952.416,1104.24 949.197,1101.98 946.606,1100.14 943.392,1097.85 940.806,1096 
  937.598,1093.68 935.017,1091.81 931.815,1089.47 929.239,1087.57 926.043,1085.2 923.472,1083.28 920.283,1080.88 917.718,1078.94 914.536,1076.51 911.975,1074.55 
  908.8,1072.09 906.246,1070.1 903.078,1067.62 900.53,1065.61 897.37,1063.09 894.828,1061.05 891.676,1058.5 889.141,1056.44 885.997,1053.86 883.469,1051.76 
  880.334,1049.15 877.812,1047.03 874.686,1044.38 872.172,1042.24 869.056,1039.56 866.549,1037.38 863.442,1034.66 860.944,1032.46 857.848,1029.7 855.358,1027.47 
  852.272,1024.67 849.791,1022.41 846.716,1019.58 844.244,1017.28 841.18,1014.41 838.718,1012.08 835.666,1009.17 833.214,1006.81 830.175,1003.86 827.733,1001.46 
  824.707,998.465 822.276,996.035 819.264,992.995 816.844,990.53 813.846,987.446 811.438,984.944 808.455,981.814 806.059,979.274 803.092,976.098 800.709,973.52 
  797.758,970.295 795.388,967.678 792.455,964.404 790.099,961.747 787.183,958.422 784.843,955.724 781.946,952.347 779.621,949.607 776.743,946.177 774.434,943.393 
  771.578,939.909 769.286,937.081 766.451,933.541 764.177,930.667 761.364,927.07 759.109,924.15 756.321,920.494 754.085,917.526 751.322,913.81 749.107,910.794 
  746.37,907.016 744.177,903.949 741.467,900.109 739.297,896.991 736.617,893.086 734.471,889.915 731.821,885.944 729.701,882.719 727.083,878.68 724.99,875.401 
  722.406,871.293 720.341,867.957 717.794,863.777 715.758,860.384 713.249,856.132 711.244,852.679 708.775,848.353 706.804,844.84 704.378,840.439 702.442,836.864 
  700.06,832.385 698.162,828.748 695.827,824.19 693.968,820.489 691.684,815.85 689.867,812.084 687.636,807.363 685.863,803.531 683.688,798.727 681.962,794.827 
  679.848,789.939 678.171,785.971 676.12,780.997 674.496,776.96 672.513,771.899 670.945,767.793 669.033,762.645 667.525,758.468 665.69,753.233 664.245,748.986 
  662.49,743.664 661.112,739.347 659.443,733.937 658.136,729.55 656.558,724.054 655.326,719.598 653.845,714.017 652.694,709.494 651.315,703.83 650.248,699.242 
  648.978,693.497 648.001,688.846 646.845,683.024 645.963,678.314 644.928,672.419 644.146,667.654 643.238,661.693 642.561,656.877 641.787,650.855 641.22,645.995 
  640.586,639.921 640.134,635.023 639.645,628.906 639.313,623.978 638.976,617.828 638.767,612.879 638.586,606.708 638.504,601.748 638.48,597.215 638.525,591.033 
  
  "/>
<polyline clip-path="url(#clip502)" style="stroke:#0000ff; stroke-linecap:butt; stroke-linejoin:round; stroke-width:36; stroke-opacity:0.8; fill:none" points="
  638.525,591.033 638.568,588.611 638.699,583.656 638.945,577.489 639.209,572.551 639.621,566.411 640.019,561.503 640.598,555.406 641.129,550.538 641.874,544.497 
  642.537,539.682 643.445,533.712 644.237,528.96 645.305,523.074 646.224,518.396 647.447,512.606 648.488,508.01 649.861,502.327 651.019,497.822 652.535,492.255 
  653.805,487.847 655.458,482.404 656.833,478.099 658.615,472.787 660.091,468.589 661.994,463.412 663.563,459.324 665.58,454.284 667.237,450.309 669.36,445.409 
  671.099,441.546 673.321,436.787 675.135,433.037 677.448,428.418 679.332,424.779 681.73,420.299 683.679,416.771 686.155,412.428 688.164,409.009 690.712,404.799 
  692.776,401.486 695.39,397.407 697.505,394.198 700.18,390.247 702.341,387.139 705.073,383.311 707.277,380.3 710.06,376.593 712.304,373.676 715.135,370.085 
  717.415,367.259 720.289,363.78 722.602,361.043 725.517,357.671 727.862,355.019 730.813,351.751 733.186,349.181 736.172,346.013 738.571,343.521 741.589,340.45 
  744.012,338.034 747.059,335.055 749.504,332.712 752.578,329.822 755.044,327.549 758.142,324.745 760.627,322.538 763.749,319.817 766.252,317.675 769.395,315.033 
  771.914,312.953 775.077,310.386 777.611,308.366 780.792,305.873 783.34,303.91 786.539,301.487 789.1,299.579 792.314,297.224 794.888,295.369 798.117,293.079 
  800.702,291.275 803.944,289.047 806.54,287.292 809.795,285.125 812.401,283.417 815.668,281.308 818.283,279.646 821.562,277.592 824.185,275.974 827.474,273.974 
  830.105,272.398 833.404,270.45 836.043,268.914 839.351,267.017 841.997,265.52 845.314,263.671 847.967,262.212 851.291,260.409 853.95,258.987 857.282,257.229 
  859.947,255.842 863.287,254.127 865.957,252.774 869.303,251.101 871.978,249.781 875.33,248.149 878.01,246.86 881.369,245.267 884.053,244.009 887.417,242.454 
  890.106,241.226 893.475,239.707 896.168,238.507 899.543,237.023 902.239,235.852 905.618,234.402 908.319,233.258 911.702,231.841 914.406,230.723 917.793,229.338 
  920.5,228.245 923.892,226.891 926.602,225.822 929.997,224.499 932.71,223.454 936.109,222.159 938.824,221.137 942.226,219.871 944.945,218.871 948.35,217.632 
  951.071,216.654 954.479,215.442 957.202,214.484 960.613,213.298 963.339,212.361 966.753,211.2 969.48,210.282 972.896,209.146 975.626,208.247 979.045,207.134 
  981.776,206.254 985.197,205.164 987.93,204.302 991.354,203.234 994.089,202.39 997.514,201.344 1000.25,200.517 1003.68,199.492 1006.42,198.681 1009.85,197.677 
  1012.59,196.882 1016.02,195.898 1018.76,195.119 1022.19,194.154 1024.93,193.39 1028.37,192.444 1031.11,191.696 1034.55,190.768 1037.29,190.034 1040.73,189.123 
  1043.48,188.404 1046.92,187.511 1049.66,186.805 1053.1,185.929 1055.85,185.236 1059.29,184.377 1062.04,183.697 1065.49,182.854 1068.24,182.187 1071.68,181.359 
  1074.43,180.705 1077.88,179.893 1080.63,179.25 1084.08,178.453 1086.83,177.822 1090.28,177.039 1093.03,176.42 1096.48,175.652 1099.23,175.043 1102.68,174.289 
  1105.44,173.692 1108.89,172.95 1111.64,172.364 1115.09,171.636 1117.85,171.06 1121.3,170.345 1124.06,169.779 1127.51,169.076 1130.27,168.52 1133.73,167.83 
  1136.48,167.284 1139.94,166.605 1142.7,166.068 1146.15,165.402 1148.91,164.874 1152.37,164.219 1155.13,163.7 1158.59,163.056 1161.35,162.546 1164.8,161.913 
  1167.57,161.412 1171.02,160.79 1173.78,160.297 1177.24,159.685 1180.01,159.2 1183.46,158.599 1186.23,158.122 1189.69,157.53 1192.45,157.062 1195.91,156.48 
  1198.67,156.019 1202.13,155.446 1204.9,154.993 1208.36,154.43 1211.12,153.984 1214.58,153.43 1217.35,152.991 1220.81,152.446 1223.58,152.014 1227.04,151.478 
  1229.8,151.053 1233.27,150.525 1236.03,150.107 1239.5,149.587 1242.26,149.176 1245.72,148.665 1248.49,148.26 1251.96,147.757 1254.72,147.358 1258.19,146.863 
  1260.95,146.47 1264.42,145.982 1267.18,145.596 1270.65,145.116 1273.42,144.735 1276.88,144.263 1279.65,143.888 1283.12,143.423 1285.88,143.054 1289.35,142.596 
  1292.12,142.232 1295.58,141.781 1298.35,141.423 1301.82,140.978 1304.59,140.626 1308.05,140.188 1310.82,139.841 1314.29,139.41 1317.06,139.068 1320.53,138.643 
  1323.29,138.306 1326.76,137.887 1329.53,137.555 1333,137.143 1335.77,136.816 1339.24,136.409 1342.01,136.087 1345.47,135.687 1348.24,135.369 1351.71,134.974 
  1354.48,134.662 1357.95,134.273 1360.72,133.964 1364.19,133.581 1366.96,133.277 1370.43,132.899 1373.2,132.599 1376.67,132.227 1379.44,131.931 1382.91,131.564 
  1385.68,131.273 1389.15,130.911 1391.92,130.624 1395.39,130.267 1398.16,129.984 1401.63,129.632 1404.4,129.353 1407.87,129.006 1410.64,128.731 1414.11,128.389 
  1416.88,128.117 1420.35,127.78 1423.13,127.512 1426.6,127.179 1429.37,126.916 1432.84,126.587 1435.61,126.327 1439.08,126.003 1441.85,125.746 1445.32,125.427 
  1448.09,125.174 1451.57,124.859 1454.34,124.609 1457.81,124.298 1460.58,124.052 1464.05,123.745 1466.82,123.502 1470.3,123.2 1473.07,122.96 1476.54,122.661 
  1479.31,122.425 1482.78,122.13 1485.56,121.896 1489.03,121.606 1491.8,121.375 1495.27,121.089 1498.04,120.861 1501.52,120.578 1504.29,120.354 1507.76,120.074 
  1510.53,119.853 1514.01,119.577 1516.78,119.359 1520.25,119.087 1523.02,118.871 1526.5,118.602 1529.27,118.389 1532.74,118.124 1535.51,117.914 1538.99,117.652 
  1541.76,117.444 1545.23,117.186 1548,116.981 1551.48,116.726 1554.25,116.524 1557.72,116.272 1560.5,116.072 1563.97,115.823 1566.74,115.626 1570.21,115.381 
  1572.99,115.186 1576.46,114.943 1579.23,114.751 1582.71,114.511 1585.48,114.321 1588.95,114.085 1591.73,113.897 1595.2,113.664 1597.97,113.479 1601.45,113.248 
  1604.22,113.065 1607.69,112.837 1610.47,112.657 1613.94,112.432 1616.71,112.253 1620.19,112.031 1622.96,111.854 1626.43,111.635 1629.21,111.461 1632.68,111.244 
  1635.45,111.072 1638.93,110.858 1641.7,110.688 1645.18,110.476 1647.95,110.308 1651.42,110.099 1654.2,109.933 1657.67,109.726 1660.44,109.562 1663.92,109.358 
  1666.69,109.196 1670.17,108.994 1672.94,108.834 1676.41,108.635 1679.19,108.477 1682.66,108.28 1685.44,108.124 1688.91,107.929 1691.68,107.774 1695.16,107.582 
  1697.93,107.429 1701.4,107.239 1704.18,107.088 1707.65,106.9 1710.43,106.751 1713.9,106.566 1716.68,106.418 1720.15,106.235 1722.92,106.089 1726.4,105.907 
  1729.17,105.763 1732.65,105.584 1735.42,105.442 1738.89,105.264 1741.67,105.124 1745.14,104.948 1747.92,104.809 1751.39,104.636 1754.17,104.498 1757.64,104.327 
  1760.41,104.191 1763.89,104.022 1766.66,103.887 1770.14,103.72 1772.91,103.587 1776.39,103.421 1779.16,103.29 1782.63,103.126 1785.41,102.996 1788.88,102.834 
  1791.66,102.706 1795.13,102.545 1797.91,102.418 1801.38,102.26 1804.16,102.134 1807.63,101.978 1810.4,101.853 1813.88,101.699 1816.65,101.576 1820.13,101.423 
  1822.9,101.301 1826.38,101.149 1829.15,101.029 1832.63,100.879 1835.4,100.76 1838.88,100.612 1841.65,100.495 1845.12,100.348 1847.9,100.232 1851.37,100.087 
  1854.15,99.9717 1857.62,99.8283 1860.4,99.7144 1863.87,99.5725 1866.65,99.4599 1870.12,99.3196 1872.9,99.2081 1876.37,99.0693 1879.15,98.959 1882.62,98.8217 
  1885.4,98.7126 1888.87,98.5767 1891.65,98.4688 1895.12,98.3344 1897.89,98.2276 1901.37,98.0946 1904.14,97.9889 1907.62,97.8573 1910.39,97.7528 1913.87,97.6225 
  1916.64,97.5191 1920.12,97.3902 1922.89,97.2879 1926.37,97.1604 1929.14,97.0591 1932.62,96.9329 1935.39,96.8327 1938.87,96.7078 1941.64,96.6086 1945.12,96.485 
  1947.89,96.3869 1951.37,96.2646 1954.14,96.1674 1957.62,96.0464 1960.39,95.9502 1963.87,95.8304 1966.64,95.7353 1970.12,95.6167 1972.89,95.5225 1976.37,95.4052 
  1979.14,95.3119 1982.62,95.1958 1985.39,95.1035 1988.87,94.9885 1991.64,94.8972 1995.12,94.7834 1997.89,94.6929 2001.37,94.5803 2004.14,94.4908 2007.62,94.3792 
  2010.39,94.2906 2013.87,94.1802 2016.64,94.0925 2020.12,93.9832 2022.89,93.8964 2026.37,93.7882 2029.14,93.7022 2032.62,93.5951 2035.39,93.51 2038.87,93.4039 
  2041.64,93.3196 2045.12,93.2146 2047.89,93.1312 2051.37,93.0272 2054.14,92.9446 2057.62,92.8417 2060.39,92.7599 2063.87,92.658 2066.64,92.577 2070.12,92.476 
  2072.89,92.3958 2076.37,92.2959 2079.14,92.2165 2082.62,92.1175 2085.39,92.0389 2088.87,91.9409 2091.64,91.863 2095.12,91.7659 2097.89,91.6888 2101.37,91.5927 
  2104.14,91.5163 2107.62,91.4211 2110.39,91.3455 2113.87,91.2512 2116.64,91.1763 2120.12,91.083 2122.89,91.0088 2126.37,90.9163 2129.14,90.8428 2132.62,90.7512 
  2135.39,90.6785 2138.87,90.5878 2141.64,90.5157 2145.12,90.4258 2147.89,90.3544 2151.37,90.2654 2154.14,90.1947 2157.62,90.1065 2160.39,90.0365 2163.87,89.9492 
  2166.64,89.8798 2170.12,89.7933 2172.9,89.7245 2176.37,89.6388 2179.15,89.5707 2182.62,89.4859 2185.4,89.4184 2188.87,89.3343 2191.65,89.2675 2195.12,89.1842 
  2197.9,89.1179 2201.37,89.0354 2204.15,88.9698 2207.62,88.888 2210.4,88.823 2213.87,88.742 2216.65,88.6776 2220.12,88.5974 2222.9,88.5336 2226.37,88.4541 
  2229.15,88.3909 2232.62,88.3121 2235.4,88.2494 2238.87,88.1714 2241.65,88.1093 2245.13,88.0319 2247.9,87.9704 2251.38,87.8938 2254.15,87.8329 2257.63,87.7569 
  2260.4,87.6965 2263.88,87.6213 2266.65,87.5614 2270.13,87.4868 2272.9,87.4275 2276.38,87.3536 2279.15,87.2949 2282.63,87.2216 2285.4,87.1634 2288.88,87.0908 
  2291.65,87.0331 2295.13,86.9612 2297.9,86.904 2301.38,86.8327 2304.16,86.776 2307.63,86.7053 2310.41,86.6492 2313.88,86.5791 2316.66,86.5235 2320.13,86.454 
  2322.91,86.3989 2326.38,86.3301 2329.16,86.2754 2332.63,86.2072 2335.41,86.153 2338.88,86.0854 2341.66,86.0317 2345.13,85.9647 2347.91,85.9114 2351.38,85.845 
  2352.76,85.8189 
  "/>
</svg>
