Peak time (h),y position
97.8,1
97.4,2
99.6,3
100,4
100.4,5
100.6,6
100.6,7
100.6,8
101.2,9
101.8,10
102.4,11
101.8,12
102,13
101.6,14
101.2,15
101.2,16
101.2,17
100.8,18
100.6,19
101.4,20
100.8,21
101.2,22
100.8,23
101.2,24
104.2,25
106.8,26
107.8,27
108.6,28
107.8,29
108.2,30
109,31
109.8,32
110.4,33
110.8,34
111,35
111.4,36
111.6,37
111.6,38
111.4,39
111.2,40
111,41
111.2,42
111.2,43
111.4,44
111.6,45
111.4,46
111.8,47
112,48
112,49
112,50
112.2,51
112.8,52
114.8,53
115.2,54
117.6,55
119.2,56
121,57
121.8,58
123.6,59
125,60
125,61
125,62
124.8,63
124.4,64
123.8,65
123,66
123.2,67
123.2,68
123.8,69
124.2,70
124.2,71
124.6,72
125.4,73
125.2,74
125.4,75
125.4,76
124.8,77
125,78
124.8,79
125.2,80
124.4,81
124.2,82
123.8,83
123.6,84
124.2,85
123.6,86
122.6,87
122.6,88
122.2,89
123,90
123,91
122.6,92
122.2,93
123.2,94
123.8,95
124,96
124,97
123.8,98
123.8,99
123.6,100
122.2,101
121.4,102
120,103
119.4,104
118.4,105
117.6,106
115.8,107
113.8,108
112.2,109
111.6,110
112.2,111
NaN,112
